harmony-commits mailing list archives

Site index · List index
Message view « Date » · « Thread »
Top « Date » · « Thread »
From Apache Harmony Build <nom...@hursley.ibm.com>
Subject [continuum] BUILD FAILURE: Classlib/win.ia32 Build/Test
Date Fri, 04 Aug 2006 12:04:47 GMT
Online report : http://ibmonly.hursley.ibm.com/continuum/win.ia32/servlet/continuum/target/ProjectBuild.vm/view/ProjectBuild/id/6/buildId/2056
Build statistics:
  State: Failed
  Previous State: Ok
  Started at: Fri, 4 Aug 2006 13:04:02 +0100
  Finished at: Fri, 4 Aug 2006 13:04:42 +0100
  Total time: 40s
  Build Trigger: Schedule
  Exit code: 1
  Building machine hostname: hy1
  Operating system : Windows XP(Service Pack 2)
  Java version : 1.5.0_06(Sun Microsystems Inc.)

Changes
                            classlib\depends\files\bootclasspath.properties
            classlib\make\depends.xml
            classlib\make\build-java.xml
            classlib\make\depends.properties
        
****************************************************************************
Output:
****************************************************************************
Buildfile: build.xml

build:
   [delete] Deleting directory C:\continuum-1.0.2\apps\continuum\working-directory\6\classlib\deploy
     [echo] Classlib revision is 428701
     [echo] Post process: ${is.post.process.host}
     [echo] JAPI: ${is.japi.ftp.host}
     [echo] Building with reference jdk/javac
     [exec] Buildfile: build.xml

     [exec] clean:

     [exec] clean-bin:

     [exec] call-modules-all:

     [exec] clean:
     [exec]    [delete] Excludesfile C:\continuum-1.0.2\apps\continuum\working-directory\6\classlib\deploy\build\patternsets\luni-kernel.txt
not found.
     [exec]    [delete] Deleting 15 files from C:\continuum-1.0.2\apps\continuum\working-directory\6\classlib\modules\accessibility\bin\test

     [exec] clean:
     [exec]    [delete] Excludesfile C:\continuum-1.0.2\apps\continuum\working-directory\6\classlib\deploy\build\patternsets\luni-kernel.txt
not found.

     [exec] clean:
     [exec]    [delete] Excludesfile C:\continuum-1.0.2\apps\continuum\working-directory\6\classlib\deploy\build\patternsets\luni-kernel.txt
not found.
     [exec]    [delete] Deleting 1 files from C:\continuum-1.0.2\apps\continuum\working-directory\6\classlib\modules\applet\bin\test

     [exec] clean:
     [exec]    [delete] Excludesfile C:\continuum-1.0.2\apps\continuum\working-directory\6\classlib\deploy\build\patternsets\luni-kernel.txt
not found.
     [exec]    [delete] Deleting 41 files from C:\continuum-1.0.2\apps\continuum\working-directory\6\classlib\modules\archive\bin\test

     [exec] clean.native.includes:
     [exec]    [delete] C:\continuum-1.0.2\apps\continuum\working-directory\6\classlib\deploy\include
not found.

     [exec] clean:
     [exec]    [delete] Excludesfile C:\continuum-1.0.2\apps\continuum\working-directory\6\classlib\deploy\build\patternsets\luni-kernel.txt
not found.
     [exec]    [delete] Deleting 208 files from C:\continuum-1.0.2\apps\continuum\working-directory\6\classlib\modules\auth\bin\test

     [exec] clean:
     [exec]    [delete] Excludesfile C:\continuum-1.0.2\apps\continuum\working-directory\6\classlib\deploy\build\patternsets\luni-kernel.txt
not found.
     [exec]    [delete] Deleting 560 files from C:\continuum-1.0.2\apps\continuum\working-directory\6\classlib\modules\awt\bin\test

     [exec] clean:
     [exec]    [delete] Excludesfile C:\continuum-1.0.2\apps\continuum\working-directory\6\classlib\deploy\build\patternsets\luni-kernel.txt
not found.
     [exec]    [delete] Deleting 226 files from C:\continuum-1.0.2\apps\continuum\working-directory\6\classlib\modules\beans\bin\test

     [exec] clean:
     [exec]    [delete] Excludesfile C:\continuum-1.0.2\apps\continuum\working-directory\6\classlib\deploy\build\patternsets\luni-kernel.txt
not found.
     [exec]    [delete] Deleting 87 files from C:\continuum-1.0.2\apps\continuum\working-directory\6\classlib\modules\crypto\bin\test

     [exec] clean:
     [exec]    [delete] Excludesfile C:\continuum-1.0.2\apps\continuum\working-directory\6\classlib\deploy\build\patternsets\luni-kernel.txt
not found.

     [exec] clean:
     [exec]    [delete] Excludesfile C:\continuum-1.0.2\apps\continuum\working-directory\6\classlib\deploy\build\patternsets\luni-kernel.txt
not found.
     [exec]    [delete] Deleting 162 files from C:\continuum-1.0.2\apps\continuum\working-directory\6\classlib\modules\jndi\bin\test

     [exec] clean:
     [exec]    [delete] Excludesfile C:\continuum-1.0.2\apps\continuum\working-directory\6\classlib\deploy\build\patternsets\luni-kernel.txt
not found.
     [exec]    [delete] Deleting 100 files from C:\continuum-1.0.2\apps\continuum\working-directory\6\classlib\modules\logging\bin\test

     [exec] clean:

     [exec] clean:
     [exec]    [delete] Excludesfile C:\continuum-1.0.2\apps\continuum\working-directory\6\classlib\deploy\build\patternsets\luni-kernel.txt
not found.
     [exec]    [delete] Deleting 603 files from C:\continuum-1.0.2\apps\continuum\working-directory\6\classlib\modules\luni\bin\test

     [exec] clean.native.includes:
     [exec]    [delete] C:\continuum-1.0.2\apps\continuum\working-directory\6\classlib\deploy\include
not found.
     [exec]    [delete] C:\continuum-1.0.2\apps\continuum\working-directory\6\classlib\deploy\jdk\include
not found.

     [exec] clean:
     [exec]    [delete] Excludesfile C:\continuum-1.0.2\apps\continuum\working-directory\6\classlib\deploy\build\patternsets\luni-kernel.txt
not found.
     [exec]    [delete] Deleting 24 files from C:\continuum-1.0.2\apps\continuum\working-directory\6\classlib\modules\math\bin\test

     [exec] clean:
     [exec]    [delete] Excludesfile C:\continuum-1.0.2\apps\continuum\working-directory\6\classlib\deploy\build\patternsets\luni-kernel.txt
not found.

     [exec] clean:
     [exec]    [delete] Excludesfile C:\continuum-1.0.2\apps\continuum\working-directory\6\classlib\deploy\build\patternsets\luni-kernel.txt
not found.
     [exec]    [delete] Deleting 159 files from C:\continuum-1.0.2\apps\continuum\working-directory\6\classlib\modules\nio\bin\test
     [exec]    [delete] Deleted 14 directories from C:\continuum-1.0.2\apps\continuum\working-directory\6\classlib\modules\nio\bin\test

     [exec] clean:
     [exec]    [delete] Excludesfile C:\continuum-1.0.2\apps\continuum\working-directory\6\classlib\deploy\build\patternsets\luni-kernel.txt
not found.
     [exec]    [delete] Deleting 75 files from C:\continuum-1.0.2\apps\continuum\working-directory\6\classlib\modules\nio_char\bin\test

     [exec] clean:
     [exec]    [delete] Excludesfile C:\continuum-1.0.2\apps\continuum\working-directory\6\classlib\deploy\build\patternsets\luni-kernel.txt
not found.
     [exec]    [delete] Deleting 33 files from C:\continuum-1.0.2\apps\continuum\working-directory\6\classlib\modules\prefs\bin\test

     [exec] clean:
     [exec]    [delete] Excludesfile C:\continuum-1.0.2\apps\continuum\working-directory\6\classlib\deploy\build\patternsets\luni-kernel.txt
not found.
     [exec]    [delete] Deleting 12 files from C:\continuum-1.0.2\apps\continuum\working-directory\6\classlib\modules\regex\bin\test

     [exec] clean:

     [exec] clean:
     [exec]    [delete] Excludesfile C:\continuum-1.0.2\apps\continuum\working-directory\6\classlib\deploy\build\patternsets\luni-kernel.txt
not found.
     [exec]    [delete] Deleting 513 files from C:\continuum-1.0.2\apps\continuum\working-directory\6\classlib\modules\security\bin\test

     [exec] clean:
     [exec]    [delete] Excludesfile C:\continuum-1.0.2\apps\continuum\working-directory\6\classlib\deploy\build\patternsets\luni-kernel.txt
not found.
     [exec]    [delete] Deleting 16 files from C:\continuum-1.0.2\apps\continuum\working-directory\6\classlib\modules\sound\bin\test

     [exec] clean:
     [exec]    [delete] Excludesfile C:\continuum-1.0.2\apps\continuum\working-directory\6\classlib\deploy\build\patternsets\luni-kernel.txt
not found.
     [exec]    [delete] Deleting 73 files from C:\continuum-1.0.2\apps\continuum\working-directory\6\classlib\modules\sql\bin\test

     [exec] clean:
     [exec]    [delete] Excludesfile C:\continuum-1.0.2\apps\continuum\working-directory\6\classlib\deploy\build\patternsets\luni-kernel.txt
not found.
     [exec]    [delete] Deleting 1502 files from C:\continuum-1.0.2\apps\continuum\working-directory\6\classlib\modules\swing\bin\test

     [exec] clean:
     [exec]    [delete] Excludesfile C:\continuum-1.0.2\apps\continuum\working-directory\6\classlib\deploy\build\patternsets\luni-kernel.txt
not found.
     [exec]    [delete] Deleting 31 files from C:\continuum-1.0.2\apps\continuum\working-directory\6\classlib\modules\text\bin\test

     [exec] clean:
     [exec]    [delete] Excludesfile C:\continuum-1.0.2\apps\continuum\working-directory\6\classlib\deploy\build\patternsets\luni-kernel.txt
not found.
     [exec]    [delete] Deleting 1 files from C:\continuum-1.0.2\apps\continuum\working-directory\6\classlib\modules\tools\bin\test

     [exec] clean:
     [exec]    [delete] Excludesfile C:\continuum-1.0.2\apps\continuum\working-directory\6\classlib\deploy\build\patternsets\luni-kernel.txt
not found.
     [exec]    [delete] Deleting 35 files from C:\continuum-1.0.2\apps\continuum\working-directory\6\classlib\modules\x-net\bin\test

     [exec] clean:
     [exec]    [delete] Excludesfile C:\continuum-1.0.2\apps\continuum\working-directory\6\classlib\deploy\build\patternsets\luni-kernel.txt
not found.
     [exec]    [delete] Deleting 22 files from C:\continuum-1.0.2\apps\continuum\working-directory\6\classlib\modules\rmi\bin\test

     [exec] call-modules-one:

     [exec] clean-kernel-patternsets:
     [exec]    [delete] Deleting 5089 files from C:\continuum-1.0.2\apps\continuum\working-directory\6\classlib\build\classes
     [exec]    [delete] Deleted 194 directories from C:\continuum-1.0.2\apps\continuum\working-directory\6\classlib\build\classes

     [exec] clean-layout:
     [exec]    [delete] C:\continuum-1.0.2\apps\continuum\working-directory\6\classlib\deploy\jdk
not found.

     [exec] clean:

     [exec] copy-makefile-includes:
     [exec]     [mkdir] Created dir: C:\continuum-1.0.2\apps\continuum\working-directory\6\classlib\deploy\build\make
     [exec]      [copy] Copying 4 files to C:\continuum-1.0.2\apps\continuum\working-directory\6\classlib\deploy\build\make

     [exec] -make-clean:

     [exec] clean.native:

     [exec]      [exec] Microsoft (R) Program Maintenance Utility Version 7.10.3077
     [exec]      [exec] Copyright (C) Microsoft Corporation.  All rights reserved.

     [exec]      [exec] 	del ..\shared\auth_copyright.obj authwin32.obj *.res *.pdb  C:\continuum-1.0.2\apps\continuum\working-directory\6\classlib\deploy\lib\hyauth.lib
C:\continuum-1.0.2\apps\continuum\working-directory\6\classlib\deploy\lib\hyauth.exp  ..\hyauth.dll
..\hyauth.pdb ..\hyauth.map    >nul 2>&1

     [exec] clean.native:

     [exec]      [exec] Microsoft (R) Program Maintenance Utility Version 7.10.3077
     [exec]      [exec] Copyright (C) Microsoft Corporation.  All rights reserved.

     [exec]      [exec] 	del ..\shared\zcpool.obj ..\shared\zipalloc.obj  ..\shared\zipcache.obj
..\shared\zipsup.obj *.res *.pdb  C:\continuum-1.0.2\apps\continuum\working-directory\6\classlib\deploy\lib\hyzip.lib
C:\continuum-1.0.2\apps\continuum\working-directory\6\classlib\deploy\lib\hyzip.exp      
 >nul 2>&1

     [exec]      [exec] Microsoft (R) Program Maintenance Utility Version 7.10.3077
     [exec]      [exec] Copyright (C) Microsoft Corporation.  All rights reserved.

     [exec]      [exec] 	del ..\shared\zlib_copyright.obj ..\..\zlib_dist\adler32.obj ..\..\zlib_dist\compress.obj
 ..\..\zlib_dist\crc32.obj ..\..\zlib_dist\deflate.obj ..\..\zlib_dist\gzio.obj ..\..\zlib_dist\infback.obj
 ..\..\zlib_dist\inffast.obj ..\..\zlib_dist\inflate.obj ..\..\zlib_dist\inftrees.obj ..\..\zlib_dist\trees.obj
 ..\..\zlib_dist\uncompr.obj ..\..\zlib_dist\zutil.obj *.res *.pdb  C:\continuum-1.0.2\apps\continuum\working-directory\6\classlib\deploy\lib\hyzlib.lib
C:\continuum-1.0.2\apps\continuum\working-directory\6\classlib\deploy\lib\hyzlib.exp  ..\hyzlib.dll
..\hyzlib.pdb ..\hyzlib.map    >nul 2>&1

     [exec]      [exec] Microsoft (R) Program Maintenance Utility Version 7.10.3077
     [exec]      [exec] Copyright (C) Microsoft Corporation.  All rights reserved.

     [exec]      [exec] 	del ..\shared\archive_copyright.obj ..\shared\jclcrc32.obj  ..\shared\zip.obj
..\shared\adler32.obj ..\shared\inflater.obj  ..\shared\jarfile.obj ..\shared\deflater.obj
 ..\shared\archiveglob.obj *.res *.pdb  C:\continuum-1.0.2\apps\continuum\working-directory\6\classlib\deploy\lib\hyarchive.lib
C:\continuum-1.0.2\apps\continuum\working-directory\6\classlib\deploy\lib\hyarchive.exp  ..\hyarchive.dll
..\hyarchive.pdb ..\hyarchive.map    >nul 2>&1

     [exec] clean.native:

     [exec]      [exec] Microsoft (R) Program Maintenance Utility Version 7.10.3077
     [exec]      [exec] Copyright (C) Microsoft Corporation.  All rights reserved.

     [exec]      [exec] 	del ..\shared\text_copyright.obj ..\shared\BidiWrapper.obj *.res
*.pdb  C:\continuum-1.0.2\apps\continuum\working-directory\6\classlib\deploy\lib\hytext.lib
C:\continuum-1.0.2\apps\continuum\working-directory\6\classlib\deploy\lib\hytext.exp  ..\hytext.dll
..\hytext.pdb ..\hytext.map    >nul 2>&1

     [exec] clean.native:

     [exec]      [exec] Microsoft (R) Program Maintenance Utility Version 7.10.3077
     [exec]      [exec] Copyright (C) Microsoft Corporation.  All rights reserved.

     [exec]      [exec] 	del prefs_copyright.obj PreferencesImpl.obj *.res *.pdb  C:\continuum-1.0.2\apps\continuum\working-directory\6\classlib\deploy\lib\hyprefs.lib
C:\continuum-1.0.2\apps\continuum\working-directory\6\classlib\deploy\lib\hyprefs.exp  ..\hyprefs.dll
..\hyprefs.pdb ..\hyprefs.map    >nul 2>&1

     [exec] clean.native:

     [exec]      [exec] Microsoft (R) Program Maintenance Utility Version 7.10.3077
     [exec]      [exec] Copyright (C) Microsoft Corporation.  All rights reserved.

     [exec]      [exec] 	del ..\shared\hysig_copyright.obj hysigwin.obj *.res *.pdb  C:\continuum-1.0.2\apps\continuum\working-directory\6\classlib\deploy\lib\hysig.lib
C:\continuum-1.0.2\apps\continuum\working-directory\6\classlib\deploy\lib\hysig.exp  ..\hysig.dll
..\hysig.pdb ..\hysig.map    >nul 2>&1

     [exec]      [exec] Microsoft (R) Program Maintenance Utility Version 7.10.3077
     [exec]      [exec] Copyright (C) Microsoft Corporation.  All rights reserved.

     [exec]      [exec] 	del ..\shared\libglob.obj ..\shared\iohelp.obj  ..\shared\exceptions.obj
 locklbl.obj lock386.obj  ..\shared\utf8decode.obj ..\shared\utf8encode.obj *.res *.pdb  C:\continuum-1.0.2\apps\continuum\working-directory\6\classlib\deploy\lib\hycommon.lib
C:\continuum-1.0.2\apps\continuum\working-directory\6\classlib\deploy\lib\hycommon.exp   
    >nul 2>&1

     [exec]      [exec] Microsoft (R) Program Maintenance Utility Version 7.10.3077
     [exec]      [exec] Copyright (C) Microsoft Corporation.  All rights reserved.

     [exec]      [exec] 	del ..\shared\pool.obj ..\shared\pool_cap.obj *.res *.pdb  C:\continuum-1.0.2\apps\continuum\working-directory\6\classlib\deploy\lib\hypool.lib
C:\continuum-1.0.2\apps\continuum\working-directory\6\classlib\deploy\lib\hypool.exp     
  >nul 2>&1

     [exec]      [exec] Microsoft (R) Program Maintenance Utility Version 7.10.3077
     [exec]      [exec] Copyright (C) Microsoft Corporation.  All rights reserved.

     [exec]      [exec] 	del ..\shared\thread_copyright.obj thrhelp.obj thrspinlock.obj hythread.obj
 ..\shared\hythreadinspect.obj ..\shared\rwmutex.obj thrdsup.obj  ..\shared\thrprof.obj *.res
*.pdb  C:\continuum-1.0.2\apps\continuum\working-directory\6\classlib\deploy\lib\hythr.lib
C:\continuum-1.0.2\apps\continuum\working-directory\6\classlib\deploy\lib\hythr.exp  ..\hythr.dll
..\hythr.pdb ..\hythr.map    >nul 2>&1

     [exec]      [exec] Microsoft (R) Program Maintenance Utility Version 7.10.3077
     [exec]      [exec] Copyright (C) Microsoft Corporation.  All rights reserved.

     [exec]      [exec] 	del ..\shared\port_copyright.obj hycpu.obj ..\shared\hyerror.obj
 hyerrorhelpers.obj ..\shared\hyexit.obj hyfile.obj hyfiletext.obj  ..\shared\hygp.obj hyipcmutex.obj
hymem.obj hymmap.obj  ..\shared\hynls.obj hynlshelpers.obj hyosdump.obj ..\shared\hyport.obj
 ..\shared\hyportcontrol.obj hyportptb.obj hyshmem.obj hyshsem.obj  hysignal.obj hysl.obj
hysock.obj ..\shared\hystr.obj  ..\shared\hystrftime.obj ..\shared\hystsl.obj hysysinfo.obj
hytime.obj  ..\shared\hytlshelpers.obj hytty.obj hyvmem.obj *.res *.pdb  C:\continuum-1.0.2\apps\continuum\working-directory\6\classlib\deploy\lib\hyprt.lib
C:\continuum-1.0.2\apps\continuum\working-directory\6\classlib\deploy\lib\hyprt.exp  ..\hyprt.dll
..\hyprt.pdb ..\hyprt.map    >nul 2>&1

     [exec]      [exec] Microsoft (R) Program Maintenance Utility Version 7.10.3077
     [exec]      [exec] Copyright (C) Microsoft Corporation.  All rights reserved.

     [exec]      [exec] 	del *.obj dist\*.obj
     [exec]      [exec] The system cannot find the file specified.
     [exec]      [exec] 	del C:\continuum-1.0.2\apps\continuum\working-directory\6\classlib\deploy\lib\hyfdlibm.lib
     [exec]      [exec] The system cannot find the file specified.
     [exec]      [exec] 	del C:\continuum-1.0.2\apps\continuum\working-directory\6\classlib\deploy\lib\hyfdlibm.pdb
     [exec]      [exec] The system cannot find the file specified.

     [exec]      [exec] Microsoft (R) Program Maintenance Utility Version 7.10.3077
     [exec]      [exec] Copyright (C) Microsoft Corporation.  All rights reserved.

     [exec]      [exec] 	del ..\shared\vmi_copyright.obj ..\shared\vmi.obj *.res *.pdb  C:\continuum-1.0.2\apps\continuum\working-directory\6\classlib\deploy\lib\vmi.lib
C:\continuum-1.0.2\apps\continuum\working-directory\6\classlib\deploy\lib\vmi.exp        >nul
2>&1

     [exec]      [exec] Microsoft (R) Program Maintenance Utility Version 7.10.3077
     [exec]      [exec] Copyright (C) Microsoft Corporation.  All rights reserved.

     [exec]      [exec] 	del ..\shared\luni_copyright.obj ..\shared\file.obj procimpl.obj
 ..\shared\oos.obj  ..\shared\nethelp.obj ..\shared\floatbits.obj  ..\shared\ois.obj helpers.obj
..\shared\math.obj  ..\shared\luniglob.obj ..\shared\proxy.obj ..\shared\netif.obj  ..\shared\cbigint.obj
..\shared\dblparse.obj ..\shared\fltparse.obj  ..\shared\process.obj ..\shared\bigint.obj
..\shared\osc.obj  ..\shared\socket.obj ..\shared\inetadds.obj  ..\shared\filedesc.obj ..\shared\timezone.obj
 OSFileSystemWin32.obj  ..\shared\OSFileSystem.obj OSMemoryWin32.obj OSMemory.obj  ..\shared\OSNetworkSystem.obj
OSNetworkSystemWin32.obj *.res *.pdb  C:\continuum-1.0.2\apps\continuum\working-directory\6\classlib\deploy\lib\hyluni.lib
C:\continuum-1.0.2\apps\continuum\working-directory\6\classlib\deploy\lib\hyluni.exp  ..\hyluni.dll
..\hyluni.pdb ..\hyluni.map    >nul 2>&1

     [exec]      [exec] Microsoft (R) Program Maintenance Utility Version 7.10.3077
     [exec]      [exec] Copyright (C) Microsoft Corporation.  All rights reserved.

     [exec]      [exec] 	del ..\shared\vmls.obj *.res *.pdb  C:\continuum-1.0.2\apps\continuum\working-directory\6\classlib\deploy\lib\hyvmls.lib
C:\continuum-1.0.2\apps\continuum\working-directory\6\classlib\deploy\lib\hyvmls.exp     
  >nul 2>&1

     [exec]      [exec] Microsoft (R) Program Maintenance Utility Version 7.10.3077
     [exec]      [exec] Copyright (C) Microsoft Corporation.  All rights reserved.

     [exec]      [exec] 	nmake /NOLOGO -f makefile.javae clean
     [exec]      [exec] 	del ..\shared\launcher_copyright.obj ..\shared\cmain.obj  ..\shared\main.obj
..\shared\strbuf.obj ..\shared\libhlp.obj *.res *.pdb         ..\java.exe ..\java.pdb >nul
2>&1
     [exec]      [exec] 	nmake /NOLOGO -f makefile.javaw clean
     [exec]      [exec] 	del ..\shared\launcher_copyright.obj ..\shared\main.obj  winmain.obj
..\shared\strbuf.obj ..\shared\libhlp.obj *.res *.pdb         ..\javaw.exe ..\javaw.pdb >nul
2>&1

     [exec] clean.native:

     [exec]      [exec] Microsoft (R) Program Maintenance Utility Version 7.10.3077
     [exec]      [exec] Copyright (C) Microsoft Corporation.  All rights reserved.

     [exec]      [exec] 	del ..\shared\DirectBufferUtil.obj ..\shared\AddressUtil.obj *.res
*.pdb  C:\continuum-1.0.2\apps\continuum\working-directory\6\classlib\deploy\lib\hynio.lib
C:\continuum-1.0.2\apps\continuum\working-directory\6\classlib\deploy\lib\hynio.exp  ..\hynio.dll
..\hynio.pdb ..\hynio.map    >nul 2>&1

     [exec] clean.native:

     [exec]      [exec] Microsoft (R) Program Maintenance Utility Version 7.10.3077
     [exec]      [exec] Copyright (C) Microsoft Corporation.  All rights reserved.

     [exec]      [exec] 	del ..\shared\org_apache_harmony_misc_accessors_ArrayAccessorImpl.obj
 ..\shared\org_apache_harmony_misc_accessors_Malloc.obj  ..\shared\org_apache_harmony_misc_accessors_MemoryAccessorNativeImpl.obj
 ..\shared\org_apache_harmony_misc_accessors_ObjectAccessorImpl.obj  ..\shared\org_apache_harmony_misc_accessors_StringAccessorImpl.obj
*.res *.pdb  C:\continuum-1.0.2\apps\continuum\working-directory\6\classlib\deploy\lib\accessors.lib
C:\continuum-1.0.2\apps\continuum\working-directory\6\classlib\deploy\lib\accessors.exp  ..\accessors.dll
..\accessors.pdb ..\accessors.map    >nul 2>&1

     [exec] -clean.native.linux:

     [exec] -clean.native.windows:

     [exec]      [exec] Microsoft (R) Program Maintenance Utility Version 7.10.3077
     [exec]      [exec] Copyright (C) Microsoft Corporation.  All rights reserved.

     [exec]      [exec] 	del Callback.obj  org_apache_harmony_awt_nativebridge_windows_Win32.obj
*.res *.pdb  C:\continuum-1.0.2\apps\continuum\working-directory\6\classlib\deploy\lib\Win32Wrapper.lib
C:\continuum-1.0.2\apps\continuum\working-directory\6\classlib\deploy\lib\Win32Wrapper.exp
 ..\Win32Wrapper.dll ..\Win32Wrapper.pdb ..\Win32Wrapper.map    >nul 2>&1

     [exec]      [exec] Microsoft (R) Program Maintenance Utility Version 7.10.3077
     [exec]      [exec] Copyright (C) Microsoft Corporation.  All rights reserved.

     [exec]      [exec] 	del winFont.obj *.res *.pdb  C:\continuum-1.0.2\apps\continuum\working-directory\6\classlib\deploy\lib\fontlib.lib
C:\continuum-1.0.2\apps\continuum\working-directory\6\classlib\deploy\lib\fontlib.exp  ..\fontlib.dll
..\fontlib.pdb ..\fontlib.map    >nul 2>&1

     [exec] clean.native:

     [exec] clean.native:

     [exec]      [exec] Microsoft (R) Program Maintenance Utility Version 7.10.3077
     [exec]      [exec] Copyright (C) Microsoft Corporation.  All rights reserved.

     [exec]      [exec] 	del security_copyright.obj getWindowsRandom.obj *.res *.pdb  C:\continuum-1.0.2\apps\continuum\working-directory\6\classlib\deploy\lib\hysecurity.lib
C:\continuum-1.0.2\apps\continuum\working-directory\6\classlib\deploy\lib\hysecurity.exp 
..\hysecurity.dll ..\hysecurity.pdb ..\hysecurity.map    >nul 2>&1

     [exec] clean-makefile-includes:
     [exec]    [delete] Deleting directory C:\continuum-1.0.2\apps\continuum\working-directory\6\classlib\deploy\build\make

     [exec] make-clean:

     [exec] clean-includes:

     [exec] clean.native.includes:
     [exec]    [delete] C:\continuum-1.0.2\apps\continuum\working-directory\6\classlib\deploy\include
not found.

     [exec] clean.native.includes:
     [exec]    [delete] C:\continuum-1.0.2\apps\continuum\working-directory\6\classlib\deploy\include
not found.
     [exec]    [delete] C:\continuum-1.0.2\apps\continuum\working-directory\6\classlib\deploy\jdk\include
not found.

     [exec] clean-overlay-oss:

     [exec] clean-overlay-oss:
     [exec]    [delete] Deleting directory C:\continuum-1.0.2\apps\continuum\working-directory\6\classlib\modules\luni\src\main\native\fdlibm_dist

     [exec] clean-overlay-oss:
     [exec]    [delete] Deleting directory C:\continuum-1.0.2\apps\continuum\working-directory\6\classlib\modules\archive\src\main\native\zlib_dist

     [exec] clean-overlay-oss:
     [exec]    [delete] Deleting directory C:\continuum-1.0.2\apps\continuum\working-directory\6\classlib\modules\text\src\main\native\icu4c

     [exec] clean-layout:
     [exec]    [delete] C:\continuum-1.0.2\apps\continuum\working-directory\6\classlib\deploy\jdk
not found.

     [exec] clean:

     [exec] build:
     [exec]      [echo] 
     [exec]      [echo] ========================================
     [exec]      [echo] Building Java component archives...
     [exec]      [echo] ========================================

     [exec] copy-kernel-patternsets:
     [exec]     [mkdir] Created dir: C:\continuum-1.0.2\apps\continuum\working-directory\6\classlib\deploy\build\patternsets
     [exec]      [copy] Copying 1 file to C:\continuum-1.0.2\apps\continuum\working-directory\6\classlib\deploy\build\patternsets
     [exec]      [copy] Copying 1 file to C:\continuum-1.0.2\apps\continuum\working-directory\6\classlib\deploy\build\patternsets

     [exec] prepare-depends:

     [exec] check:
     [exec]      [echo] Checking for depends/jars/yoko/yoko.jar

     [exec] BUILD FAILED
     [exec] C:\continuum-1.0.2\apps\continuum\working-directory\6\classlib\build.xml:88: The
following error occurred while executing this line:
     [exec] C:\continuum-1.0.2\apps\continuum\working-directory\6\classlib\make\build-java.xml:218:
The following error occurred while executing this line:
     [exec] C:\continuum-1.0.2\apps\continuum\working-directory\6\classlib\make\depends.xml:33:
The following error occurred while executing this line:
     [exec] C:\continuum-1.0.2\apps\continuum\working-directory\6\classlib\make\depends.xml:164:
...

     [exec] Missing dependency.  The jar from:

     [exec]   http://issues.apache.org/jira/secure/attachment/12338056/yoko.jar

     [exec] should be downloaded to:

     [exec]   depends/jars/yoko/yoko.jar

     [exec] Run "ant fetch-depends" to automatically fetch dependencies.
     [exec] Note: Some of Harmony's dependencies are licensed under terms other
     [exec] than the Apache License v2.

     [exec] Total time: 26 seconds

copy-depends:
     [echo] Copying VME to C:\continuum-1.0.2\apps\continuum\working-directory\6/classlib/deploy/jdk/jre
     [copy] Copying 44 files to C:\continuum-1.0.2\apps\continuum\working-directory\6\classlib\deploy\jdk\jre\bin\default

run-tests:
     [exec] Buildfile: build.xml

     [exec] test:
     [exec]      [echo] 
     [exec]      [echo] ========================================
     [exec]      [echo] Testing class libraries...
     [exec]      [echo] ========================================

     [exec] clean:
     [exec]    [delete] Deleting directory C:\continuum-1.0.2\apps\continuum\working-directory\6\classlib\build\test_report
     [exec]    [delete] Deleting directory C:\continuum-1.0.2\apps\continuum\working-directory\6\classlib\build\tests
     [exec]    [delete] Deleting directory C:\continuum-1.0.2\apps\continuum\working-directory\6\classlib\build\test_support

     [exec] copy-test-resources:
     [exec]     [mkdir] Created dir: C:\continuum-1.0.2\apps\continuum\working-directory\6\classlib\build\test_support
     [exec]      [copy] Copying 54 files to C:\continuum-1.0.2\apps\continuum\working-directory\6\classlib\build\test_support

     [exec] check-support-jars:

     [exec] check:
     [exec]      [echo] Checking for depends/jars/yoko/yoko.jar

     [exec] BUILD FAILED
     [exec] C:\continuum-1.0.2\apps\continuum\working-directory\6\classlib\build.xml:107:
The following error occurred while executing this line:
     [exec] C:\continuum-1.0.2\apps\continuum\working-directory\6\classlib\make\build-test.xml:123:
The following error occurred while executing this line:
     [exec] C:\continuum-1.0.2\apps\continuum\working-directory\6\classlib\make\depends.xml:33:
The following error occurred while executing this line:
     [exec] C:\continuum-1.0.2\apps\continuum\working-directory\6\classlib\make\depends.xml:164:
...

     [exec] Missing dependency.  The jar from:

     [exec]   http://issues.apache.org/jira/secure/attachment/12338056/yoko.jar

     [exec] should be downloaded to:

     [exec]   depends/jars/yoko/yoko.jar

     [exec] Run "ant fetch-depends" to automatically fetch dependencies.
     [exec] Note: Some of Harmony's dependencies are licensed under terms other
     [exec] than the Apache License v2.

     [exec] Total time: 8 seconds
     [echo] Tests.failed is set to ${tests.failed}

check-class-load-lists:

japi:

publish:
    [mkdir] Created dir: C:\publish\20060804-1304
    [mkdir] Created dir: C:\publish\20060804-1304\test

BUILD FAILED
C:\continuum-1.0.2\apps\continuum\working-directory\6\build.xml:342: C:\continuum-1.0.2\apps\continuum\working-directory\6\classlib\build\test_report\html
not found.

Total time: 39 seconds

****************************************************************************




Mime
View raw message