harmony-commits mailing list archives

Site index · List index
Message view « Date » · « Thread »
Top « Date » · « Thread »
From Apache Harmony Build <nom...@hursley.ibm.com>
Subject [continuum] BUILD FAILURE: Classlib/linux.ia32 Build/Test
Date Wed, 05 Jul 2006 21:02:28 GMT
Online report : http://ibmonly.hursley.ibm.com/continuum/linux.ia32/servlet/continuum/target/ProjectBuild.vm/view/ProjectBuild/id/6/buildId/3532
Build statistics:
  State: Failed
  Previous State: Ok
  Started at: Wed, 5 Jul 2006 22:01:53 +0100
  Finished at: Wed, 5 Jul 2006 22:02:27 +0100
  Total time: 34s
  Build Trigger: Schedule
  Exit code: 1
  Building machine hostname: hy2
  Operating system : Linux(unknown)
  Java version : 1.5.0_06(Sun Microsystems Inc.)

Changes
                            classlib/depends/build/makefile.include
            classlib/depends/build/defines.mak
            classlib/modules/text/src/main/native/text/linux/makefile
            classlib/modules/text/src/main/native/text/windows/makefile
            classlib/modules/auth/src/main/native/auth/linux/makefile
            classlib/modules/auth/src/main/native/auth/windows/makefile
            classlib/modules/archive/src/main/native/zlib/linux/makefile
            classlib/modules/archive/src/main/native/zlib/windows/makefile
            classlib/modules/archive/src/main/native/archive/linux/makefile
            classlib/modules/archive/src/main/native/archive/windows/makefile
            classlib/modules/archive/src/main/native/zip/linux/makefile
            classlib/modules/archive/src/main/native/zip/windows/makefile
            classlib/modules/nio/src/main/native/nio/linux/makefile
            classlib/modules/nio/src/main/native/nio/windows/makefile
            classlib/modules/luni/src/main/native/launcher/linux/makefile
            classlib/modules/luni/src/main/native/launcher/windows/makefile.javae
            classlib/modules/luni/src/main/native/launcher/windows/makefile.javaw
            classlib/modules/luni/src/main/native/vmls/linux/makefile
            classlib/modules/luni/src/main/native/vmls/windows/makefile
            classlib/modules/luni/src/main/native/sig/linux/hysiglinux.c
            classlib/modules/luni/src/main/native/sig/linux/libhysig.exp
            classlib/modules/luni/src/main/native/sig/linux/hysigunix.c
            classlib/modules/luni/src/main/native/sig/linux/hysigunix.h
            classlib/modules/luni/src/main/native/sig/linux/makefile
            classlib/modules/luni/src/main/native/sig/shared/hysig_copyright.c
            classlib/modules/luni/src/main/native/sig/windows/hysig.def
            classlib/modules/luni/src/main/native/sig/windows/hysigwin.c
            classlib/modules/luni/src/main/native/sig/windows/hysig.rc
            classlib/modules/luni/src/main/native/sig/windows/makefile
            classlib/modules/luni/src/main/native/port/linux/hyipcmutex.c
            classlib/modules/luni/src/main/native/port/linux/hytime.c
            classlib/modules/luni/src/main/native/port/linux/hyportptb.h
            classlib/modules/luni/src/main/native/port/linux/hymmap.h
            classlib/modules/luni/src/main/native/port/linux/hyfpu.h
            classlib/modules/luni/src/main/native/port/linux/hysock.c
            classlib/modules/luni/src/main/native/port/linux/hyvmem.c
            classlib/modules/luni/src/main/native/port/linux/hysharedhelper.c
            classlib/modules/luni/src/main/native/port/linux/DoxygenSupport.txt
            classlib/modules/luni/src/main/native/port/linux/libhyprt.exp
            classlib/modules/luni/src/main/native/port/linux/hyosdump.c
            classlib/modules/luni/src/main/native/port/linux/hyshmem.c
            classlib/modules/luni/src/main/native/port/linux/hysharedhelper.h
            classlib/modules/luni/src/main/native/port/linux/hyerrorhelpers.c
            classlib/modules/luni/src/main/native/port/linux/hysignal.c
            classlib/modules/luni/src/main/native/port/linux/hymem.c
            classlib/modules/luni/src/main/native/port/linux/hyshmem.h
            classlib/modules/luni/src/main/native/port/linux/hysl.c
            classlib/modules/luni/src/main/native/port/linux/hynlshelpers.c
            classlib/modules/luni/src/main/native/port/linux/hyfile.c
            classlib/modules/luni/src/main/native/port/linux/hyshsem.c
            classlib/modules/luni/src/main/native/port/linux/hytty.c
            classlib/modules/luni/src/main/native/port/linux/hyfiletext.c
            classlib/modules/luni/src/main/native/port/linux/hyshsem.h
            classlib/modules/luni/src/main/native/port/linux/hycpu.c
            classlib/modules/luni/src/main/native/port/linux/hyportptb.c
            classlib/modules/luni/src/main/native/port/linux/hymmap.c
            classlib/modules/luni/src/main/native/port/linux/hysysinfo.c
            classlib/modules/luni/src/main/native/port/linux/makefile
            classlib/modules/luni/src/main/native/port/shared/portnls.h
            classlib/modules/luni/src/main/native/port/shared/hyport_de.nls
            classlib/modules/luni/src/main/native/port/shared/hyport_ja.nls
            classlib/modules/luni/src/main/native/port/shared/hyport_zh_TW.nls
            classlib/modules/luni/src/main/native/port/shared/port_copyright.c
            classlib/modules/luni/src/main/native/port/shared/ute_pd.h
            classlib/modules/luni/src/main/native/port/shared/hyport_fr.nls
            classlib/modules/luni/src/main/native/port/shared/hystdarg.h
            classlib/modules/luni/src/main/native/port/shared/hyport_pl.nls
            classlib/modules/luni/src/main/native/port/shared/hyerror.c
            classlib/modules/luni/src/main/native/port/shared/hyport_hu.nls
            classlib/modules/luni/src/main/native/port/shared/hystatic.h
            classlib/modules/luni/src/main/native/port/shared/hynls.c
            classlib/modules/luni/src/main/native/port/shared/hystrftime.c
            classlib/modules/luni/src/main/native/port/shared/hyport.nls
            classlib/modules/luni/src/main/native/port/shared/hyport_zh.nls
            classlib/modules/luni/src/main/native/port/shared/hyport_ca.nls
            classlib/modules/luni/src/main/native/port/shared/hyport_tr.nls
            classlib/modules/luni/src/main/native/port/shared/hyport_ru.nls
            classlib/modules/luni/src/main/native/port/shared/hygp.c
            classlib/modules/luni/src/main/native/port/shared/ute_module.h
            classlib/modules/luni/src/main/native/port/shared/hystr.c
            classlib/modules/luni/src/main/native/port/shared/hyexit.c
            classlib/modules/luni/src/main/native/port/shared/hygp.h
            classlib/modules/luni/src/main/native/port/shared/ut_hyprt.h
            classlib/modules/luni/src/main/native/port/shared/hyport_cs.nls
            classlib/modules/luni/src/main/native/port/shared/hyport_pt_BR.nls
            classlib/modules/luni/src/main/native/port/shared/hynlshelpers.h
            classlib/modules/luni/src/main/native/port/shared/hyport.c
            classlib/modules/luni/src/main/native/port/shared/hytlshelpers.c
            classlib/modules/luni/src/main/native/port/shared/hystsl.c
            classlib/modules/luni/src/main/native/port/shared/hyportcontrol.c
            classlib/modules/luni/src/main/native/port/shared/hyport_es.nls
            classlib/modules/luni/src/main/native/port/shared/hyport_ko.nls
            classlib/modules/luni/src/main/native/port/shared/portpriv.h
            classlib/modules/luni/src/main/native/port/shared/hyport_it.nls
            classlib/modules/luni/src/main/native/port/shared/hyport_sk.nls
            classlib/modules/luni/src/main/native/port/shared/hyport_sl.nls
            classlib/modules/luni/src/main/native/port/windows/hyfiletext.c
            classlib/modules/luni/src/main/native/port/windows/hyshsem.h
            classlib/modules/luni/src/main/native/port/windows/hyprt.rc
            classlib/modules/luni/src/main/native/port/windows/hycpu.c
            classlib/modules/luni/src/main/native/port/windows/hyportptb.c
            classlib/modules/luni/src/main/native/port/windows/hymmap.c
            classlib/modules/luni/src/main/native/port/windows/hysysinfo.c
            classlib/modules/luni/src/main/native/port/windows/makefile
            classlib/modules/luni/src/main/native/luni/linux/makefile
            classlib/modules/luni/src/main/native/luni/windows/makefile
            classlib/modules/luni/src/main/native/thread/linux/thrdsup.h
            classlib/modules/luni/src/main/native/thread/linux/libhythr.exp
            classlib/modules/luni/src/main/native/thread/linux/rasthrsup.h
            classlib/modules/luni/src/main/native/thread/linux/DoxygenSupport.txt
            classlib/modules/luni/src/main/native/thread/linux/hythread.c
            classlib/modules/luni/src/main/native/thread/linux/thrspinlock.s
            classlib/modules/luni/src/main/native/thread/linux/thrcreate.c
            classlib/modules/luni/src/main/native/thread/linux/priority.c
            classlib/modules/luni/src/main/native/thread/linux/thrhelp.s
            classlib/modules/luni/src/main/native/thread/linux/thrcreate.h
            classlib/modules/luni/src/main/native/thread/linux/priority.h
            classlib/modules/luni/src/main/native/thread/linux/linuxonexit.c
            classlib/modules/luni/src/main/native/thread/linux/thrtypes.h
            classlib/modules/luni/src/main/native/thread/linux/thrdsup.c
            classlib/modules/luni/src/main/native/thread/linux/rasthrsup.c
            classlib/modules/luni/src/main/native/thread/linux/linuxonexit.h
            classlib/modules/luni/src/main/native/thread/linux/makefile
            classlib/modules/luni/src/main/native/thread/shared/hythreadinspect.c
            classlib/modules/luni/src/main/native/thread/shared/thread_copyright.c
            classlib/modules/luni/src/main/native/thread/shared/hythreadinspect.h
            classlib/modules/luni/src/main/native/thread/shared/thrprof.c
            classlib/modules/luni/src/main/native/thread/shared/rwmutex.c
            classlib/modules/luni/src/main/native/thread/shared/threaddef.h
            classlib/modules/luni/src/main/native/thread/windows/thrdsup.h
            classlib/modules/luni/src/main/native/thread/windows/thrspinlock.asm
            classlib/modules/luni/src/main/native/thread/windows/hythr.rc
            classlib/modules/luni/src/main/native/thread/windows/rasthrsup.h
            classlib/modules/luni/src/main/native/thread/windows/thrhelp.asm
            classlib/modules/luni/src/main/native/thread/windows/DoxygenSupport.txt
            classlib/modules/luni/src/main/native/thread/windows/thrtypes.h
            classlib/modules/luni/src/main/native/thread/windows/hythread.c
            classlib/modules/luni/src/main/native/thread/windows/thrdsup.c
            classlib/modules/luni/src/main/native/thread/windows/hythr.def
            classlib/modules/luni/src/main/native/thread/windows/makefile
            classlib/modules/luni/src/main/native/common/linux/makefile
            classlib/modules/luni/src/main/native/common/shared/iohelp.c
            classlib/modules/luni/src/main/native/common/shared/jclglob.h
            classlib/modules/luni/src/main/native/common/shared/utf8encode.c
            classlib/modules/luni/src/main/native/common/shared/libglob.c
            classlib/modules/luni/src/main/native/common/shared/utf8decode.c
            classlib/modules/luni/src/main/native/common/windows/locklbl.asm
            classlib/modules/luni/src/main/native/common/windows/lock386.c
            classlib/modules/luni/src/main/native/common/windows/makefile
            classlib/modules/luni/src/main/native/pool/linux/DoxygenSupport.txt
            classlib/modules/luni/src/main/native/pool/linux/makefile
            classlib/modules/luni/src/main/native/pool/shared/pool.c
            classlib/modules/luni/src/main/native/pool/shared/pool_cap.c
            classlib/modules/luni/src/main/native/pool/windows/DoxygenSupport.txt
            classlib/modules/luni/src/main/native/pool/windows/makefile
            classlib/modules/luni/src/main/native/vmi/linux/makefile
            classlib/modules/luni/src/main/native/vmi/windows/makefile
            classlib/modules/luni/src/main/native/fdlibm/linux/makefile
            classlib/modules/luni/src/main/native/fdlibm/shared/s_lib_version.c
            classlib/modules/luni/src/main/native/fdlibm/windows/makefile
            classlib/modules/luni/build.xml
            classlib/make/build-native.xml
            classlib/build.xml
        
****************************************************************************
Output:
****************************************************************************
Buildfile: build.xml

build:
   [delete] Deleting directory /home/hybld/continuum-working-directory/6/classlib/deploy
     [echo] Classlib revision is 419340
     [echo] Post process: true
     [echo] JAPI: true
     [echo] Building with reference jdk/javac
     [exec] Buildfile: build.xml

     [exec] clean:

     [exec] clean-bin:

     [exec] call-modules-all:

     [exec] clean:
     [exec]    [delete] Excludesfile /home/hybld/continuum-working-directory/6/classlib/deploy/build/patternsets/luni-kernel.txt
not found.

     [exec] clean:
     [exec]    [delete] Excludesfile /home/hybld/continuum-working-directory/6/classlib/deploy/build/patternsets/luni-kernel.txt
not found.

     [exec] clean:
     [exec]    [delete] Excludesfile /home/hybld/continuum-working-directory/6/classlib/deploy/build/patternsets/luni-kernel.txt
not found.
     [exec]    [delete] Deleting 1 files from /home/hybld/continuum-working-directory/6/classlib/modules/applet/bin/test

     [exec] clean:
     [exec]    [delete] Excludesfile /home/hybld/continuum-working-directory/6/classlib/deploy/build/patternsets/luni-kernel.txt
not found.
     [exec]    [delete] Deleting 41 files from /home/hybld/continuum-working-directory/6/classlib/modules/archive/bin/test

     [exec] clean.native.includes:
     [exec]    [delete] /home/hybld/continuum-working-directory/6/classlib/deploy/include
not found.

     [exec] clean:
     [exec]    [delete] Excludesfile /home/hybld/continuum-working-directory/6/classlib/deploy/build/patternsets/luni-kernel.txt
not found.
     [exec]    [delete] Deleting 249 files from /home/hybld/continuum-working-directory/6/classlib/modules/auth/bin/test

     [exec] clean:
     [exec]    [delete] Excludesfile /home/hybld/continuum-working-directory/6/classlib/deploy/build/patternsets/luni-kernel.txt
not found.
     [exec]    [delete] Deleting 2 files from /home/hybld/continuum-working-directory/6/classlib/modules/awt/bin/test

     [exec] clean:
     [exec]    [delete] Excludesfile /home/hybld/continuum-working-directory/6/classlib/deploy/build/patternsets/luni-kernel.txt
not found.
     [exec]    [delete] Deleting 225 files from /home/hybld/continuum-working-directory/6/classlib/modules/beans/bin/test

     [exec] clean:
     [exec]    [delete] Excludesfile /home/hybld/continuum-working-directory/6/classlib/deploy/build/patternsets/luni-kernel.txt
not found.
     [exec]    [delete] Deleting 83 files from /home/hybld/continuum-working-directory/6/classlib/modules/crypto/bin/test

     [exec] clean:
     [exec]    [delete] Excludesfile /home/hybld/continuum-working-directory/6/classlib/deploy/build/patternsets/luni-kernel.txt
not found.
     [exec]    [delete] Deleting 162 files from /home/hybld/continuum-working-directory/6/classlib/modules/jndi/bin/test

     [exec] clean:
     [exec]    [delete] Excludesfile /home/hybld/continuum-working-directory/6/classlib/deploy/build/patternsets/luni-kernel.txt
not found.
     [exec]    [delete] Deleting 98 files from /home/hybld/continuum-working-directory/6/classlib/modules/logging/bin/test

     [exec] clean:

     [exec] clean:
     [exec]    [delete] Excludesfile /home/hybld/continuum-working-directory/6/classlib/deploy/build/patternsets/luni-kernel.txt
not found.
     [exec]    [delete] Deleting 585 files from /home/hybld/continuum-working-directory/6/classlib/modules/luni/bin/test

     [exec] clean.native.includes:
     [exec]    [delete] /home/hybld/continuum-working-directory/6/classlib/deploy/include
not found.
     [exec]    [delete] /home/hybld/continuum-working-directory/6/classlib/deploy/jdk/include
not found.

     [exec] clean:
     [exec]    [delete] Excludesfile /home/hybld/continuum-working-directory/6/classlib/deploy/build/patternsets/luni-kernel.txt
not found.
     [exec]    [delete] Deleting 24 files from /home/hybld/continuum-working-directory/6/classlib/modules/math/bin/test

     [exec] clean:
     [exec]    [delete] Excludesfile /home/hybld/continuum-working-directory/6/classlib/deploy/build/patternsets/luni-kernel.txt
not found.

     [exec] clean:
     [exec]    [delete] Excludesfile /home/hybld/continuum-working-directory/6/classlib/deploy/build/patternsets/luni-kernel.txt
not found.
     [exec]    [delete] Deleting 110 files from /home/hybld/continuum-working-directory/6/classlib/modules/nio/bin/test
     [exec]    [delete] Deleted 14 directories from /home/hybld/continuum-working-directory/6/classlib/modules/nio/bin/test

     [exec] clean:
     [exec]    [delete] Excludesfile /home/hybld/continuum-working-directory/6/classlib/deploy/build/patternsets/luni-kernel.txt
not found.
     [exec]    [delete] Deleting 75 files from /home/hybld/continuum-working-directory/6/classlib/modules/nio_char/bin/test

     [exec] clean:
     [exec]    [delete] Excludesfile /home/hybld/continuum-working-directory/6/classlib/deploy/build/patternsets/luni-kernel.txt
not found.
     [exec]    [delete] Deleting 33 files from /home/hybld/continuum-working-directory/6/classlib/modules/prefs/bin/test

     [exec] clean:
     [exec]    [delete] Excludesfile /home/hybld/continuum-working-directory/6/classlib/deploy/build/patternsets/luni-kernel.txt
not found.
     [exec]    [delete] Deleting 12 files from /home/hybld/continuum-working-directory/6/classlib/modules/regex/bin/test

     [exec] clean:

     [exec] clean:
     [exec]    [delete] Excludesfile /home/hybld/continuum-working-directory/6/classlib/deploy/build/patternsets/luni-kernel.txt
not found.
     [exec]    [delete] Deleting 513 files from /home/hybld/continuum-working-directory/6/classlib/modules/security/bin/test

     [exec] clean:
     [exec]    [delete] Excludesfile /home/hybld/continuum-working-directory/6/classlib/deploy/build/patternsets/luni-kernel.txt
not found.
     [exec]    [delete] Deleting 73 files from /home/hybld/continuum-working-directory/6/classlib/modules/sql/bin/test

     [exec] clean:
     [exec]    [delete] Excludesfile /home/hybld/continuum-working-directory/6/classlib/deploy/build/patternsets/luni-kernel.txt
not found.

     [exec] clean:
     [exec]    [delete] Excludesfile /home/hybld/continuum-working-directory/6/classlib/deploy/build/patternsets/luni-kernel.txt
not found.
     [exec]    [delete] Deleting 31 files from /home/hybld/continuum-working-directory/6/classlib/modules/text/bin/test

     [exec] clean:
     [exec]    [delete] Excludesfile /home/hybld/continuum-working-directory/6/classlib/deploy/build/patternsets/luni-kernel.txt
not found.
     [exec]    [delete] Deleting 1 files from /home/hybld/continuum-working-directory/6/classlib/modules/tools/bin/test

     [exec] clean:
     [exec]    [delete] Excludesfile /home/hybld/continuum-working-directory/6/classlib/deploy/build/patternsets/luni-kernel.txt
not found.
     [exec]    [delete] Deleting 49 files from /home/hybld/continuum-working-directory/6/classlib/modules/x-net/bin/test

     [exec] clean:
     [exec]    [delete] Excludesfile /home/hybld/continuum-working-directory/6/classlib/deploy/build/patternsets/luni-kernel.txt
not found.
     [exec]    [delete] Deleting 22 files from /home/hybld/continuum-working-directory/6/classlib/modules/rmi/bin/test

     [exec] call-modules-one:

     [exec] clean-kernel-patternsets:
     [exec]    [delete] Deleting 4704 files from /home/hybld/continuum-working-directory/6/classlib/build/classes
     [exec]    [delete] Deleted 177 directories from /home/hybld/continuum-working-directory/6/classlib/build/classes

     [exec] clean-layout:
     [exec]    [delete] /home/hybld/continuum-working-directory/6/classlib/deploy/jdk not
found.

     [exec] clean:

     [exec] init:

     [exec] windows-properties:

     [exec] linux-properties:

     [exec] properties:

     [exec] make-clean:

     [exec] init:

     [exec] windows-properties:

     [exec] linux-properties:

     [exec] properties:

     [exec] copy-makefile-includes:
     [exec]     [mkdir] Created dir: /home/hybld/continuum-working-directory/6/classlib/deploy/build/make
     [exec]      [copy] Copying 4 files to /home/hybld/continuum-working-directory/6/classlib/deploy/build/make

     [exec] BUILD FAILED
     [exec] /home/hybld/continuum-working-directory/6/classlib/build.xml:130: The following
error occurred while executing this line:
     [exec] /home/hybld/continuum-working-directory/6/classlib/make/build-native.xml:129:
The directory you specified does not exist

     [exec] Total time: 25 seconds

BUILD FAILED
/home/hybld/continuum-working-directory/6/build.xml:118: exec returned: 1

Total time: 30 seconds

****************************************************************************



Mime
View raw message