harmony-commits mailing list archives

Site index · List index
Message view « Date » · « Thread »
Top « Date » · « Thread »
From Apache Harmony Build <nom...@hursley.ibm.com>
Subject [continuum] BUILD FAILURE: Classlib/win.ia32 Build/Test
Date Wed, 05 Jul 2006 21:04:26 GMT
Online report : http://ibmonly.hursley.ibm.com/continuum/win.ia32/servlet/continuum/target/ProjectBuild.vm/view/ProjectBuild/id/6/buildId/1587
Build statistics:
  State: Failed
  Previous State: Ok
  Started at: Wed, 5 Jul 2006 22:03:46 +0100
  Finished at: Wed, 5 Jul 2006 22:04:22 +0100
  Total time: 35s
  Build Trigger: Schedule
  Exit code: 1
  Building machine hostname: hy1
  Operating system : Windows XP(Service Pack 2)
  Java version : 1.5.0_06(Sun Microsystems Inc.)

Changes
                            classlib\depends\build\makefile.include
            classlib\depends\build\defines.mak
            classlib\modules\text\src\main\native\text\linux\makefile
            classlib\modules\text\src\main\native\text\windows\makefile
            classlib\modules\auth\src\main\native\auth\linux\makefile
            classlib\modules\auth\src\main\native\auth\windows\makefile
            classlib\modules\archive\src\main\native\zlib\linux\makefile
            classlib\modules\archive\src\main\native\zlib\windows\makefile
            classlib\modules\archive\src\main\native\archive\linux\makefile
            classlib\modules\archive\src\main\native\archive\windows\makefile
            classlib\modules\archive\src\main\native\zip\linux\makefile
            classlib\modules\archive\src\main\native\zip\windows\makefile
            classlib\modules\nio\src\main\native\nio\linux\makefile
            classlib\modules\nio\src\main\native\nio\windows\makefile
            classlib\modules\luni\src\main\native\launcher\linux\makefile
            classlib\modules\luni\src\main\native\launcher\windows\makefile.javae
            classlib\modules\luni\src\main\native\launcher\windows\makefile.javaw
            classlib\modules\luni\src\main\native\vmls\linux\makefile
            classlib\modules\luni\src\main\native\vmls\windows\makefile
            classlib\modules\luni\src\main\native\sig\linux\hysiglinux.c
            classlib\modules\luni\src\main\native\sig\linux\libhysig.exp
            classlib\modules\luni\src\main\native\sig\linux\hysigunix.c
            classlib\modules\luni\src\main\native\sig\linux\hysigunix.h
            classlib\modules\luni\src\main\native\sig\linux\makefile
            classlib\modules\luni\src\main\native\sig\shared\hysig_copyright.c
            classlib\modules\luni\src\main\native\sig\windows\hysig.def
            classlib\modules\luni\src\main\native\sig\windows\hysigwin.c
            classlib\modules\luni\src\main\native\sig\windows\hysig.rc
            classlib\modules\luni\src\main\native\sig\windows\makefile
            classlib\modules\luni\src\main\native\port\linux\makefile
            classlib\modules\luni\src\main\native\port\shared\portnls.h
            classlib\modules\luni\src\main\native\port\shared\hyport_de.nls
            classlib\modules\luni\src\main\native\port\shared\hyport_ja.nls
            classlib\modules\luni\src\main\native\port\shared\hyport_zh_TW.nls
            classlib\modules\luni\src\main\native\port\shared\port_copyright.c
            classlib\modules\luni\src\main\native\port\shared\ute_pd.h
            classlib\modules\luni\src\main\native\port\shared\hyport_fr.nls
            classlib\modules\luni\src\main\native\port\shared\hystdarg.h
            classlib\modules\luni\src\main\native\port\shared\hyport_pl.nls
            classlib\modules\luni\src\main\native\port\shared\hyerror.c
            classlib\modules\luni\src\main\native\port\shared\hyport_hu.nls
            classlib\modules\luni\src\main\native\port\shared\hystatic.h
            classlib\modules\luni\src\main\native\port\shared\hynls.c
            classlib\modules\luni\src\main\native\port\shared\hystrftime.c
            classlib\modules\luni\src\main\native\port\shared\hyport.nls
            classlib\modules\luni\src\main\native\port\shared\hyport_zh.nls
            classlib\modules\luni\src\main\native\port\shared\hyport_ca.nls
            classlib\modules\luni\src\main\native\port\shared\hyport_tr.nls
            classlib\modules\luni\src\main\native\port\shared\hyport_ru.nls
            classlib\modules\luni\src\main\native\port\shared\hygp.c
            classlib\modules\luni\src\main\native\port\shared\ute_module.h
            classlib\modules\luni\src\main\native\port\shared\hystr.c
            classlib\modules\luni\src\main\native\port\shared\hyexit.c
            classlib\modules\luni\src\main\native\port\shared\hygp.h
            classlib\modules\luni\src\main\native\port\shared\ut_hyprt.h
            classlib\modules\luni\src\main\native\port\shared\hyport_cs.nls
            classlib\modules\luni\src\main\native\port\shared\hyport_pt_BR.nls
            classlib\modules\luni\src\main\native\port\shared\hynlshelpers.h
            classlib\modules\luni\src\main\native\port\shared\hyport.c
            classlib\modules\luni\src\main\native\port\shared\hytlshelpers.c
            classlib\modules\luni\src\main\native\port\shared\hystsl.c
            classlib\modules\luni\src\main\native\port\shared\hyportcontrol.c
            classlib\modules\luni\src\main\native\port\shared\hyport_es.nls
            classlib\modules\luni\src\main\native\port\shared\hyport_ko.nls
            classlib\modules\luni\src\main\native\port\shared\portpriv.h
            classlib\modules\luni\src\main\native\port\shared\hyport_it.nls
            classlib\modules\luni\src\main\native\port\shared\hyport_sk.nls
            classlib\modules\luni\src\main\native\port\shared\hyport_sl.nls
            classlib\modules\luni\src\main\native\port\windows\hyfiletext.c
            classlib\modules\luni\src\main\native\port\windows\hyshsem.h
            classlib\modules\luni\src\main\native\port\windows\hyprt.rc
            classlib\modules\luni\src\main\native\port\windows\hycpu.c
            classlib\modules\luni\src\main\native\port\windows\hyportptb.c
            classlib\modules\luni\src\main\native\port\windows\hymmap.c
            classlib\modules\luni\src\main\native\port\windows\hysysinfo.c
            classlib\modules\luni\src\main\native\port\windows\makefile
            classlib\modules\luni\src\main\native\luni\linux\makefile
            classlib\modules\luni\src\main\native\luni\windows\makefile
            classlib\modules\luni\src\main\native\thread\linux\thrdsup.h
            classlib\modules\luni\src\main\native\thread\linux\libhythr.exp
            classlib\modules\luni\src\main\native\thread\linux\rasthrsup.h
            classlib\modules\luni\src\main\native\thread\linux\DoxygenSupport.txt
            classlib\modules\luni\src\main\native\thread\linux\hythread.c
            classlib\modules\luni\src\main\native\thread\linux\thrspinlock.s
            classlib\modules\luni\src\main\native\thread\linux\thrcreate.c
            classlib\modules\luni\src\main\native\thread\linux\priority.c
            classlib\modules\luni\src\main\native\thread\linux\thrhelp.s
            classlib\modules\luni\src\main\native\thread\linux\thrcreate.h
            classlib\modules\luni\src\main\native\thread\linux\priority.h
            classlib\modules\luni\src\main\native\thread\linux\linuxonexit.c
            classlib\modules\luni\src\main\native\thread\linux\thrtypes.h
            classlib\modules\luni\src\main\native\thread\linux\thrdsup.c
            classlib\modules\luni\src\main\native\thread\linux\rasthrsup.c
            classlib\modules\luni\src\main\native\thread\linux\linuxonexit.h
            classlib\modules\luni\src\main\native\thread\linux\makefile
            classlib\modules\luni\src\main\native\thread\shared\hythreadinspect.c
            classlib\modules\luni\src\main\native\thread\shared\thread_copyright.c
            classlib\modules\luni\src\main\native\thread\shared\hythreadinspect.h
            classlib\modules\luni\src\main\native\thread\shared\thrprof.c
            classlib\modules\luni\src\main\native\thread\shared\rwmutex.c
            classlib\modules\luni\src\main\native\thread\shared\threaddef.h
            classlib\modules\luni\src\main\native\thread\windows\thrdsup.h
            classlib\modules\luni\src\main\native\thread\windows\thrspinlock.asm
            classlib\modules\luni\src\main\native\thread\windows\hythr.rc
            classlib\modules\luni\src\main\native\thread\windows\rasthrsup.h
            classlib\modules\luni\src\main\native\thread\windows\thrhelp.asm
            classlib\modules\luni\src\main\native\thread\windows\DoxygenSupport.txt
            classlib\modules\luni\src\main\native\thread\windows\thrtypes.h
            classlib\modules\luni\src\main\native\thread\windows\hythread.c
            classlib\modules\luni\src\main\native\thread\windows\thrdsup.c
            classlib\modules\luni\src\main\native\thread\windows\hythr.def
            classlib\modules\luni\src\main\native\thread\windows\makefile
            classlib\modules\luni\src\main\native\common\linux\makefile
            classlib\modules\luni\src\main\native\common\shared\iohelp.c
            classlib\modules\luni\src\main\native\common\shared\jclglob.h
            classlib\modules\luni\src\main\native\common\shared\utf8encode.c
            classlib\modules\luni\src\main\native\common\shared\libglob.c
            classlib\modules\luni\src\main\native\common\shared\utf8decode.c
            classlib\modules\luni\src\main\native\common\windows\locklbl.asm
            classlib\modules\luni\src\main\native\common\windows\lock386.c
            classlib\modules\luni\src\main\native\common\windows\makefile
            classlib\modules\luni\src\main\native\pool\linux\DoxygenSupport.txt
            classlib\modules\luni\src\main\native\pool\linux\makefile
            classlib\modules\luni\src\main\native\pool\shared\pool.c
            classlib\modules\luni\src\main\native\pool\shared\pool_cap.c
            classlib\modules\luni\src\main\native\pool\windows\DoxygenSupport.txt
            classlib\modules\luni\src\main\native\pool\windows\makefile
            classlib\modules\luni\src\main\native\vmi\linux\makefile
            classlib\modules\luni\src\main\native\vmi\windows\makefile
            classlib\modules\luni\src\main\native\fdlibm\linux\makefile
            classlib\modules\luni\src\main\native\fdlibm\shared\s_lib_version.c
            classlib\modules\luni\src\main\native\fdlibm\windows\makefile
            classlib\modules\luni\build.xml
            classlib\make\build-native.xml
            classlib\build.xml
        
****************************************************************************
Output:
****************************************************************************
Buildfile: build.xml

build:
   [delete] Deleting directory C:\continuum-1.0.2\apps\continuum\working-directory\6\classlib\deploy
     [echo] Classlib revision is 419341
     [echo] Post process: ${is.post.process.host}
     [echo] JAPI: ${is.japi.ftp.host}
     [echo] Building with reference jdk/javac
     [exec] Buildfile: build.xml

     [exec] clean:

     [exec] clean-bin:

     [exec] call-modules-all:

     [exec] clean:
     [exec]    [delete] Excludesfile C:\continuum-1.0.2\apps\continuum\working-directory\6\classlib\deploy\build\patternsets\luni-kernel.txt
not found.

     [exec] clean:
     [exec]    [delete] Excludesfile C:\continuum-1.0.2\apps\continuum\working-directory\6\classlib\deploy\build\patternsets\luni-kernel.txt
not found.

     [exec] clean:
     [exec]    [delete] Excludesfile C:\continuum-1.0.2\apps\continuum\working-directory\6\classlib\deploy\build\patternsets\luni-kernel.txt
not found.
     [exec]    [delete] Deleting 1 files from C:\continuum-1.0.2\apps\continuum\working-directory\6\classlib\modules\applet\bin\test

     [exec] clean:
     [exec]    [delete] Excludesfile C:\continuum-1.0.2\apps\continuum\working-directory\6\classlib\deploy\build\patternsets\luni-kernel.txt
not found.
     [exec]    [delete] Deleting 41 files from C:\continuum-1.0.2\apps\continuum\working-directory\6\classlib\modules\archive\bin\test

     [exec] clean.native.includes:
     [exec]    [delete] C:\continuum-1.0.2\apps\continuum\working-directory\6\classlib\deploy\include
not found.

     [exec] clean:
     [exec]    [delete] Excludesfile C:\continuum-1.0.2\apps\continuum\working-directory\6\classlib\deploy\build\patternsets\luni-kernel.txt
not found.
     [exec]    [delete] Deleting 249 files from C:\continuum-1.0.2\apps\continuum\working-directory\6\classlib\modules\auth\bin\test

     [exec] clean:
     [exec]    [delete] Excludesfile C:\continuum-1.0.2\apps\continuum\working-directory\6\classlib\deploy\build\patternsets\luni-kernel.txt
not found.
     [exec]    [delete] Deleting 2 files from C:\continuum-1.0.2\apps\continuum\working-directory\6\classlib\modules\awt\bin\test

     [exec] clean:
     [exec]    [delete] Excludesfile C:\continuum-1.0.2\apps\continuum\working-directory\6\classlib\deploy\build\patternsets\luni-kernel.txt
not found.
     [exec]    [delete] Deleting 225 files from C:\continuum-1.0.2\apps\continuum\working-directory\6\classlib\modules\beans\bin\test

     [exec] clean:
     [exec]    [delete] Excludesfile C:\continuum-1.0.2\apps\continuum\working-directory\6\classlib\deploy\build\patternsets\luni-kernel.txt
not found.
     [exec]    [delete] Deleting 83 files from C:\continuum-1.0.2\apps\continuum\working-directory\6\classlib\modules\crypto\bin\test

     [exec] clean:
     [exec]    [delete] Excludesfile C:\continuum-1.0.2\apps\continuum\working-directory\6\classlib\deploy\build\patternsets\luni-kernel.txt
not found.
     [exec]    [delete] Deleting 162 files from C:\continuum-1.0.2\apps\continuum\working-directory\6\classlib\modules\jndi\bin\test

     [exec] clean:
     [exec]    [delete] Excludesfile C:\continuum-1.0.2\apps\continuum\working-directory\6\classlib\deploy\build\patternsets\luni-kernel.txt
not found.
     [exec]    [delete] Deleting 98 files from C:\continuum-1.0.2\apps\continuum\working-directory\6\classlib\modules\logging\bin\test

     [exec] clean:

     [exec] clean:
     [exec]    [delete] Excludesfile C:\continuum-1.0.2\apps\continuum\working-directory\6\classlib\deploy\build\patternsets\luni-kernel.txt
not found.
     [exec]    [delete] Deleting 585 files from C:\continuum-1.0.2\apps\continuum\working-directory\6\classlib\modules\luni\bin\test

     [exec] clean.native.includes:
     [exec]    [delete] C:\continuum-1.0.2\apps\continuum\working-directory\6\classlib\deploy\include
not found.
     [exec]    [delete] C:\continuum-1.0.2\apps\continuum\working-directory\6\classlib\deploy\jdk\include
not found.

     [exec] clean:
     [exec]    [delete] Excludesfile C:\continuum-1.0.2\apps\continuum\working-directory\6\classlib\deploy\build\patternsets\luni-kernel.txt
not found.
     [exec]    [delete] Deleting 24 files from C:\continuum-1.0.2\apps\continuum\working-directory\6\classlib\modules\math\bin\test

     [exec] clean:
     [exec]    [delete] Excludesfile C:\continuum-1.0.2\apps\continuum\working-directory\6\classlib\deploy\build\patternsets\luni-kernel.txt
not found.

     [exec] clean:
     [exec]    [delete] Excludesfile C:\continuum-1.0.2\apps\continuum\working-directory\6\classlib\deploy\build\patternsets\luni-kernel.txt
not found.
     [exec]    [delete] Deleting 110 files from C:\continuum-1.0.2\apps\continuum\working-directory\6\classlib\modules\nio\bin\test
     [exec]    [delete] Deleted 14 directories from C:\continuum-1.0.2\apps\continuum\working-directory\6\classlib\modules\nio\bin\test

     [exec] clean:
     [exec]    [delete] Excludesfile C:\continuum-1.0.2\apps\continuum\working-directory\6\classlib\deploy\build\patternsets\luni-kernel.txt
not found.
     [exec]    [delete] Deleting 75 files from C:\continuum-1.0.2\apps\continuum\working-directory\6\classlib\modules\nio_char\bin\test

     [exec] clean:
     [exec]    [delete] Excludesfile C:\continuum-1.0.2\apps\continuum\working-directory\6\classlib\deploy\build\patternsets\luni-kernel.txt
not found.
     [exec]    [delete] Deleting 33 files from C:\continuum-1.0.2\apps\continuum\working-directory\6\classlib\modules\prefs\bin\test

     [exec] clean:
     [exec]    [delete] Excludesfile C:\continuum-1.0.2\apps\continuum\working-directory\6\classlib\deploy\build\patternsets\luni-kernel.txt
not found.
     [exec]    [delete] Deleting 12 files from C:\continuum-1.0.2\apps\continuum\working-directory\6\classlib\modules\regex\bin\test

     [exec] clean:

     [exec] clean:
     [exec]    [delete] Excludesfile C:\continuum-1.0.2\apps\continuum\working-directory\6\classlib\deploy\build\patternsets\luni-kernel.txt
not found.
     [exec]    [delete] Deleting 513 files from C:\continuum-1.0.2\apps\continuum\working-directory\6\classlib\modules\security\bin\test

     [exec] clean:
     [exec]    [delete] Excludesfile C:\continuum-1.0.2\apps\continuum\working-directory\6\classlib\deploy\build\patternsets\luni-kernel.txt
not found.
     [exec]    [delete] Deleting 73 files from C:\continuum-1.0.2\apps\continuum\working-directory\6\classlib\modules\sql\bin\test

     [exec] clean:
     [exec]    [delete] Excludesfile C:\continuum-1.0.2\apps\continuum\working-directory\6\classlib\deploy\build\patternsets\luni-kernel.txt
not found.

     [exec] clean:
     [exec]    [delete] Excludesfile C:\continuum-1.0.2\apps\continuum\working-directory\6\classlib\deploy\build\patternsets\luni-kernel.txt
not found.
     [exec]    [delete] Deleting 31 files from C:\continuum-1.0.2\apps\continuum\working-directory\6\classlib\modules\text\bin\test

     [exec] clean:
     [exec]    [delete] Excludesfile C:\continuum-1.0.2\apps\continuum\working-directory\6\classlib\deploy\build\patternsets\luni-kernel.txt
not found.
     [exec]    [delete] Deleting 1 files from C:\continuum-1.0.2\apps\continuum\working-directory\6\classlib\modules\tools\bin\test

     [exec] clean:
     [exec]    [delete] Excludesfile C:\continuum-1.0.2\apps\continuum\working-directory\6\classlib\deploy\build\patternsets\luni-kernel.txt
not found.
     [exec]    [delete] Deleting 49 files from C:\continuum-1.0.2\apps\continuum\working-directory\6\classlib\modules\x-net\bin\test

     [exec] clean:
     [exec]    [delete] Excludesfile C:\continuum-1.0.2\apps\continuum\working-directory\6\classlib\deploy\build\patternsets\luni-kernel.txt
not found.
     [exec]    [delete] Deleting 22 files from C:\continuum-1.0.2\apps\continuum\working-directory\6\classlib\modules\rmi\bin\test

     [exec] call-modules-one:

     [exec] clean-kernel-patternsets:
     [exec]    [delete] Deleting 4765 files from C:\continuum-1.0.2\apps\continuum\working-directory\6\classlib\build\classes
     [exec]    [delete] Deleted 179 directories from C:\continuum-1.0.2\apps\continuum\working-directory\6\classlib\build\classes

     [exec] clean-layout:
     [exec]    [delete] C:\continuum-1.0.2\apps\continuum\working-directory\6\classlib\deploy\jdk
not found.

     [exec] clean:

     [exec] init:

     [exec] windows-properties:

     [exec] linux-properties:

     [exec] properties:

     [exec] make-clean:

     [exec] init:

     [exec] windows-properties:

     [exec] linux-properties:

     [exec] properties:

     [exec] copy-makefile-includes:
     [exec]     [mkdir] Created dir: C:\continuum-1.0.2\apps\continuum\working-directory\6\classlib\deploy\build\make
     [exec]      [copy] Copying 4 files to C:\continuum-1.0.2\apps\continuum\working-directory\6\classlib\deploy\build\make

     [exec] BUILD FAILED
     [exec] C:\continuum-1.0.2\apps\continuum\working-directory\6\classlib\build.xml:130:
The following error occurred while executing this line:
     [exec] C:\continuum-1.0.2\apps\continuum\working-directory\6\classlib\make\build-native.xml:129:
The directory you specified does not exist

     [exec] Total time: 18 seconds

copy-depends:
     [echo] Copying VME to C:\continuum-1.0.2\apps\continuum\working-directory\6/classlib/deploy/jdk/jre
     [copy] Copying 44 files to C:\continuum-1.0.2\apps\continuum\working-directory\6\classlib\deploy\jdk\jre\bin\default

run-tests:
     [exec] Buildfile: build.xml

     [exec] test:
     [exec]      [echo] 
     [exec]      [echo] ========================================
     [exec]      [echo] Testing class libraries...
     [exec]      [echo] ========================================

     [exec] clean:
     [exec]    [delete] Deleting directory C:\continuum-1.0.2\apps\continuum\working-directory\6\classlib\build\test_report
     [exec]    [delete] Deleting directory C:\continuum-1.0.2\apps\continuum\working-directory\6\classlib\build\tests
     [exec]    [delete] Deleting directory C:\continuum-1.0.2\apps\continuum\working-directory\6\classlib\build\test_support

     [exec] copy-test-resources:
     [exec]     [mkdir] Created dir: C:\continuum-1.0.2\apps\continuum\working-directory\6\classlib\build\test_support
     [exec]      [copy] Copying 54 files to C:\continuum-1.0.2\apps\continuum\working-directory\6\classlib\build\test_support

     [exec] check-support-jars:

     [exec] check:
     [exec]      [echo] Checking for depends/jars/xalan-j_2.7.0/xalan.jar
     [exec]      [echo] Checking for depends/jars/xerces_2.8.0/resolver.jar
     [exec]      [echo] Checking for depends/jars/xerces_2.8.0/xercesImpl.jar
     [exec]      [echo] Checking for depends/jars/xerces_2.8.0/xml-apis.jar
     [exec]      [echo] Checking for depends/jars/junit_3.8.2/junit.jar
     [exec]      [echo] Checking for depends/jars/bcprov-jdk14-133/signed.bcprov.jar
     [exec]      [echo] Checking for depends/jars/icu4j_3.4.4/icu4j_3_4_4.jar
     [exec]      [echo] Checking for depends/jars/mx4j_3.0.1/mx4j.jar
     [exec]      [echo] Checking for depends/jars/mx4j_3.0.1/mx4j-remote.jar
     [exec]      [echo] Checking for depends/jars/ecj_3.2/ecj_3.2.jar

     [exec] create-unsigned-bcprov-jar:

     [exec] check-win:
     [exec]      [echo] Checking for depends/libs/win.IA32/msvcr71.dll

     [exec] compile-support:
     [exec]     [javac] Compiling 54 source files to C:\continuum-1.0.2\apps\continuum\working-directory\6\classlib\build\test_support

     [exec] BUILD FAILED
     [exec] C:\continuum-1.0.2\apps\continuum\working-directory\6\classlib\build.xml:109:
The following error occurred while executing this line:
     [exec] C:\continuum-1.0.2\apps\continuum\working-directory\6\classlib\make\build-test.xml:81:
C:\continuum-1.0.2\apps\continuum\working-directory\6\classlib\deploy\jdk\jre\lib\boot not
found.

     [exec] Total time: 8 seconds
     [echo] Tests.failed is set to ${tests.failed}

check-class-load-lists:

japi:

publish:
    [mkdir] Created dir: C:\publish\20060705-2203
    [mkdir] Created dir: C:\publish\20060705-2203\test

BUILD FAILED
C:\continuum-1.0.2\apps\continuum\working-directory\6\build.xml:342: C:\continuum-1.0.2\apps\continuum\working-directory\6\classlib\build\test_report\html
not found.

Total time: 34 seconds

****************************************************************************




Mime
View raw message