harmony-commits mailing list archives

Site index · List index
Message view « Date » · « Thread »
Top « Date » · « Thread »
From Apache Harmony Build <nom...@hursley.ibm.com>
Subject [continuum] BUILD FAILURE: Classlib/win.ia32 Build/Test
Date Sun, 25 Jun 2006 08:05:43 GMT
Online report : http://ibmonly.hursley.ibm.com/continuum/win.ia32/servlet/continuum/target/ProjectBuild.vm/view/ProjectBuild/id/6/buildId/1407
Build statistics:
  State: Failed
  Previous State: Failed
  Started at: Sun, 25 Jun 2006 09:05:07 +0100
  Finished at: Sun, 25 Jun 2006 09:05:40 +0100
  Total time: 32s
  Build Trigger: Schedule
  Exit code: 1
  Building machine hostname: hy1
  Operating system : Windows XP(Service Pack 2)
  Java version : 1.5.0_06(Sun Microsystems Inc.)

Changes
                            classlib\modules\prefs\src\main\native\prefs\windows\makefile
            classlib\native-src\win.IA32\vmls\makefile
            classlib\native-src\win.IA32\archive\makefile
            classlib\native-src\win.IA32\sig\makefile
            classlib\native-src\win.IA32\text\makefile
            classlib\native-src\win.IA32\port\makefile
            classlib\native-src\win.IA32\common\makefile
            classlib\native-src\win.IA32\vmi\makefile
            classlib\native-src\win.IA32\fdlibm\makefile
            classlib\native-src\win.IA32\zlib\makefile
            classlib\native-src\win.IA32\auth\makefile
            classlib\native-src\win.IA32\zip\makefile
            classlib\native-src\win.IA32\thread\makefile
            classlib\native-src\win.IA32\luni\makefile
            classlib\native-src\win.IA32\pool\makefile
            classlib\native-src\linux.IA32\vmls\makefile
            classlib\native-src\linux.IA32\archive\makefile
            classlib\native-src\linux.IA32\sig\makefile
            classlib\native-src\linux.IA32\text\makefile
            classlib\native-src\linux.IA32\port\makefile
            classlib\native-src\linux.IA32\common\makefile
            classlib\native-src\linux.IA32\vmi\makefile
            classlib\native-src\linux.IA32\fdlibm\makefile
            classlib\native-src\linux.IA32\zlib\makefile
            classlib\native-src\linux.IA32\launcher\makefile
            classlib\native-src\linux.IA32\auth\makefile
            classlib\native-src\linux.IA32\zip\makefile
            classlib\native-src\linux.IA32\thread\makefile
            classlib\native-src\linux.IA32\luni\makefile
            classlib\native-src\linux.IA32\pool\makefile
            classlib\native-src\build.xml
        
****************************************************************************
Output:
****************************************************************************
Buildfile: build.xml

build:
   [delete] Deleting directory C:\continuum-1.0.2\apps\continuum\working-directory\6\classlib\deploy
     [echo] Classlib revision is 416992
     [echo] Post process: ${is.post.process.host}
     [echo] JAPI: ${is.japi.ftp.host}
     [echo] Building with reference jdk/javac
     [exec] Buildfile: build.xml

     [exec] clean:

     [exec] clean-bin:

     [exec] call-modules-all:

     [exec] clean:
     [exec]    [delete] Deleting 27 files from C:\continuum-1.0.2\apps\continuum\working-directory\6\classlib\build

     [exec] clean:
     [exec]    [delete] Deleting 10 files from C:\continuum-1.0.2\apps\continuum\working-directory\6\classlib\build

     [exec] clean:
     [exec]    [delete] Deleting 1 files from C:\continuum-1.0.2\apps\continuum\working-directory\6\classlib\build
     [exec]    [delete] Deleting 1 files from C:\continuum-1.0.2\apps\continuum\working-directory\6\classlib\modules\applet\bin\test

     [exec] clean:
     [exec]    [delete] Deleting 44 files from C:\continuum-1.0.2\apps\continuum\working-directory\6\classlib\build
     [exec]    [delete] Deleting 40 files from C:\continuum-1.0.2\apps\continuum\working-directory\6\classlib\modules\archive\bin\test

     [exec] clean.native.includes:
     [exec]    [delete] C:\continuum-1.0.2\apps\continuum\working-directory\6\classlib\deploy\include
not found.

     [exec] clean:
     [exec]    [delete] Deleting 92 files from C:\continuum-1.0.2\apps\continuum\working-directory\6\classlib\build
     [exec]    [delete] Deleting 213 files from C:\continuum-1.0.2\apps\continuum\working-directory\6\classlib\modules\auth\bin\test

     [exec] clean:
     [exec]    [delete] Deleting 921 files from C:\continuum-1.0.2\apps\continuum\working-directory\6\classlib\build
     [exec]    [delete] Deleting 2 files from C:\continuum-1.0.2\apps\continuum\working-directory\6\classlib\modules\awt\bin\test

     [exec] clean:
     [exec]    [delete] Deleting 100 files from C:\continuum-1.0.2\apps\continuum\working-directory\6\classlib\build
     [exec]    [delete] Deleting 348 files from C:\continuum-1.0.2\apps\continuum\working-directory\6\classlib\modules\beans\bin\test

     [exec] clean:
     [exec]    [delete] Deleting 46 files from C:\continuum-1.0.2\apps\continuum\working-directory\6\classlib\build
     [exec]    [delete] Deleting 83 files from C:\continuum-1.0.2\apps\continuum\working-directory\6\classlib\modules\crypto\bin\test

     [exec] clean:
     [exec]    [delete] Deleting 131 files from C:\continuum-1.0.2\apps\continuum\working-directory\6\classlib\build
     [exec]    [delete] Deleting 162 files from C:\continuum-1.0.2\apps\continuum\working-directory\6\classlib\modules\jndi\bin\test

     [exec] clean:
     [exec]    [delete] Deleting 28 files from C:\continuum-1.0.2\apps\continuum\working-directory\6\classlib\build
     [exec]    [delete] Deleting 98 files from C:\continuum-1.0.2\apps\continuum\working-directory\6\classlib\modules\logging\bin\test

     [exec] clean:

     [exec] clean:
     [exec]    [delete] Deleting 934 files from C:\continuum-1.0.2\apps\continuum\working-directory\6\classlib\build
     [exec]    [delete] Deleting 715 files from C:\continuum-1.0.2\apps\continuum\working-directory\6\classlib\modules\luni\bin\test

     [exec] clean.native.includes:
     [exec]    [delete] C:\continuum-1.0.2\apps\continuum\working-directory\6\classlib\deploy\include
not found.
     [exec]    [delete] C:\continuum-1.0.2\apps\continuum\working-directory\6\classlib\deploy\jdk\include
not found.

     [exec] clean:
     [exec]    [delete] Deleting 4 files from C:\continuum-1.0.2\apps\continuum\working-directory\6\classlib\build
     [exec]    [delete] Deleting 24 files from C:\continuum-1.0.2\apps\continuum\working-directory\6\classlib\modules\math\bin\test

     [exec] clean:
     [exec]    [delete] Deleting 12 files from C:\continuum-1.0.2\apps\continuum\working-directory\6\classlib\build

     [exec] clean:
     [exec]    [delete] Deleting 128 files from C:\continuum-1.0.2\apps\continuum\working-directory\6\classlib\build
     [exec]    [delete] Deleted 3 directories from C:\continuum-1.0.2\apps\continuum\working-directory\6\classlib\build
     [exec]    [delete] Deleting 80 files from C:\continuum-1.0.2\apps\continuum\working-directory\6\classlib\modules\nio\bin\test
     [exec]    [delete] Deleted 14 directories from C:\continuum-1.0.2\apps\continuum\working-directory\6\classlib\modules\nio\bin\test

     [exec] clean:
     [exec]    [delete] Deleting 16 files from C:\continuum-1.0.2\apps\continuum\working-directory\6\classlib\build
     [exec]    [delete] Deleting 69 files from C:\continuum-1.0.2\apps\continuum\working-directory\6\classlib\modules\nio_char\bin\test

     [exec] clean:
     [exec]    [delete] Deleting 28 files from C:\continuum-1.0.2\apps\continuum\working-directory\6\classlib\build
     [exec]    [delete] Deleting 33 files from C:\continuum-1.0.2\apps\continuum\working-directory\6\classlib\modules\prefs\bin\test

     [exec] clean:
     [exec]    [delete] Deleting 120 files from C:\continuum-1.0.2\apps\continuum\working-directory\6\classlib\build
     [exec]    [delete] Deleting 12 files from C:\continuum-1.0.2\apps\continuum\working-directory\6\classlib\modules\regex\bin\test

     [exec] clean:

     [exec] clean:
     [exec]    [delete] Deleting 387 files from C:\continuum-1.0.2\apps\continuum\working-directory\6\classlib\build
     [exec]    [delete] Deleting 512 files from C:\continuum-1.0.2\apps\continuum\working-directory\6\classlib\modules\security\bin\test

     [exec] clean:
     [exec]    [delete] Deleting 50 files from C:\continuum-1.0.2\apps\continuum\working-directory\6\classlib\build
     [exec]    [delete] Deleting 73 files from C:\continuum-1.0.2\apps\continuum\working-directory\6\classlib\modules\sql\bin\test

     [exec] clean:
     [exec]    [delete] Deleting 1349 files from C:\continuum-1.0.2\apps\continuum\working-directory\6\classlib\build

     [exec] clean:
     [exec]    [delete] Deleting 38 files from C:\continuum-1.0.2\apps\continuum\working-directory\6\classlib\build
     [exec]    [delete] Deleting 31 files from C:\continuum-1.0.2\apps\continuum\working-directory\6\classlib\modules\text\bin\test

     [exec] clean:
     [exec]    [delete] Deleting 9 files from C:\continuum-1.0.2\apps\continuum\working-directory\6\classlib\build
     [exec]    [delete] Deleting 1 files from C:\continuum-1.0.2\apps\continuum\working-directory\6\classlib\modules\tools\bin\test

     [exec] clean:
     [exec]    [delete] Deleting 50 files from C:\continuum-1.0.2\apps\continuum\working-directory\6\classlib\build
     [exec]    [delete] Deleting 54 files from C:\continuum-1.0.2\apps\continuum\working-directory\6\classlib\modules\x-net\bin\test

     [exec] clean:
     [exec]    [delete] Deleting 201 files from C:\continuum-1.0.2\apps\continuum\working-directory\6\classlib\build
     [exec]    [delete] Deleting 22 files from C:\continuum-1.0.2\apps\continuum\working-directory\6\classlib\modules\rmi\bin\test

     [exec] call-modules-one:
     [exec]    [delete] Deleting 2488 files from C:\continuum-1.0.2\apps\continuum\working-directory\6\classlib\build
     [exec]    [delete] Deleted 369 directories from C:\continuum-1.0.2\apps\continuum\working-directory\6\classlib\build

     [exec] clean-layout:
     [exec]    [delete] C:\continuum-1.0.2\apps\continuum\working-directory\6\classlib\deploy\jdk
not found.

     [exec] clean:

     [exec] init:

     [exec] windows-properties:

     [exec] linux-properties:

     [exec] properties:

     [exec] make-clean:

     [exec] init:

     [exec] windows-properties:

     [exec] linux-properties:

     [exec] properties:

     [exec] copy-makefile-includes:
     [exec]     [mkdir] Created dir: C:\continuum-1.0.2\apps\continuum\working-directory\6\classlib\deploy\build\make
     [exec]      [copy] Copying 4 files to C:\continuum-1.0.2\apps\continuum\working-directory\6\classlib\deploy\build\make

     [exec]      [exec] Microsoft (R) Program Maintenance Utility Version 7.10.3077
     [exec]      [exec] Copyright (C) Microsoft Corporation.  All rights reserved.

     [exec]      [exec] 	cd auth
     [exec]      [exec] 	nmake /NOLOGO clean
     [exec]      [exec] 	del ..\..\shared\auth\auth_copyright.obj authwin32.obj *.res *.pdb
 C:\continuum-1.0.2\apps\continuum\working-directory\6\classlib\deploy\lib\hyauth.lib C:\continuum-1.0.2\apps\continuum\working-directory\6\classlib\deploy\lib\hyauth.exp
 ..\hyauth.dll ..\hyauth.pdb ..\hyauth.map    >nul 2>&1
     [exec]      [exec] 	cd ..
     [exec]      [exec] 	cd archive
     [exec]      [exec] 	nmake /NOLOGO clean
     [exec]      [exec] 	del ..\..\shared\archive\archive_copyright.obj ..\..\shared\archive\jclcrc32.obj
 ..\..\shared\archive\zip.obj ..\..\shared\archive\adler32.obj ..\..\shared\archive\inflater.obj
 ..\..\shared\archive\jarfile.obj ..\..\shared\archive\deflater.obj  ..\..\shared\archive\archiveglob.obj
*.res *.pdb  C:\continuum-1.0.2\apps\continuum\working-directory\6\classlib\deploy\lib\hyarchive.lib
C:\continuum-1.0.2\apps\continuum\working-directory\6\classlib\deploy\lib\hyarchive.exp  ..\hyarchive.dll
..\hyarchive.pdb ..\hyarchive.map    >nul 2>&1
     [exec]      [exec] 	cd ..
     [exec]      [exec] 	cd launcher
     [exec]      [exec] 	nmake /NOLOGO clean
     [exec]      [exec] 	nmake /NOLOGO -f makefile.javae clean
     [exec]      [exec] makefile.javae(19) : fatal error U1052: file 'C:\continuum-1.0.2\apps\continuum\working-directory\6\classlib\deploy\build\defines.mak'
not found
     [exec]      [exec] Stop.
     [exec]      [exec] NMAKE : fatal error U1077: '"C:\Program Files\Microsoft Visual Studio
.NET 2003\VC7\BIN\nmake.exe"' : return code '0x2'
     [exec]      [exec] Stop.
     [exec]      [exec] NMAKE : fatal error U1077: '"C:\Program Files\Microsoft Visual Studio
.NET 2003\VC7\BIN\nmake.exe"' : return code '0x2'
     [exec]      [exec] Stop.

     [exec] BUILD FAILED
     [exec] C:\continuum-1.0.2\apps\continuum\working-directory\6\classlib\build.xml:126:
The following error occurred while executing this line:
     [exec] C:\continuum-1.0.2\apps\continuum\working-directory\6\classlib\native-src\build.xml:136:
exec returned: 2

     [exec] Total time: 26 seconds

copy-depends:
     [echo] Copying VME to C:\continuum-1.0.2\apps\continuum\working-directory\6/classlib/deploy/jdk/jre
     [copy] Copying 44 files to C:\continuum-1.0.2\apps\continuum\working-directory\6\classlib\deploy\jdk\jre\bin\default

run-tests:
     [exec] Buildfile: build.xml

     [exec] test:
     [exec]      [echo] 
     [exec]      [echo] ========================================
     [exec]      [echo] Testing class libraries...
     [exec]      [echo] ========================================

     [exec] clean:

     [exec] copy-test-resources:
     [exec]     [mkdir] Created dir: C:\continuum-1.0.2\apps\continuum\working-directory\6\classlib\build\tests
     [exec]      [copy] Copying 64 files to C:\continuum-1.0.2\apps\continuum\working-directory\6\classlib\build\tests

     [exec] check-support-jars:

     [exec] check:
     [exec]      [echo] Checking for depends/jars/xalan-j_2.7.0/xalan.jar
     [exec]      [echo] Checking for depends/jars/xerces_2.8.0/resolver.jar
     [exec]      [echo] Checking for depends/jars/xerces_2.8.0/xercesImpl.jar
     [exec]      [echo] Checking for depends/jars/xerces_2.8.0/xml-apis.jar
     [exec]      [echo] Checking for depends/jars/junit_3.8.2/junit.jar
     [exec]      [echo] Checking for depends/jars/bcprov-jdk14-133/signed.bcprov.jar
     [exec]      [echo] Checking for depends/jars/icu4j_3.4.4/icu4j_3_4_4.jar
     [exec]      [echo] Checking for depends/jars/mx4j_3.0.1/mx4j.jar
     [exec]      [echo] Checking for depends/jars/mx4j_3.0.1/mx4j-remote.jar
     [exec]      [echo] Checking for depends/jars/ecj_3.2RC5/ecj_3.2RC5.jar

     [exec] create-unsigned-bcprov-jar:

     [exec] check-win:
     [exec]      [echo] Checking for depends/libs/win.IA32/msvcr71.dll

     [exec] compile-support:
     [exec]     [javac] Compiling 53 source files to C:\continuum-1.0.2\apps\continuum\working-directory\6\classlib\build\tests

     [exec] BUILD FAILED
     [exec] C:\continuum-1.0.2\apps\continuum\working-directory\6\classlib\build.xml:105:
The following error occurred while executing this line:
     [exec] C:\continuum-1.0.2\apps\continuum\working-directory\6\classlib\make\build-test.xml:70:
C:\continuum-1.0.2\apps\continuum\working-directory\6\classlib\deploy\jdk\jre\lib\boot not
found.

     [exec] Total time: 1 second
     [echo] Tests.failed is set to ${tests.failed}

check-class-load-lists:

japi:

publish:
    [mkdir] Created dir: C:\publish\20060625-0905
    [mkdir] Created dir: C:\publish\20060625-0905\test

BUILD FAILED
C:\continuum-1.0.2\apps\continuum\working-directory\6\build.xml:342: C:\continuum-1.0.2\apps\continuum\working-directory\6\classlib\build\test_report\html
not found.

Total time: 31 seconds

****************************************************************************




Mime
View raw message