harmony-commits mailing list archives

Site index · List index
Message view « Date » · « Thread »
Top « Date » · « Thread »
From Apache Harmony Build <nom...@hursley.ibm.com>
Subject [continuum] BUILD FAILURE: Classlib/linux.ia32 Build/Test
Date Mon, 26 Jun 2006 04:01:04 GMT
Online report : http://ibmonly.hursley.ibm.com/continuum/linux.ia32/servlet/continuum/target/ProjectBuild.vm/view/ProjectBuild/id/6/buildId/3100
Build statistics:
  State: Failed
  Previous State: Failed
  Started at: Mon, 26 Jun 2006 05:00:45 +0100
  Finished at: Mon, 26 Jun 2006 05:01:03 +0100
  Total time: 18s
  Build Trigger: Schedule
  Exit code: 1
  Building machine hostname: hy2
  Operating system : Linux(unknown)
  Java version : 1.5.0_06(Sun Microsystems Inc.)

Changes
                            classlib/modules/luni/src/main/java/java/util/Collections.java
        
****************************************************************************
Output:
****************************************************************************
Buildfile: build.xml

build:
   [delete] Deleting directory /home/hybld/continuum-working-directory/6/classlib/deploy
     [echo] Classlib revision is 417122
     [echo] Post process: true
     [echo] JAPI: true
     [echo] Building with reference jdk/javac
     [exec] Buildfile: build.xml

     [exec] clean:

     [exec] clean-kernel-patternsets:

     [exec] clean-bin:

     [exec] call-modules-all:

     [exec] clean:
     [exec]    [delete] /home/hybld/continuum-working-directory/6/classlib/build not found.

     [exec] clean:
     [exec]    [delete] /home/hybld/continuum-working-directory/6/classlib/build not found.

     [exec] clean:
     [exec]    [delete] /home/hybld/continuum-working-directory/6/classlib/build not found.

     [exec] clean:
     [exec]    [delete] /home/hybld/continuum-working-directory/6/classlib/build not found.

     [exec] clean.native.includes:
     [exec]    [delete] /home/hybld/continuum-working-directory/6/classlib/deploy/include
not found.

     [exec] clean:
     [exec]    [delete] /home/hybld/continuum-working-directory/6/classlib/build not found.

     [exec] clean:
     [exec]    [delete] /home/hybld/continuum-working-directory/6/classlib/build not found.

     [exec] clean:
     [exec]    [delete] /home/hybld/continuum-working-directory/6/classlib/build not found.

     [exec] clean:
     [exec]    [delete] /home/hybld/continuum-working-directory/6/classlib/build not found.

     [exec] clean:
     [exec]    [delete] /home/hybld/continuum-working-directory/6/classlib/build not found.

     [exec] clean:
     [exec]    [delete] /home/hybld/continuum-working-directory/6/classlib/build not found.

     [exec] clean:

     [exec] clean:
     [exec]    [delete] /home/hybld/continuum-working-directory/6/classlib/build not found.

     [exec] clean.native.includes:
     [exec]    [delete] /home/hybld/continuum-working-directory/6/classlib/deploy/include
not found.
     [exec]    [delete] /home/hybld/continuum-working-directory/6/classlib/deploy/jdk/include
not found.

     [exec] clean:
     [exec]    [delete] /home/hybld/continuum-working-directory/6/classlib/build not found.

     [exec] clean:
     [exec]    [delete] /home/hybld/continuum-working-directory/6/classlib/build not found.

     [exec] clean:
     [exec]    [delete] /home/hybld/continuum-working-directory/6/classlib/build not found.
     [exec]    [delete] /home/hybld/continuum-working-directory/6/classlib/modules/nio/bin/test
not found.

     [exec] clean:
     [exec]    [delete] /home/hybld/continuum-working-directory/6/classlib/build not found.

     [exec] clean:
     [exec]    [delete] /home/hybld/continuum-working-directory/6/classlib/build not found.

     [exec] clean:
     [exec]    [delete] /home/hybld/continuum-working-directory/6/classlib/build not found.

     [exec] clean:

     [exec] clean:
     [exec]    [delete] /home/hybld/continuum-working-directory/6/classlib/build not found.

     [exec] clean:
     [exec]    [delete] /home/hybld/continuum-working-directory/6/classlib/build not found.

     [exec] clean:
     [exec]    [delete] /home/hybld/continuum-working-directory/6/classlib/build not found.

     [exec] clean:
     [exec]    [delete] /home/hybld/continuum-working-directory/6/classlib/build not found.

     [exec] clean:
     [exec]    [delete] /home/hybld/continuum-working-directory/6/classlib/build not found.

     [exec] clean:
     [exec]    [delete] /home/hybld/continuum-working-directory/6/classlib/build not found.

     [exec] clean:
     [exec]    [delete] /home/hybld/continuum-working-directory/6/classlib/build not found.

     [exec] call-modules-one:
     [exec]    [delete] /home/hybld/continuum-working-directory/6/classlib/build not found.

     [exec] clean-layout:
     [exec]    [delete] /home/hybld/continuum-working-directory/6/classlib/deploy/jdk not
found.

     [exec] clean:

     [exec] init:

     [exec] windows-properties:

     [exec] linux-properties:

     [exec] properties:

     [exec] make-clean:

     [exec] init:

     [exec] windows-properties:

     [exec] linux-properties:

     [exec] properties:

     [exec] copy-makefile-includes:
     [exec]     [mkdir] Created dir: /home/hybld/continuum-working-directory/6/classlib/deploy/build/make
     [exec]      [copy] Copying 4 files to /home/hybld/continuum-working-directory/6/classlib/deploy/build/make
     [exec]      [exec] (cd auth && /usr/bin/make clean )
     [exec]      [exec] make[1]: Entering directory `/home/hybld/continuum-working-directory/6/classlib/native-src/linux.IA32/auth'
     [exec]      [exec] rm -f ../../shared/auth/auth_copyright.o authnix.o ../libhyauth.so
 
     [exec]      [exec] make[1]: Leaving directory `/home/hybld/continuum-working-directory/6/classlib/native-src/linux.IA32/auth'
     [exec]      [exec] (cd sig && /usr/bin/make clean )
     [exec]      [exec] make[1]: Entering directory `/home/hybld/continuum-working-directory/6/classlib/native-src/linux.IA32/sig'
     [exec]      [exec] rm -f ../../shared/sig/hysig_copyright.o hysiglinux.o hysigunix.o
../libhysig.so  
     [exec]      [exec] make[1]: Leaving directory `/home/hybld/continuum-working-directory/6/classlib/native-src/linux.IA32/sig'
     [exec]      [exec] (cd pool  && /usr/bin/make clean )
     [exec]      [exec] make[1]: Entering directory `/home/hybld/continuum-working-directory/6/classlib/native-src/linux.IA32/pool'
     [exec]      [exec] rm -f ../../shared/pool/pool.o ../../shared/pool/pool_cap.o   /home/hybld/continuum-working-directory/6/classlib/deploy/lib/libhypool.a
     [exec]      [exec] make[1]: Leaving directory `/home/hybld/continuum-working-directory/6/classlib/native-src/linux.IA32/pool'
     [exec]      [exec] (cd thread && /usr/bin/make clean )
     [exec]      [exec] make[1]: Entering directory `/home/hybld/continuum-working-directory/6/classlib/native-src/linux.IA32/thread'
     [exec]      [exec] rm -f ../../shared/thread/thread_copyright.o thrhelp.o thrspinlock.o
hythread.o ../../shared/thread/hythreadinspect.o linuxonexit.o priority.o rasthrsup.o ../../shared/thread/rwmutex.o
thrcreate.o thrdsup.o ../../shared/thread/thrprof.o ../libhythr.so  
     [exec]      [exec] make[1]: Leaving directory `/home/hybld/continuum-working-directory/6/classlib/native-src/linux.IA32/thread'
     [exec]      [exec] (cd port && /usr/bin/make clean )
     [exec]      [exec] make[1]: Entering directory `/home/hybld/continuum-working-directory/6/classlib/native-src/linux.IA32/port'
     [exec]      [exec] rm -f ../../shared/port/port_copyright.o hycpu.o ../../shared/port/hyerror.o
hyerrorhelpers.o ../../shared/port/hyexit.o hyfile.o hyfiletext.o ../../shared/port/hygp.o
hyipcmutex.o hymem.o hymmap.o ../../shared/port/hynls.o hynlshelpers.o hyosdump.o ../../shared/port/hyport.o
../../shared/port/hyportcontrol.o hyportptb.o hysharedhelper.o hyshmem.o hyshsem.o hysignal.o
hysl.o hysock.o ../../shared/port/hystr.o ../../shared/port/hystrftime.o ../../shared/port/hystsl.o
hysysinfo.o hytime.o ../../shared/port/hytlshelpers.o hytty.o hyvmem.o ../libhyprt.so  /home/hybld/continuum-working-directory/6/classlib/deploy/lib/libhyprt.a
     [exec]      [exec] make[1]: Leaving directory `/home/hybld/continuum-working-directory/6/classlib/native-src/linux.IA32/port'
     [exec]      [exec] (cd fdlibm && /usr/bin/make clean )
     [exec]      [exec] make[1]: Entering directory `/home/hybld/continuum-working-directory/6/classlib/native-src/linux.IA32/fdlibm'
     [exec]      [exec] rm -f dist/e_acos.o dist/e_acosh.o dist/e_asin.o dist/e_atan2.o dist/e_atanh.o
dist/e_cosh.o dist/e_exp.o dist/e_fmod.o dist/e_gamma.o dist/e_gamma_r.o dist/e_hypot.o dist/e_j0.o
dist/e_j1.o dist/e_jn.o dist/e_lgamma.o dist/e_lgamma_r.o dist/e_log.o dist/e_log10.o dist/e_pow.o
dist/e_rem_pio2.o dist/e_remainder.o dist/e_scalb.o dist/e_sinh.o dist/e_sqrt.o dist/k_cos.o
dist/k_rem_pio2.o dist/k_sin.o dist/k_standard.o dist/k_tan.o dist/s_asinh.o dist/s_atan.o
dist/s_cbrt.o dist/s_ceil.o dist/s_copysign.o dist/s_cos.o dist/s_erf.o dist/s_expm1.o dist/s_fabs.o
dist/s_finite.o dist/s_floor.o dist/s_frexp.o dist/s_ilogb.o dist/s_isnan.o dist/s_ldexp.o
../../shared/fdlibm/s_lib_version.o dist/s_log1p.o dist/s_logb.o dist/s_matherr.o dist/s_modf.o
dist/s_nextafter.o dist/s_rint.o dist/s_scalbn.o dist/s_signgam.o dist/s_significand.o dist/s_sin.o
dist/s_tan.o dist/s_tanh.o dist/w_acos.o dist/w_acosh.o dist/w_asin.o dist/w_atan2.o dist/w_atanh.o
dist/w_cosh.o dist/w_exp.o dist/w_fmod.o dist/w_gamma.o dist/w_gamma_r.o dist/w_hypot.o dist/w_j0.o
dist/w_j1.o dist/w_jn.o dist/w_lgamma.o dist/w_lgamma_r.o dist/w_log.o dist/w_log10.o dist/w_pow.o
dist/w_remainder.o dist/w_scalb.o dist/w_sinh.o dist/w_sqrt.o   /home/hybld/continuum-working-directory/6/classlib/deploy/lib/libhyfdlibm.a
     [exec]      [exec] make[1]: Leaving directory `/home/hybld/continuum-working-directory/6/classlib/native-src/linux.IA32/fdlibm'
     [exec]      [exec] (cd zip && /usr/bin/make clean )
     [exec]      [exec] make[1]: Entering directory `/home/hybld/continuum-working-directory/6/classlib/native-src/linux.IA32/zip'
     [exec]      [exec] rm -f ../../shared/zip/zcpool.o ../../shared/zip/zipalloc.o ../../shared/zip/zipcache.o
../../shared/zip/zipsup.o   /home/hybld/continuum-working-directory/6/classlib/deploy/lib/libhyzip.a
     [exec]      [exec] make[1]: Leaving directory `/home/hybld/continuum-working-directory/6/classlib/native-src/linux.IA32/zip'
     [exec]      [exec] (cd zlib && /usr/bin/make clean )
     [exec]      [exec] make[1]: Entering directory `/home/hybld/continuum-working-directory/6/classlib/native-src/linux.IA32/zlib'
     [exec]      [exec] rm -f ../../shared/zlib/zlib_copyright.o dist/adler32.o dist/compress.o
dist/crc32.o dist/deflate.o dist/infback.o dist/inffast.o dist/inflate.o dist/inftrees.o dist/trees.o
dist/uncompr.o dist/zutil.o ../libhyzlib.so  
     [exec]      [exec] make[1]: Leaving directory `/home/hybld/continuum-working-directory/6/classlib/native-src/linux.IA32/zlib'
     [exec]      [exec] (cd vmi && /usr/bin/make clean )
     [exec]      [exec] make[1]: Entering directory `/home/hybld/continuum-working-directory/6/classlib/native-src/linux.IA32/vmi'
     [exec]      [exec] rm -f ../../shared/vmi/vmi_copyright.o ../../shared/vmi/vmi.o ../libvmi.so
 
     [exec]      [exec] make[1]: Leaving directory `/home/hybld/continuum-working-directory/6/classlib/native-src/linux.IA32/vmi'
     [exec]      [exec] (cd common && /usr/bin/make clean )
     [exec]      [exec] make[1]: Entering directory `/home/hybld/continuum-working-directory/6/classlib/native-src/linux.IA32/common'
     [exec]      [exec] rm -f ../../shared/common/libglob.o ../../shared/common/iohelp.o ../../shared/common/utf8encode.o
../../shared/common/utf8decode.o   /home/hybld/continuum-working-directory/6/classlib/deploy/lib/libhycommon.a
     [exec]      [exec] make[1]: Leaving directory `/home/hybld/continuum-working-directory/6/classlib/native-src/linux.IA32/common'
     [exec]      [exec] (cd luni && /usr/bin/make clean )
     [exec]      [exec] make[1]: Entering directory `/home/hybld/continuum-working-directory/6/classlib/native-src/linux.IA32/luni'
     [exec]      [exec] rm -f ../../shared/luni/luni_copyright.o ../../shared/luni/file.o
procimpl.o ../../shared/luni/oos.o ../../shared/luni/nethelp.o ../../shared/luni/floatbits.o
../../shared/luni/ois.o helpers.o ../../shared/luni/math.o ../../shared/luni/luniglob.o ../../shared/luni/proxy.o
../../shared/luni/cbigint.o ../../shared/luni/dblparse.o ../../shared/luni/fltparse.o ../../shared/luni/netif.o
../../shared/luni/process.o ../../shared/luni/bigint.o ../../shared/luni/osc.o ../../shared/luni/socket.o
../../shared/luni/inetadds.o ../../shared/luni/filedesc.o ../../shared/luni/timezone.o ../../shared/luni/OSFileSystem.o
OSFileSystemLinux32.o OSMemory.o OSMemoryLinux32.o ../../shared/luni/OSNetworkSystem.o OSNetworkSystemLinux.o
../libhyluni.so  
     [exec]      [exec] make[1]: Leaving directory `/home/hybld/continuum-working-directory/6/classlib/native-src/linux.IA32/luni'
     [exec]      [exec] (cd archive && /usr/bin/make clean )
     [exec]      [exec] make[1]: Entering directory `/home/hybld/continuum-working-directory/6/classlib/native-src/linux.IA32/archive'
     [exec]      [exec] rm -f ../../shared/archive/archive_copyright.o ../../shared/archive/jclcrc32.o
../../shared/archive/zip.o ../../shared/archive/adler32.o ../../shared/archive/inflater.o
../../shared/archive/jarfile.o ../../shared/archive/deflater.o ../../shared/archive/archiveglob.o
../libhyarchive.so  
     [exec]      [exec] make[1]: Leaving directory `/home/hybld/continuum-working-directory/6/classlib/native-src/linux.IA32/archive'
     [exec]      [exec] (cd text && /usr/bin/make clean )
     [exec]      [exec] make[1]: Entering directory `/home/hybld/continuum-working-directory/6/classlib/native-src/linux.IA32/text'
     [exec]      [exec] rm -f text_copyright.o ../../shared/text/BidiWrapper.o ../libhytext.so
 
     [exec]      [exec] make[1]: Leaving directory `/home/hybld/continuum-working-directory/6/classlib/native-src/linux.IA32/text'
     [exec]      [exec] (cd vmls && /usr/bin/make clean )
     [exec]      [exec] make[1]: Entering directory `/home/hybld/continuum-working-directory/6/classlib/native-src/linux.IA32/vmls'
     [exec]      [exec] rm -f ../../shared/vmls/vmls.o   /home/hybld/continuum-working-directory/6/classlib/deploy/lib/libhyvmls.a
     [exec]      [exec] make[1]: Leaving directory `/home/hybld/continuum-working-directory/6/classlib/native-src/linux.IA32/vmls'
     [exec]      [exec] (cd launcher && /usr/bin/make clean )
     [exec]      [exec] make[1]: Entering directory `/home/hybld/continuum-working-directory/6/classlib/native-src/linux.IA32/launcher'
     [exec]      [exec] rm -f ../../shared/launcher/main.o ../../shared/launcher/cmain.o ../../shared/launcher/launcher_copyright.o
../../shared/launcher/strbuf.o ../../shared/launcher/libhlp.o    ../java 
     [exec]      [exec] make[1]: Leaving directory `/home/hybld/continuum-working-directory/6/classlib/native-src/linux.IA32/launcher'

     [exec] clean.native:

     [exec] clean-makefile-includes:
     [exec]    [delete] Deleting directory /home/hybld/continuum-working-directory/6/classlib/deploy/build/make

     [exec] clean-includes:

     [exec] clean.native.includes:
     [exec]    [delete] /home/hybld/continuum-working-directory/6/classlib/deploy/include
not found.

     [exec] clean.native.includes:
     [exec]    [delete] /home/hybld/continuum-working-directory/6/classlib/deploy/include
not found.
     [exec]    [delete] /home/hybld/continuum-working-directory/6/classlib/deploy/jdk/include
not found.

     [exec] clean-overlay-oss:

     [exec] clean-layout:
     [exec]    [delete] /home/hybld/continuum-working-directory/6/classlib/deploy/jdk not
found.

     [exec] clean:

     [exec] build:
     [exec]      [echo] 
     [exec]      [echo] ========================================
     [exec]      [echo] Building Java component archives...
     [exec]      [echo] ========================================

     [exec] copy-kernel-patternsets:
     [exec]     [mkdir] Created dir: /home/hybld/continuum-working-directory/6/classlib/deploy/build/patternsets
     [exec]      [copy] Copying 1 file to /home/hybld/continuum-working-directory/6/classlib/deploy/build/patternsets
     [exec]      [copy] Copying 1 file to /home/hybld/continuum-working-directory/6/classlib/deploy/build/patternsets

     [exec] prepare-depends:

     [exec] check:
     [exec]      [echo] Checking for depends/jars/xalan-j_2.7.0/xalan.jar
     [exec]      [echo] Checking for depends/jars/xerces_2.8.0/resolver.jar
     [exec]      [echo] Checking for depends/jars/xerces_2.8.0/xercesImpl.jar
     [exec]      [echo] Checking for depends/jars/xerces_2.8.0/xml-apis.jar
     [exec]      [echo] Checking for depends/jars/junit_3.8.2/junit.jar
     [exec]      [echo] Checking for depends/jars/bcprov-jdk14-133/signed.bcprov.jar
     [exec]      [echo] Checking for depends/jars/icu4j_3.4.4/icu4j_3_4_4.jar
     [exec]      [echo] Checking for depends/jars/mx4j_3.0.1/mx4j.jar
     [exec]      [echo] Checking for depends/jars/mx4j_3.0.1/mx4j-remote.jar
     [exec]      [echo] Checking for depends/jars/ecj_3.2MAINT/ecj_3.2MAINT.jar

     [exec] BUILD FAILED
     [exec] /home/hybld/continuum-working-directory/6/classlib/build.xml:83: The following
error occurred while executing this line:
     [exec] /home/hybld/continuum-working-directory/6/classlib/make/build-java.xml:216: The
following error occurred while executing this line:
     [exec] /home/hybld/continuum-working-directory/6/classlib/make/depends.xml:51: The following
error occurred while executing this line:
     [exec] /home/hybld/continuum-working-directory/6/classlib/make/depends.xml:157: ...

     [exec] Missing dependency.  The jar from:

     [exec]   http://download.eclipse.org/eclipse/downloads/drops/M20060609-1217/ecj.jar

     [exec] should be downloaded to:

     [exec]   depends/jars/ecj_3.2MAINT/ecj_3.2MAINT.jar

     [exec] Run "ant fetch-depends" to automatically fetch dependencies.
     [exec] Note: Some of Harmony's dependencies are licensed under terms other
     [exec] than the Apache License v2.

     [exec] Total time: 11 seconds

BUILD FAILED
/home/hybld/continuum-working-directory/6/build.xml:118: exec returned: 1

Total time: 17 seconds

****************************************************************************



Mime
View raw message