harmony-commits mailing list archives

Site index · List index
Message view « Date » · « Thread »
Top « Date » · « Thread »
From Apache Harmony Build <nom...@hursley.ibm.com>
Subject [continuum] BUILD FAILURE: Classlib/win.ia32 Build/Test
Date Sun, 25 Jun 2006 21:03:15 GMT
Online report : http://ibmonly.hursley.ibm.com/continuum/win.ia32/servlet/continuum/target/ProjectBuild.vm/view/ProjectBuild/id/6/buildId/1417
Build statistics:
  State: Failed
  Previous State: Ok
  Started at: Sun, 25 Jun 2006 22:02:40 +0100
  Finished at: Sun, 25 Jun 2006 22:03:11 +0100
  Total time: 30s
  Build Trigger: Schedule
  Exit code: 1
  Building machine hostname: hy1
  Operating system : Windows XP(Service Pack 2)
  Java version : 1.5.0_06(Sun Microsystems Inc.)

Changes
                            classlib\make\depends.properties
        
****************************************************************************
Output:
****************************************************************************
Buildfile: build.xml

build:
   [delete] Deleting directory C:\continuum-1.0.2\apps\continuum\working-directory\6\classlib\deploy
     [echo] Classlib revision is 417079
     [echo] Post process: ${is.post.process.host}
     [echo] JAPI: ${is.japi.ftp.host}
     [echo] Building with reference jdk/javac
     [exec] Buildfile: build.xml

     [exec] clean:

     [exec] clean-kernel-patternsets:

     [exec] clean-bin:

     [exec] call-modules-all:

     [exec] clean:
     [exec]    [delete] Excludesfile C:\continuum-1.0.2\apps\continuum\working-directory\6\classlib\deploy\build\patternsets\luni-kernel.txt
not found.

     [exec] clean:
     [exec]    [delete] Excludesfile C:\continuum-1.0.2\apps\continuum\working-directory\6\classlib\deploy\build\patternsets\luni-kernel.txt
not found.

     [exec] clean:
     [exec]    [delete] Excludesfile C:\continuum-1.0.2\apps\continuum\working-directory\6\classlib\deploy\build\patternsets\luni-kernel.txt
not found.
     [exec]    [delete] Deleting 1 files from C:\continuum-1.0.2\apps\continuum\working-directory\6\classlib\modules\applet\bin\test

     [exec] clean:
     [exec]    [delete] Excludesfile C:\continuum-1.0.2\apps\continuum\working-directory\6\classlib\deploy\build\patternsets\luni-kernel.txt
not found.
     [exec]    [delete] Deleting 40 files from C:\continuum-1.0.2\apps\continuum\working-directory\6\classlib\modules\archive\bin\test

     [exec] clean.native.includes:
     [exec]    [delete] C:\continuum-1.0.2\apps\continuum\working-directory\6\classlib\deploy\include
not found.

     [exec] clean:
     [exec]    [delete] Excludesfile C:\continuum-1.0.2\apps\continuum\working-directory\6\classlib\deploy\build\patternsets\luni-kernel.txt
not found.
     [exec]    [delete] Deleting 213 files from C:\continuum-1.0.2\apps\continuum\working-directory\6\classlib\modules\auth\bin\test

     [exec] clean:
     [exec]    [delete] Excludesfile C:\continuum-1.0.2\apps\continuum\working-directory\6\classlib\deploy\build\patternsets\luni-kernel.txt
not found.
     [exec]    [delete] Deleting 2 files from C:\continuum-1.0.2\apps\continuum\working-directory\6\classlib\modules\awt\bin\test

     [exec] clean:
     [exec]    [delete] Excludesfile C:\continuum-1.0.2\apps\continuum\working-directory\6\classlib\deploy\build\patternsets\luni-kernel.txt
not found.
     [exec]    [delete] Deleting 348 files from C:\continuum-1.0.2\apps\continuum\working-directory\6\classlib\modules\beans\bin\test

     [exec] clean:
     [exec]    [delete] Excludesfile C:\continuum-1.0.2\apps\continuum\working-directory\6\classlib\deploy\build\patternsets\luni-kernel.txt
not found.
     [exec]    [delete] Deleting 83 files from C:\continuum-1.0.2\apps\continuum\working-directory\6\classlib\modules\crypto\bin\test

     [exec] clean:
     [exec]    [delete] Excludesfile C:\continuum-1.0.2\apps\continuum\working-directory\6\classlib\deploy\build\patternsets\luni-kernel.txt
not found.
     [exec]    [delete] Deleting 162 files from C:\continuum-1.0.2\apps\continuum\working-directory\6\classlib\modules\jndi\bin\test

     [exec] clean:
     [exec]    [delete] Excludesfile C:\continuum-1.0.2\apps\continuum\working-directory\6\classlib\deploy\build\patternsets\luni-kernel.txt
not found.
     [exec]    [delete] Deleting 98 files from C:\continuum-1.0.2\apps\continuum\working-directory\6\classlib\modules\logging\bin\test

     [exec] clean:

     [exec] clean:
     [exec]    [delete] Excludesfile C:\continuum-1.0.2\apps\continuum\working-directory\6\classlib\deploy\build\patternsets\luni-kernel.txt
not found.
     [exec]    [delete] Deleting 715 files from C:\continuum-1.0.2\apps\continuum\working-directory\6\classlib\modules\luni\bin\test

     [exec] clean.native.includes:
     [exec]    [delete] C:\continuum-1.0.2\apps\continuum\working-directory\6\classlib\deploy\include
not found.
     [exec]    [delete] C:\continuum-1.0.2\apps\continuum\working-directory\6\classlib\deploy\jdk\include
not found.

     [exec] clean:
     [exec]    [delete] Excludesfile C:\continuum-1.0.2\apps\continuum\working-directory\6\classlib\deploy\build\patternsets\luni-kernel.txt
not found.
     [exec]    [delete] Deleting 24 files from C:\continuum-1.0.2\apps\continuum\working-directory\6\classlib\modules\math\bin\test

     [exec] clean:
     [exec]    [delete] Excludesfile C:\continuum-1.0.2\apps\continuum\working-directory\6\classlib\deploy\build\patternsets\luni-kernel.txt
not found.

     [exec] clean:
     [exec]    [delete] Excludesfile C:\continuum-1.0.2\apps\continuum\working-directory\6\classlib\deploy\build\patternsets\luni-kernel.txt
not found.
     [exec]    [delete] Deleting 80 files from C:\continuum-1.0.2\apps\continuum\working-directory\6\classlib\modules\nio\bin\test
     [exec]    [delete] Deleted 14 directories from C:\continuum-1.0.2\apps\continuum\working-directory\6\classlib\modules\nio\bin\test

     [exec] clean:
     [exec]    [delete] Excludesfile C:\continuum-1.0.2\apps\continuum\working-directory\6\classlib\deploy\build\patternsets\luni-kernel.txt
not found.
     [exec]    [delete] Deleting 69 files from C:\continuum-1.0.2\apps\continuum\working-directory\6\classlib\modules\nio_char\bin\test

     [exec] clean:
     [exec]    [delete] Excludesfile C:\continuum-1.0.2\apps\continuum\working-directory\6\classlib\deploy\build\patternsets\luni-kernel.txt
not found.
     [exec]    [delete] Deleting 33 files from C:\continuum-1.0.2\apps\continuum\working-directory\6\classlib\modules\prefs\bin\test

     [exec] clean:
     [exec]    [delete] Excludesfile C:\continuum-1.0.2\apps\continuum\working-directory\6\classlib\deploy\build\patternsets\luni-kernel.txt
not found.
     [exec]    [delete] Deleting 12 files from C:\continuum-1.0.2\apps\continuum\working-directory\6\classlib\modules\regex\bin\test

     [exec] clean:

     [exec] clean:
     [exec]    [delete] Excludesfile C:\continuum-1.0.2\apps\continuum\working-directory\6\classlib\deploy\build\patternsets\luni-kernel.txt
not found.
     [exec]    [delete] Deleting 512 files from C:\continuum-1.0.2\apps\continuum\working-directory\6\classlib\modules\security\bin\test

     [exec] clean:
     [exec]    [delete] Excludesfile C:\continuum-1.0.2\apps\continuum\working-directory\6\classlib\deploy\build\patternsets\luni-kernel.txt
not found.
     [exec]    [delete] Deleting 73 files from C:\continuum-1.0.2\apps\continuum\working-directory\6\classlib\modules\sql\bin\test

     [exec] clean:
     [exec]    [delete] Excludesfile C:\continuum-1.0.2\apps\continuum\working-directory\6\classlib\deploy\build\patternsets\luni-kernel.txt
not found.

     [exec] clean:
     [exec]    [delete] Excludesfile C:\continuum-1.0.2\apps\continuum\working-directory\6\classlib\deploy\build\patternsets\luni-kernel.txt
not found.
     [exec]    [delete] Deleting 31 files from C:\continuum-1.0.2\apps\continuum\working-directory\6\classlib\modules\text\bin\test

     [exec] clean:
     [exec]    [delete] Excludesfile C:\continuum-1.0.2\apps\continuum\working-directory\6\classlib\deploy\build\patternsets\luni-kernel.txt
not found.
     [exec]    [delete] Deleting 1 files from C:\continuum-1.0.2\apps\continuum\working-directory\6\classlib\modules\tools\bin\test

     [exec] clean:
     [exec]    [delete] Excludesfile C:\continuum-1.0.2\apps\continuum\working-directory\6\classlib\deploy\build\patternsets\luni-kernel.txt
not found.
     [exec]    [delete] Deleting 54 files from C:\continuum-1.0.2\apps\continuum\working-directory\6\classlib\modules\x-net\bin\test

     [exec] clean:
     [exec]    [delete] Excludesfile C:\continuum-1.0.2\apps\continuum\working-directory\6\classlib\deploy\build\patternsets\luni-kernel.txt
not found.
     [exec]    [delete] Deleting 22 files from C:\continuum-1.0.2\apps\continuum\working-directory\6\classlib\modules\rmi\bin\test

     [exec] call-modules-one:
     [exec]    [delete] Deleting 7215 files from C:\continuum-1.0.2\apps\continuum\working-directory\6\classlib\build
     [exec]    [delete] Deleted 372 directories from C:\continuum-1.0.2\apps\continuum\working-directory\6\classlib\build

     [exec] clean-layout:
     [exec]    [delete] C:\continuum-1.0.2\apps\continuum\working-directory\6\classlib\deploy\jdk
not found.

     [exec] clean:

     [exec] init:

     [exec] windows-properties:

     [exec] linux-properties:

     [exec] properties:

     [exec] make-clean:

     [exec] init:

     [exec] windows-properties:

     [exec] linux-properties:

     [exec] properties:

     [exec] copy-makefile-includes:
     [exec]     [mkdir] Created dir: C:\continuum-1.0.2\apps\continuum\working-directory\6\classlib\deploy\build\make
     [exec]      [copy] Copying 4 files to C:\continuum-1.0.2\apps\continuum\working-directory\6\classlib\deploy\build\make

     [exec]      [exec] Microsoft (R) Program Maintenance Utility Version 7.10.3077
     [exec]      [exec] Copyright (C) Microsoft Corporation.  All rights reserved.

     [exec]      [exec] 	cd auth
     [exec]      [exec] 	nmake /NOLOGO clean
     [exec]      [exec] 	del ..\..\shared\auth\auth_copyright.obj authwin32.obj *.res *.pdb
 C:\continuum-1.0.2\apps\continuum\working-directory\6\classlib\deploy\lib\hyauth.lib C:\continuum-1.0.2\apps\continuum\working-directory\6\classlib\deploy\lib\hyauth.exp
 ..\hyauth.dll ..\hyauth.pdb ..\hyauth.map    >nul 2>&1
     [exec]      [exec] 	cd ..
     [exec]      [exec] 	cd archive
     [exec]      [exec] 	nmake /NOLOGO clean
     [exec]      [exec] 	del ..\..\shared\archive\archive_copyright.obj ..\..\shared\archive\jclcrc32.obj
 ..\..\shared\archive\zip.obj ..\..\shared\archive\adler32.obj ..\..\shared\archive\inflater.obj
 ..\..\shared\archive\jarfile.obj ..\..\shared\archive\deflater.obj  ..\..\shared\archive\archiveglob.obj
*.res *.pdb  C:\continuum-1.0.2\apps\continuum\working-directory\6\classlib\deploy\lib\hyarchive.lib
C:\continuum-1.0.2\apps\continuum\working-directory\6\classlib\deploy\lib\hyarchive.exp  ..\hyarchive.dll
..\hyarchive.pdb ..\hyarchive.map    >nul 2>&1
     [exec]      [exec] 	cd ..
     [exec]      [exec] 	cd launcher
     [exec]      [exec] 	nmake /NOLOGO clean
     [exec]      [exec] 	nmake /NOLOGO -f makefile.javae clean
     [exec]      [exec] 	del ..\..\shared\launcher\launcher_copyright.obj ..\..\shared\launcher\cmain.obj
 ..\..\shared\launcher\main.obj ..\..\shared\launcher\strbuf.obj ..\..\shared\launcher\libhlp.obj
*.res *.pdb         ..\java.exe ..\java.pdb >nul 2>&1
     [exec]      [exec] 	nmake /NOLOGO -f makefile.javaw clean
     [exec]      [exec] 	del ..\..\shared\launcher\launcher_copyright.obj ..\..\shared\launcher\main.obj
 winmain.obj ..\..\shared\launcher\strbuf.obj ..\..\shared\launcher\libhlp.obj *.res *.pdb
        ..\javaw.exe ..\javaw.pdb >nul 2>&1
     [exec]      [exec] 	cd ..
     [exec]      [exec] 	cd common
     [exec]      [exec] 	nmake /NOLOGO clean
     [exec]      [exec] 	del ..\..\shared\common\libglob.obj ..\..\shared\common\iohelp.obj
 locklbl.obj lock386.obj  ..\..\shared\common\utf8decode.obj ..\..\shared\common\utf8encode.obj
*.res *.pdb  C:\continuum-1.0.2\apps\continuum\working-directory\6\classlib\deploy\lib\hycommon.lib
C:\continuum-1.0.2\apps\continuum\working-directory\6\classlib\deploy\lib\hycommon.exp   
    >nul 2>&1
     [exec]      [exec] 	cd ..
     [exec]      [exec] 	cd luni
     [exec]      [exec] 	nmake /NOLOGO clean
     [exec]      [exec] 	del ..\..\shared\luni\luni_copyright.obj ..\..\shared\luni\file.obj
procimpl.obj  ..\..\shared\luni\oos.obj  ..\..\shared\luni\nethelp.obj ..\..\shared\luni\floatbits.obj
 ..\..\shared\luni\ois.obj helpers.obj ..\..\shared\luni\math.obj  ..\..\shared\luni\luniglob.obj
..\..\shared\luni\proxy.obj ..\..\shared\luni\netif.obj  ..\..\shared\luni\cbigint.obj ..\..\shared\luni\dblparse.obj
..\..\shared\luni\fltparse.obj  ..\..\shared\luni\process.obj ..\..\shared\luni\bigint.obj
..\..\shared\luni\osc.obj  ..\..\shared\luni\socket.obj ..\..\shared\luni\inetadds.obj  ..\..\shared\luni\filedesc.obj
..\..\shared\luni\timezone.obj  OSFileSystemWin32.obj  ..\..\shared\luni\OSFileSystem.obj
OSMemoryWin32.obj OSMemory.obj  ..\..\shared\luni\OSNetworkSystem.obj OSNetworkSystemWin32.obj
*.res *.pdb  C:\continuum-1.0.2\apps\continuum\working-directory\6\classlib\deploy\lib\hyluni.lib
C:\continuum-1.0.2\apps\continuum\working-directory\6\classlib\deploy\lib\hyluni.exp  ..\hyluni.dll
..\hyluni.pdb ..\hyluni.map    >nul 2>&1
     [exec]      [exec] 	cd ..
     [exec]      [exec] 	cd text
     [exec]      [exec] 	nmake /NOLOGO clean
     [exec]      [exec] 	del text_copyright.obj ..\..\shared\text\BidiWrapper.obj *.res *.pdb
 C:\continuum-1.0.2\apps\continuum\working-directory\6\classlib\deploy\lib\hytext.lib C:\continuum-1.0.2\apps\continuum\working-directory\6\classlib\deploy\lib\hytext.exp
 ..\hytext.dll ..\hytext.pdb ..\hytext.map    >nul 2>&1
     [exec]      [exec] 	cd ..
     [exec]      [exec] 	cd vmi
     [exec]      [exec] 	nmake /NOLOGO clean
     [exec]      [exec] 	del ..\..\shared\vmi\vmi_copyright.obj ..\..\shared\vmi\vmi.obj *.res
*.pdb  C:\continuum-1.0.2\apps\continuum\working-directory\6\classlib\deploy\lib\vmi.lib C:\continuum-1.0.2\apps\continuum\working-directory\6\classlib\deploy\lib\vmi.exp
       >nul 2>&1
     [exec]      [exec] 	cd ..
     [exec]      [exec] 	cd fdlibm
     [exec]      [exec] 	nmake /NOLOGO clean
     [exec]      [exec] 	del *.obj dist\*.obj
     [exec]      [exec] Could Not Find C:\continuum-1.0.2\apps\continuum\working-directory\6\classlib\native-src\win.IA32\fdlibm\*.obj
     [exec]      [exec] 	del C:\continuum-1.0.2\apps\continuum\working-directory\6\classlib\deploy\lib\hyfdlibm.lib
     [exec]      [exec] The system cannot find the file specified.
     [exec]      [exec] 	del C:\continuum-1.0.2\apps\continuum\working-directory\6\classlib\deploy\lib\hyfdlibm.pdb
     [exec]      [exec] The system cannot find the file specified.
     [exec]      [exec] 	cd ..
     [exec]      [exec] 	cd sig
     [exec]      [exec] 	nmake /NOLOGO clean
     [exec]      [exec] 	del ..\..\shared\sig\hysig_copyright.obj hysigwin.obj *.res *.pdb
 C:\continuum-1.0.2\apps\continuum\working-directory\6\classlib\deploy\lib\hysig.lib C:\continuum-1.0.2\apps\continuum\working-directory\6\classlib\deploy\lib\hysig.exp
 ..\hysig.dll ..\hysig.pdb ..\hysig.map    >nul 2>&1
     [exec]      [exec] 	cd ..
     [exec]      [exec] 	cd pool
     [exec]      [exec] 	nmake /NOLOGO clean
     [exec]      [exec] 	del ..\..\shared\pool\pool.obj ..\..\shared\pool\pool_cap.obj *.res
*.pdb  C:\continuum-1.0.2\apps\continuum\working-directory\6\classlib\deploy\lib\hypool.lib
C:\continuum-1.0.2\apps\continuum\working-directory\6\classlib\deploy\lib\hypool.exp     
  >nul 2>&1
     [exec]      [exec] 	cd ..
     [exec]      [exec] 	cd port
     [exec]      [exec] 	nmake /NOLOGO clean
     [exec]      [exec] 	del ..\..\shared\port\port_copyright.obj hycpu.obj ..\..\shared\port\hyerror.obj
 hyerrorhelpers.obj ..\..\shared\port\hyexit.obj hyfile.obj hyfiletext.obj  ..\..\shared\port\hygp.obj
hyipcmutex.obj hymem.obj hymmap.obj  ..\..\shared\port\hynls.obj hynlshelpers.obj hyosdump.obj
..\..\shared\port\hyport.obj  ..\..\shared\port\hyportcontrol.obj hyportptb.obj hyshmem.obj
hyshsem.obj  hysignal.obj hysl.obj hysock.obj ..\..\shared\port\hystr.obj  ..\..\shared\port\hystrftime.obj
..\..\shared\port\hystsl.obj hysysinfo.obj hytime.obj  ..\..\shared\port\hytlshelpers.obj
hytty.obj hyvmem.obj *.res *.pdb  C:\continuum-1.0.2\apps\continuum\working-directory\6\classlib\deploy\lib\hyprt.lib
C:\continuum-1.0.2\apps\continuum\working-directory\6\classlib\deploy\lib\hyprt.exp  ..\hyprt.dll
..\hyprt.pdb ..\hyprt.map    >nul 2>&1
     [exec]      [exec] 	cd ..
     [exec]      [exec] 	cd thread
     [exec]      [exec] 	nmake /NOLOGO clean
     [exec]      [exec] 	del ..\..\shared\thread\thread_copyright.obj thrhelp.obj thrspinlock.obj
hythread.obj  ..\..\shared\thread\hythreadinspect.obj ..\..\shared\thread\rwmutex.obj thrdsup.obj
 ..\..\shared\thread\thrprof.obj *.res *.pdb  C:\continuum-1.0.2\apps\continuum\working-directory\6\classlib\deploy\lib\hythr.lib
C:\continuum-1.0.2\apps\continuum\working-directory\6\classlib\deploy\lib\hythr.exp  ..\hythr.dll
..\hythr.pdb ..\hythr.map    >nul 2>&1
     [exec]      [exec] 	cd ..
     [exec]      [exec] 	cd zip
     [exec]      [exec] 	nmake /NOLOGO clean
     [exec]      [exec] 	del ..\..\shared\zip\zcpool.obj ..\..\shared\zip\zipalloc.obj  ..\..\shared\zip\zipcache.obj
..\..\shared\zip\zipsup.obj *.res *.pdb  C:\continuum-1.0.2\apps\continuum\working-directory\6\classlib\deploy\lib\hyzip.lib
C:\continuum-1.0.2\apps\continuum\working-directory\6\classlib\deploy\lib\hyzip.exp      
 >nul 2>&1
     [exec]      [exec] 	cd ..
     [exec]      [exec] 	cd zlib
     [exec]      [exec] 	nmake /NOLOGO clean
     [exec]      [exec] 	del ..\..\shared\zlib\zlib_copyright.obj dist\adler32.obj dist\compress.obj
 dist\crc32.obj dist\deflate.obj dist\gzio.obj dist\infback.obj  dist\inffast.obj dist\inflate.obj
dist\inftrees.obj dist\trees.obj  dist\uncompr.obj dist\zutil.obj *.res *.pdb  C:\continuum-1.0.2\apps\continuum\working-directory\6\classlib\deploy\lib\hyzlib.lib
C:\continuum-1.0.2\apps\continuum\working-directory\6\classlib\deploy\lib\hyzlib.exp  ..\hyzlib.dll
..\hyzlib.pdb ..\hyzlib.map    >nul 2>&1
     [exec]      [exec] 	cd ..
     [exec]      [exec] 	cd vmls
     [exec]      [exec] 	nmake /NOLOGO clean
     [exec]      [exec] 	del ..\..\shared\vmls\vmls.obj *.res *.pdb  C:\continuum-1.0.2\apps\continuum\working-directory\6\classlib\deploy\lib\hyvmls.lib
C:\continuum-1.0.2\apps\continuum\working-directory\6\classlib\deploy\lib\hyvmls.exp     
  >nul 2>&1
     [exec]      [exec] 	cd ..

     [exec] clean.native:

     [exec]      [exec] Microsoft (R) Program Maintenance Utility Version 7.10.3077
     [exec]      [exec] Copyright (C) Microsoft Corporation.  All rights reserved.

     [exec]      [exec] 	del prefs_copyright.obj PreferencesImpl.obj *.res *.pdb  C:\continuum-1.0.2\apps\continuum\working-directory\6\classlib\deploy\lib\hyprefs.lib
C:\continuum-1.0.2\apps\continuum\working-directory\6\classlib\deploy\lib\hyprefs.exp  ..\hyprefs.dll
..\hyprefs.pdb ..\hyprefs.map    >nul 2>&1

     [exec] clean-makefile-includes:
     [exec]    [delete] Deleting directory C:\continuum-1.0.2\apps\continuum\working-directory\6\classlib\deploy\build\make

     [exec] clean-includes:

     [exec] clean.native.includes:
     [exec]    [delete] C:\continuum-1.0.2\apps\continuum\working-directory\6\classlib\deploy\include
not found.

     [exec] clean.native.includes:
     [exec]    [delete] C:\continuum-1.0.2\apps\continuum\working-directory\6\classlib\deploy\include
not found.
     [exec]    [delete] C:\continuum-1.0.2\apps\continuum\working-directory\6\classlib\deploy\jdk\include
not found.

     [exec] clean-overlay-oss:
     [exec]    [delete] Deleting directory C:\continuum-1.0.2\apps\continuum\working-directory\6\classlib\native-src\win.IA32\fdlibm\dist
     [exec]    [delete] Deleting directory C:\continuum-1.0.2\apps\continuum\working-directory\6\classlib\native-src\win.IA32\zlib\dist
     [exec]    [delete] Deleting directory C:\continuum-1.0.2\apps\continuum\working-directory\6\classlib\native-src\win.IA32\text\unicode

     [exec] clean-layout:
     [exec]    [delete] C:\continuum-1.0.2\apps\continuum\working-directory\6\classlib\deploy\jdk
not found.

     [exec] clean:

     [exec] build:
     [exec]      [echo] 
     [exec]      [echo] ========================================
     [exec]      [echo] Building Java component archives...
     [exec]      [echo] ========================================

     [exec] copy-kernel-patternsets:
     [exec]     [mkdir] Created dir: C:\continuum-1.0.2\apps\continuum\working-directory\6\classlib\deploy\build\patternsets
     [exec]      [copy] Copying 1 file to C:\continuum-1.0.2\apps\continuum\working-directory\6\classlib\deploy\build\patternsets
     [exec]      [copy] Copying 1 file to C:\continuum-1.0.2\apps\continuum\working-directory\6\classlib\deploy\build\patternsets

     [exec] prepare-depends:

     [exec] check:
     [exec]      [echo] Checking for depends/jars/xalan-j_2.7.0/xalan.jar
     [exec]      [echo] Checking for depends/jars/xerces_2.8.0/resolver.jar
     [exec]      [echo] Checking for depends/jars/xerces_2.8.0/xercesImpl.jar
     [exec]      [echo] Checking for depends/jars/xerces_2.8.0/xml-apis.jar
     [exec]      [echo] Checking for depends/jars/junit_3.8.2/junit.jar
     [exec]      [echo] Checking for depends/jars/bcprov-jdk14-133/signed.bcprov.jar
     [exec]      [echo] Checking for depends/jars/icu4j_3.4.4/icu4j_3_4_4.jar
     [exec]      [echo] Checking for depends/jars/mx4j_3.0.1/mx4j.jar
     [exec]      [echo] Checking for depends/jars/mx4j_3.0.1/mx4j-remote.jar
     [exec]      [echo] Checking for depends/jars/ecj_3.2MAINT/ecj_3.2MAINT.jar

     [exec] BUILD FAILED
     [exec] C:\continuum-1.0.2\apps\continuum\working-directory\6\classlib\build.xml:83: The
following error occurred while executing this line:
     [exec] C:\continuum-1.0.2\apps\continuum\working-directory\6\classlib\make\build-java.xml:216:
The following error occurred while executing this line:
     [exec] C:\continuum-1.0.2\apps\continuum\working-directory\6\classlib\make\depends.xml:51:
The following error occurred while executing this line:
     [exec] C:\continuum-1.0.2\apps\continuum\working-directory\6\classlib\make\depends.xml:157:
...

     [exec] Missing dependency.  The jar from:

     [exec]   http://download.eclipse.org/eclipse/downloads/drops/M20060609-1217/ecj.jar

     [exec] should be downloaded to:

     [exec]   depends/jars/ecj_3.2MAINT/ecj_3.2MAINT.jar

     [exec] Run "ant fetch-depends" to automatically fetch dependencies.
     [exec] Note: Some of Harmony's dependencies are licensed under terms other
     [exec] than the Apache License v2.

     [exec] Total time: 25 seconds

copy-depends:
     [echo] Copying VME to C:\continuum-1.0.2\apps\continuum\working-directory\6/classlib/deploy/jdk/jre
     [copy] Copying 44 files to C:\continuum-1.0.2\apps\continuum\working-directory\6\classlib\deploy\jdk\jre\bin\default

run-tests:
     [exec] Buildfile: build.xml

     [exec] test:
     [exec]      [echo] 
     [exec]      [echo] ========================================
     [exec]      [echo] Testing class libraries...
     [exec]      [echo] ========================================

     [exec] clean:

     [exec] copy-test-resources:
     [exec]     [mkdir] Created dir: C:\continuum-1.0.2\apps\continuum\working-directory\6\classlib\build\tests
     [exec]      [copy] Copying 64 files to C:\continuum-1.0.2\apps\continuum\working-directory\6\classlib\build\tests

     [exec] check-support-jars:

     [exec] check:
     [exec]      [echo] Checking for depends/jars/xalan-j_2.7.0/xalan.jar
     [exec]      [echo] Checking for depends/jars/xerces_2.8.0/resolver.jar
     [exec]      [echo] Checking for depends/jars/xerces_2.8.0/xercesImpl.jar
     [exec]      [echo] Checking for depends/jars/xerces_2.8.0/xml-apis.jar
     [exec]      [echo] Checking for depends/jars/junit_3.8.2/junit.jar
     [exec]      [echo] Checking for depends/jars/bcprov-jdk14-133/signed.bcprov.jar
     [exec]      [echo] Checking for depends/jars/icu4j_3.4.4/icu4j_3_4_4.jar
     [exec]      [echo] Checking for depends/jars/mx4j_3.0.1/mx4j.jar
     [exec]      [echo] Checking for depends/jars/mx4j_3.0.1/mx4j-remote.jar
     [exec]      [echo] Checking for depends/jars/ecj_3.2MAINT/ecj_3.2MAINT.jar

     [exec] BUILD FAILED
     [exec] C:\continuum-1.0.2\apps\continuum\working-directory\6\classlib\build.xml:105:
The following error occurred while executing this line:
     [exec] C:\continuum-1.0.2\apps\continuum\working-directory\6\classlib\make\build-test.xml:122:
The following error occurred while executing this line:
     [exec] C:\continuum-1.0.2\apps\continuum\working-directory\6\classlib\make\depends.xml:51:
The following error occurred while executing this line:
     [exec] C:\continuum-1.0.2\apps\continuum\working-directory\6\classlib\make\depends.xml:157:
...

     [exec] Missing dependency.  The jar from:

     [exec]   http://download.eclipse.org/eclipse/downloads/drops/M20060609-1217/ecj.jar

     [exec] should be downloaded to:

     [exec]   depends/jars/ecj_3.2MAINT/ecj_3.2MAINT.jar

     [exec] Run "ant fetch-depends" to automatically fetch dependencies.
     [exec] Note: Some of Harmony's dependencies are licensed under terms other
     [exec] than the Apache License v2.

     [exec] Total time: 1 second
     [echo] Tests.failed is set to ${tests.failed}

check-class-load-lists:

japi:

publish:
    [mkdir] Created dir: C:\publish\20060625-2202
    [mkdir] Created dir: C:\publish\20060625-2202\test

BUILD FAILED
C:\continuum-1.0.2\apps\continuum\working-directory\6\build.xml:342: C:\continuum-1.0.2\apps\continuum\working-directory\6\classlib\build\test_report\html
not found.

Total time: 30 seconds

****************************************************************************




Mime
View raw message