harmony-commits mailing list archives

Site index · List index
Message view « Date » · « Thread »
Top « Date » · « Thread »
From Apache Harmony Build <nom...@hursley.ibm.com>
Subject [continuum] BUILD SUCCESSFUL: Classlib/win.ia32 Build/Test
Date Mon, 26 Jun 2006 09:12:10 GMT
Online report : http://ibmonly.hursley.ibm.com/continuum/win.ia32/servlet/continuum/target/ProjectBuild.vm/view/ProjectBuild/id/6/buildId/1425
Build statistics:
  State: Ok
  Previous State: Failed
  Started at: Mon, 26 Jun 2006 10:02:25 +0100
  Finished at: Mon, 26 Jun 2006 10:11:43 +0100
  Total time: 9m 17s
  Build Trigger: Schedule
  Exit code: 0
  Building machine hostname: hy1
  Operating system : Windows XP(Service Pack 2)
  Java version : 1.5.0_06(Sun Microsystems Inc.)

Changes
                            classlib\modules\nio\src\test\java\org\apache\harmony\tests\java\nio\channels\SocketChannelTest.java
        
****************************************************************************
Output:
****************************************************************************
Buildfile: build.xml

build:
   [delete] Deleting directory C:\continuum-1.0.2\apps\continuum\working-directory\6\classlib\deploy
     [echo] Classlib revision is 417146
     [echo] Post process: ${is.post.process.host}
     [echo] JAPI: ${is.japi.ftp.host}
     [echo] Building with reference jdk/javac
     [exec] Buildfile: build.xml

     [exec] clean:

     [exec] clean-kernel-patternsets:

     [exec] clean-bin:

     [exec] call-modules-all:

     [exec] clean:
     [exec]    [delete] Excludesfile C:\continuum-1.0.2\apps\continuum\working-directory\6\classlib\deploy\build\patternsets\luni-kernel.txt not found.

     [exec] clean:
     [exec]    [delete] Excludesfile C:\continuum-1.0.2\apps\continuum\working-directory\6\classlib\deploy\build\patternsets\luni-kernel.txt not found.

     [exec] clean:
     [exec]    [delete] Excludesfile C:\continuum-1.0.2\apps\continuum\working-directory\6\classlib\deploy\build\patternsets\luni-kernel.txt not found.

     [exec] clean:
     [exec]    [delete] Excludesfile C:\continuum-1.0.2\apps\continuum\working-directory\6\classlib\deploy\build\patternsets\luni-kernel.txt not found.

     [exec] clean.native.includes:
     [exec]    [delete] C:\continuum-1.0.2\apps\continuum\working-directory\6\classlib\deploy\include not found.

     [exec] clean:
     [exec]    [delete] Excludesfile C:\continuum-1.0.2\apps\continuum\working-directory\6\classlib\deploy\build\patternsets\luni-kernel.txt not found.

     [exec] clean:
     [exec]    [delete] Excludesfile C:\continuum-1.0.2\apps\continuum\working-directory\6\classlib\deploy\build\patternsets\luni-kernel.txt not found.

     [exec] clean:
     [exec]    [delete] Excludesfile C:\continuum-1.0.2\apps\continuum\working-directory\6\classlib\deploy\build\patternsets\luni-kernel.txt not found.

     [exec] clean:
     [exec]    [delete] Excludesfile C:\continuum-1.0.2\apps\continuum\working-directory\6\classlib\deploy\build\patternsets\luni-kernel.txt not found.

     [exec] clean:
     [exec]    [delete] Excludesfile C:\continuum-1.0.2\apps\continuum\working-directory\6\classlib\deploy\build\patternsets\luni-kernel.txt not found.

     [exec] clean:
     [exec]    [delete] Excludesfile C:\continuum-1.0.2\apps\continuum\working-directory\6\classlib\deploy\build\patternsets\luni-kernel.txt not found.

     [exec] clean:

     [exec] clean:
     [exec]    [delete] Excludesfile C:\continuum-1.0.2\apps\continuum\working-directory\6\classlib\deploy\build\patternsets\luni-kernel.txt not found.

     [exec] clean.native.includes:
     [exec]    [delete] C:\continuum-1.0.2\apps\continuum\working-directory\6\classlib\deploy\include not found.
     [exec]    [delete] C:\continuum-1.0.2\apps\continuum\working-directory\6\classlib\deploy\jdk\include not found.

     [exec] clean:
     [exec]    [delete] Excludesfile C:\continuum-1.0.2\apps\continuum\working-directory\6\classlib\deploy\build\patternsets\luni-kernel.txt not found.

     [exec] clean:
     [exec]    [delete] Excludesfile C:\continuum-1.0.2\apps\continuum\working-directory\6\classlib\deploy\build\patternsets\luni-kernel.txt not found.

     [exec] clean:
     [exec]    [delete] Excludesfile C:\continuum-1.0.2\apps\continuum\working-directory\6\classlib\deploy\build\patternsets\luni-kernel.txt not found.
     [exec]    [delete] C:\continuum-1.0.2\apps\continuum\working-directory\6\classlib\modules\nio\bin\test not found.

     [exec] clean:
     [exec]    [delete] Excludesfile C:\continuum-1.0.2\apps\continuum\working-directory\6\classlib\deploy\build\patternsets\luni-kernel.txt not found.

     [exec] clean:
     [exec]    [delete] Excludesfile C:\continuum-1.0.2\apps\continuum\working-directory\6\classlib\deploy\build\patternsets\luni-kernel.txt not found.

     [exec] clean:
     [exec]    [delete] Excludesfile C:\continuum-1.0.2\apps\continuum\working-directory\6\classlib\deploy\build\patternsets\luni-kernel.txt not found.

     [exec] clean:

     [exec] clean:
     [exec]    [delete] Excludesfile C:\continuum-1.0.2\apps\continuum\working-directory\6\classlib\deploy\build\patternsets\luni-kernel.txt not found.

     [exec] clean:
     [exec]    [delete] Excludesfile C:\continuum-1.0.2\apps\continuum\working-directory\6\classlib\deploy\build\patternsets\luni-kernel.txt not found.

     [exec] clean:
     [exec]    [delete] Excludesfile C:\continuum-1.0.2\apps\continuum\working-directory\6\classlib\deploy\build\patternsets\luni-kernel.txt not found.

     [exec] clean:
     [exec]    [delete] Excludesfile C:\continuum-1.0.2\apps\continuum\working-directory\6\classlib\deploy\build\patternsets\luni-kernel.txt not found.

     [exec] clean:
     [exec]    [delete] Excludesfile C:\continuum-1.0.2\apps\continuum\working-directory\6\classlib\deploy\build\patternsets\luni-kernel.txt not found.

     [exec] clean:
     [exec]    [delete] Excludesfile C:\continuum-1.0.2\apps\continuum\working-directory\6\classlib\deploy\build\patternsets\luni-kernel.txt not found.

     [exec] clean:
     [exec]    [delete] Excludesfile C:\continuum-1.0.2\apps\continuum\working-directory\6\classlib\deploy\build\patternsets\luni-kernel.txt not found.

     [exec] call-modules-one:
     [exec]    [delete] Deleting 64 files from C:\continuum-1.0.2\apps\continuum\working-directory\6\classlib\build
     [exec]    [delete] Deleted 24 directories from C:\continuum-1.0.2\apps\continuum\working-directory\6\classlib\build

     [exec] clean-layout:
     [exec]    [delete] C:\continuum-1.0.2\apps\continuum\working-directory\6\classlib\deploy\jdk not found.

     [exec] clean:

     [exec] init:

     [exec] windows-properties:

     [exec] linux-properties:

     [exec] properties:

     [exec] make-clean:

     [exec] init:

     [exec] windows-properties:

     [exec] linux-properties:

     [exec] properties:

     [exec] copy-makefile-includes:
     [exec]     [mkdir] Created dir: C:\continuum-1.0.2\apps\continuum\working-directory\6\classlib\deploy\build\make
     [exec]      [copy] Copying 4 files to C:\continuum-1.0.2\apps\continuum\working-directory\6\classlib\deploy\build\make

     [exec]      [exec] Microsoft (R) Program Maintenance Utility Version 7.10.3077
     [exec]      [exec] Copyright (C) Microsoft Corporation.  All rights reserved.

     [exec]      [exec] 	cd auth
     [exec]      [exec] 	nmake /NOLOGO clean
     [exec]      [exec] 	del ..\..\shared\auth\auth_copyright.obj authwin32.obj *.res *.pdb  C:\continuum-1.0.2\apps\continuum\working-directory\6\classlib\deploy\lib\hyauth.lib C:\continuum-1.0.2\apps\continuum\working-directory\6\classlib\deploy\lib\hyauth.exp  ..\hyauth.dll ..\hyauth.pdb ..\hyauth.map    >nul 2>&1
     [exec]      [exec] 	cd ..
     [exec]      [exec] 	cd archive
     [exec]      [exec] 	nmake /NOLOGO clean
     [exec]      [exec] 	del ..\..\shared\archive\archive_copyright.obj ..\..\shared\archive\jclcrc32.obj  ..\..\shared\archive\zip.obj ..\..\shared\archive\adler32.obj ..\..\shared\archive\inflater.obj  ..\..\shared\archive\jarfile.obj ..\..\shared\archive\deflater.obj  ..\..\shared\archive\archiveglob.obj *.res *.pdb  C:\continuum-1.0.2\apps\continuum\working-directory\6\classlib\deploy\lib\hyarchive.lib C:\continuum-1.0.2\apps\continuum\working-directory\6\classlib\deploy\lib\hyarchive.exp  ..\hyarchive.dll ..\hyarchive.pdb ..\hyarchive.map    >nul 2>&1
     [exec]      [exec] 	cd ..
     [exec]      [exec] 	cd launcher
     [exec]      [exec] 	nmake /NOLOGO clean
     [exec]      [exec] 	nmake /NOLOGO -f makefile.javae clean
     [exec]      [exec] 	del ..\..\shared\launcher\launcher_copyright.obj ..\..\shared\launcher\cmain.obj  ..\..\shared\launcher\main.obj ..\..\shared\launcher\strbuf.obj ..\..\shared\launcher\libhlp.obj *.res *.pdb         ..\java.exe ..\java.pdb >nul 2>&1
     [exec]      [exec] 	nmake /NOLOGO -f makefile.javaw clean
     [exec]      [exec] 	del ..\..\shared\launcher\launcher_copyright.obj ..\..\shared\launcher\main.obj  winmain.obj ..\..\shared\launcher\strbuf.obj ..\..\shared\launcher\libhlp.obj *.res *.pdb         ..\javaw.exe ..\javaw.pdb >nul 2>&1
     [exec]      [exec] 	cd ..
     [exec]      [exec] 	cd common
     [exec]      [exec] 	nmake /NOLOGO clean
     [exec]      [exec] 	del ..\..\shared\common\libglob.obj ..\..\shared\common\iohelp.obj  locklbl.obj lock386.obj  ..\..\shared\common\utf8decode.obj ..\..\shared\common\utf8encode.obj *.res *.pdb  C:\continuum-1.0.2\apps\continuum\working-directory\6\classlib\deploy\lib\hycommon.lib C:\continuum-1.0.2\apps\continuum\working-directory\6\classlib\deploy\lib\hycommon.exp        >nul 2>&1
     [exec]      [exec] 	cd ..
     [exec]      [exec] 	cd luni
     [exec]      [exec] 	nmake /NOLOGO clean
     [exec]      [exec] 	del ..\..\shared\luni\luni_copyright.obj ..\..\shared\luni\file.obj procimpl.obj  ..\..\shared\luni\oos.obj  ..\..\shared\luni\nethelp.obj ..\..\shared\luni\floatbits.obj  ..\..\shared\luni\ois.obj helpers.obj ..\..\shared\luni\math.obj  ..\..\shared\luni\luniglob.obj ..\..\shared\luni\proxy.obj ..\..\shared\luni\netif.obj  ..\..\shared\luni\cbigint.obj ..\..\shared\luni\dblparse.obj ..\..\shared\luni\fltparse.obj  ..\..\shared\luni\process.obj ..\..\shared\luni\bigint.obj ..\..\shared\luni\osc.obj  ..\..\shared\luni\socket.obj ..\..\shared\luni\inetadds.obj  ..\..\shared\luni\filedesc.obj ..\..\shared\luni\timezone.obj  OSFileSystemWin32.obj  ..\..\shared\luni\OSFileSystem.obj OSMemoryWin32.obj OSMemory.obj  ..\..\shared\luni\OSNetworkSystem.obj OSNetworkSystemWin32.obj *.res *.pdb  C:\continuum-1.0.2\apps\continuum\working-directory\6\classlib\deploy\lib\hyluni.lib C:\continuum-1.0.2\apps\continuum\working-directory\6\classlib\deploy\lib\hyluni.exp  ..\hyluni.dll ..\hyluni.pdb ..\hyluni.map    >nul 2>&1
     [exec]      [exec] 	cd ..
     [exec]      [exec] 	cd text
     [exec]      [exec] 	nmake /NOLOGO clean
     [exec]      [exec] 	del text_copyright.obj ..\..\shared\text\BidiWrapper.obj *.res *.pdb  C:\continuum-1.0.2\apps\continuum\working-directory\6\classlib\deploy\lib\hytext.lib C:\continuum-1.0.2\apps\continuum\working-directory\6\classlib\deploy\lib\hytext.exp  ..\hytext.dll ..\hytext.pdb ..\hytext.map    >nul 2>&1
     [exec]      [exec] 	cd ..
     [exec]      [exec] 	cd vmi
     [exec]      [exec] 	nmake /NOLOGO clean
     [exec]      [exec] 	del ..\..\shared\vmi\vmi_copyright.obj ..\..\shared\vmi\vmi.obj *.res *.pdb  C:\continuum-1.0.2\apps\continuum\working-directory\6\classlib\deploy\lib\vmi.lib C:\continuum-1.0.2\apps\continuum\working-directory\6\classlib\deploy\lib\vmi.exp        >nul 2>&1
     [exec]      [exec] 	cd ..
     [exec]      [exec] 	cd fdlibm
     [exec]      [exec] 	nmake /NOLOGO clean
     [exec]      [exec] 	del *.obj dist\*.obj
     [exec]      [exec] The system cannot find the file specified.
     [exec]      [exec] 	del C:\continuum-1.0.2\apps\continuum\working-directory\6\classlib\deploy\lib\hyfdlibm.lib
     [exec]      [exec] The system cannot find the file specified.
     [exec]      [exec] 	del C:\continuum-1.0.2\apps\continuum\working-directory\6\classlib\deploy\lib\hyfdlibm.pdb
     [exec]      [exec] The system cannot find the file specified.
     [exec]      [exec] 	cd ..
     [exec]      [exec] 	cd sig
     [exec]      [exec] 	nmake /NOLOGO clean
     [exec]      [exec] 	del ..\..\shared\sig\hysig_copyright.obj hysigwin.obj *.res *.pdb  C:\continuum-1.0.2\apps\continuum\working-directory\6\classlib\deploy\lib\hysig.lib C:\continuum-1.0.2\apps\continuum\working-directory\6\classlib\deploy\lib\hysig.exp  ..\hysig.dll ..\hysig.pdb ..\hysig.map    >nul 2>&1
     [exec]      [exec] 	cd ..
     [exec]      [exec] 	cd pool
     [exec]      [exec] 	nmake /NOLOGO clean
     [exec]      [exec] 	del ..\..\shared\pool\pool.obj ..\..\shared\pool\pool_cap.obj *.res *.pdb  C:\continuum-1.0.2\apps\continuum\working-directory\6\classlib\deploy\lib\hypool.lib C:\continuum-1.0.2\apps\continuum\working-directory\6\classlib\deploy\lib\hypool.exp        >nul 2>&1
     [exec]      [exec] 	cd ..
     [exec]      [exec] 	cd port
     [exec]      [exec] 	nmake /NOLOGO clean
     [exec]      [exec] 	del ..\..\shared\port\port_copyright.obj hycpu.obj ..\..\shared\port\hyerror.obj  hyerrorhelpers.obj ..\..\shared\port\hyexit.obj hyfile.obj hyfiletext.obj  ..\..\shared\port\hygp.obj hyipcmutex.obj hymem.obj hymmap.obj  ..\..\shared\port\hynls.obj hynlshelpers.obj hyosdump.obj ..\..\shared\port\hyport.obj  ..\..\shared\port\hyportcontrol.obj hyportptb.obj hyshmem.obj hyshsem.obj  hysignal.obj hysl.obj hysock.obj ..\..\shared\port\hystr.obj  ..\..\shared\port\hystrftime.obj ..\..\shared\port\hystsl.obj hysysinfo.obj hytime.obj  ..\..\shared\port\hytlshelpers.obj hytty.obj hyvmem.obj *.res *.pdb  C:\continuum-1.0.2\apps\continuum\working-directory\6\classlib\deploy\lib\hyprt.lib C:\continuum-1.0.2\apps\continuum\working-directory\6\classlib\deploy\lib\hyprt.exp  ..\hyprt.dll ..\hyprt.pdb ..\hyprt.map    >nul 2>&1
     [exec]      [exec] 	cd ..
     [exec]      [exec] 	cd thread
     [exec]      [exec] 	nmake /NOLOGO clean
     [exec]      [exec] 	del ..\..\shared\thread\thread_copyright.obj thrhelp.obj thrspinlock.obj hythread.obj  ..\..\shared\thread\hythreadinspect.obj ..\..\shared\thread\rwmutex.obj thrdsup.obj  ..\..\shared\thread\thrprof.obj *.res *.pdb  C:\continuum-1.0.2\apps\continuum\working-directory\6\classlib\deploy\lib\hythr.lib C:\continuum-1.0.2\apps\continuum\working-directory\6\classlib\deploy\lib\hythr.exp  ..\hythr.dll ..\hythr.pdb ..\hythr.map    >nul 2>&1
     [exec]      [exec] 	cd ..
     [exec]      [exec] 	cd zip
     [exec]      [exec] 	nmake /NOLOGO clean
     [exec]      [exec] 	del ..\..\shared\zip\zcpool.obj ..\..\shared\zip\zipalloc.obj  ..\..\shared\zip\zipcache.obj ..\..\shared\zip\zipsup.obj *.res *.pdb  C:\continuum-1.0.2\apps\continuum\working-directory\6\classlib\deploy\lib\hyzip.lib C:\continuum-1.0.2\apps\continuum\working-directory\6\classlib\deploy\lib\hyzip.exp        >nul 2>&1
     [exec]      [exec] 	cd ..
     [exec]      [exec] 	cd zlib
     [exec]      [exec] 	nmake /NOLOGO clean
     [exec]      [exec] 	del ..\..\shared\zlib\zlib_copyright.obj dist\adler32.obj dist\compress.obj  dist\crc32.obj dist\deflate.obj dist\gzio.obj dist\infback.obj  dist\inffast.obj dist\inflate.obj dist\inftrees.obj dist\trees.obj  dist\uncompr.obj dist\zutil.obj *.res *.pdb  C:\continuum-1.0.2\apps\continuum\working-directory\6\classlib\deploy\lib\hyzlib.lib C:\continuum-1.0.2\apps\continuum\working-directory\6\classlib\deploy\lib\hyzlib.exp  ..\hyzlib.dll ..\hyzlib.pdb ..\hyzlib.map    >nul 2>&1
     [exec]      [exec] 	cd ..
     [exec]      [exec] 	cd vmls
     [exec]      [exec] 	nmake /NOLOGO clean
     [exec]      [exec] 	del ..\..\shared\vmls\vmls.obj *.res *.pdb  C:\continuum-1.0.2\apps\continuum\working-directory\6\classlib\deploy\lib\hyvmls.lib C:\continuum-1.0.2\apps\continuum\working-directory\6\classlib\deploy\lib\hyvmls.exp        >nul 2>&1
     [exec]      [exec] 	cd ..

     [exec] clean.native:

     [exec]      [exec] Microsoft (R) Program Maintenance Utility Version 7.10.3077
     [exec]      [exec] Copyright (C) Microsoft Corporation.  All rights reserved.

     [exec]      [exec] 	del prefs_copyright.obj PreferencesImpl.obj *.res *.pdb  C:\continuum-1.0.2\apps\continuum\working-directory\6\classlib\deploy\lib\hyprefs.lib C:\continuum-1.0.2\apps\continuum\working-directory\6\classlib\deploy\lib\hyprefs.exp  ..\hyprefs.dll ..\hyprefs.pdb ..\hyprefs.map    >nul 2>&1

     [exec] clean-makefile-includes:
     [exec]    [delete] Deleting directory C:\continuum-1.0.2\apps\continuum\working-directory\6\classlib\deploy\build\make

     [exec] clean-includes:

     [exec] clean.native.includes:
     [exec]    [delete] C:\continuum-1.0.2\apps\continuum\working-directory\6\classlib\deploy\include not found.

     [exec] clean.native.includes:
     [exec]    [delete] C:\continuum-1.0.2\apps\continuum\working-directory\6\classlib\deploy\include not found.
     [exec]    [delete] C:\continuum-1.0.2\apps\continuum\working-directory\6\classlib\deploy\jdk\include not found.

     [exec] clean-overlay-oss:

     [exec] clean-layout:
     [exec]    [delete] C:\continuum-1.0.2\apps\continuum\working-directory\6\classlib\deploy\jdk not found.

     [exec] clean:

     [exec] build:
     [exec]      [echo] 
     [exec]      [echo] ========================================
     [exec]      [echo] Building Java component archives...
     [exec]      [echo] ========================================

     [exec] copy-kernel-patternsets:
     [exec]     [mkdir] Created dir: C:\continuum-1.0.2\apps\continuum\working-directory\6\classlib\deploy\build\patternsets
     [exec]      [copy] Copying 1 file to C:\continuum-1.0.2\apps\continuum\working-directory\6\classlib\deploy\build\patternsets
     [exec]      [copy] Copying 1 file to C:\continuum-1.0.2\apps\continuum\working-directory\6\classlib\deploy\build\patternsets

     [exec] prepare-depends:

     [exec] check:
     [exec]      [echo] Checking for depends/jars/xalan-j_2.7.0/xalan.jar
     [exec]      [echo] Checking for depends/jars/xerces_2.8.0/resolver.jar
     [exec]      [echo] Checking for depends/jars/xerces_2.8.0/xercesImpl.jar
     [exec]      [echo] Checking for depends/jars/xerces_2.8.0/xml-apis.jar
     [exec]      [echo] Checking for depends/jars/junit_3.8.2/junit.jar
     [exec]      [echo] Checking for depends/jars/bcprov-jdk14-133/signed.bcprov.jar
     [exec]      [echo] Checking for depends/jars/icu4j_3.4.4/icu4j_3_4_4.jar
     [exec]      [echo] Checking for depends/jars/mx4j_3.0.1/mx4j.jar
     [exec]      [echo] Checking for depends/jars/mx4j_3.0.1/mx4j-remote.jar
     [exec]      [echo] Checking for depends/jars/ecj_3.2MAINT/ecj_3.2MAINT.jar

     [exec] create-unsigned-bcprov-jar:

     [exec] check-win:
     [exec]      [echo] Checking for depends/libs/win.IA32/msvcr71.dll

     [exec] compile:
     [exec]     [mkdir] Created dir: C:\continuum-1.0.2\apps\continuum\working-directory\6\classlib\build
     [exec]     [javac] Compiling 2900 source files to C:\continuum-1.0.2\apps\continuum\working-directory\6\classlib\build
     [exec]     [javac] Note: Some input files use or override a deprecated API.
     [exec]     [javac] Note: Recompile with -Xlint:deprecation for details.
     [exec]     [javac] Note: Some input files use unchecked or unsafe operations.
     [exec]     [javac] Note: Recompile with -Xlint:unchecked for details.
     [exec]     [mkdir] Created dir: C:\continuum-1.0.2\apps\continuum\working-directory\6\classlib\deploy\jdk\jre\lib\boot

     [exec] call-modules-all:

     [exec] compile.java:
     [exec]      [echo] Compiling ACCESSIBILITY classes

     [exec] build.jar:
     [exec]       [jar] Building jar: C:\continuum-1.0.2\apps\continuum\working-directory\6\classlib\deploy\jdk\jre\lib\boot\accessibility.jar

     [exec] build:

     [exec] compile.java:
     [exec]      [echo] Compiling ANNOTATION classes

     [exec] build.jar:
     [exec]       [jar] Building jar: C:\continuum-1.0.2\apps\continuum\working-directory\6\classlib\deploy\jdk\jre\lib\boot\annotation.jar

     [exec] build:

     [exec] compile.java:
     [exec]      [echo] Compiling APPLET classes

     [exec] build.jar:
     [exec]       [jar] Building jar: C:\continuum-1.0.2\apps\continuum\working-directory\6\classlib\deploy\jdk\jre\lib\boot\applet.jar

     [exec] build:

     [exec] compile.java:
     [exec]      [echo] Compiling ARCHIVE classes

     [exec] build.jar:
     [exec]       [jar] Building jar: C:\continuum-1.0.2\apps\continuum\working-directory\6\classlib\deploy\jdk\jre\lib\boot\archive.jar

     [exec] build:

     [exec] compile.java:
     [exec]      [echo] Compiling AUTH classes

     [exec] build.jar:
     [exec]       [jar] Building jar: C:\continuum-1.0.2\apps\continuum\working-directory\6\classlib\deploy\jdk\jre\lib\boot\auth.jar

     [exec] build:

     [exec] compile.java:
     [exec]      [echo] Compiling AWT classes

     [exec] build.jar:
     [exec]       [jar] Building jar: C:\continuum-1.0.2\apps\continuum\working-directory\6\classlib\deploy\jdk\jre\lib\boot\awt.jar

     [exec] build:

     [exec] compile.java:
     [exec]      [echo] Compiling BEANS classes

     [exec] build.jar:
     [exec]       [jar] Building jar: C:\continuum-1.0.2\apps\continuum\working-directory\6\classlib\deploy\jdk\jre\lib\boot\beans.jar

     [exec] build:

     [exec] compile.java:
     [exec]      [echo] Compiling CRYPTO classes

     [exec] build.jar:
     [exec]       [jar] Building jar: C:\continuum-1.0.2\apps\continuum\working-directory\6\classlib\deploy\jdk\jre\lib\boot\crypto.jar

     [exec] build:

     [exec] compile.java:
     [exec]      [echo] Compiling JNDI classes

     [exec] build.jar:
     [exec]       [jar] Building jar: C:\continuum-1.0.2\apps\continuum\working-directory\6\classlib\deploy\jdk\jre\lib\boot\jndi.jar

     [exec] build:

     [exec] copy.resources:
     [exec]      [copy] Copying 1 file to C:\continuum-1.0.2\apps\continuum\working-directory\6\classlib\deploy\jdk\jre\lib

     [exec] compile.java:
     [exec]      [echo] Compiling LOGGING classes

     [exec] build.jar:
     [exec]       [jar] Building jar: C:\continuum-1.0.2\apps\continuum\working-directory\6\classlib\deploy\jdk\jre\lib\boot\logging.jar

     [exec] build:

     [exec] build:
     [exec]       [jar] Building jar: C:\continuum-1.0.2\apps\continuum\working-directory\6\classlib\deploy\jdk\jre\lib\boot\luni-kernel-stubs.jar

     [exec] compile.java:
     [exec]      [echo] Compiling LUNI classes

     [exec] build.jar:
     [exec]       [jar] Building jar: C:\continuum-1.0.2\apps\continuum\working-directory\6\classlib\deploy\jdk\jre\lib\boot\luni.jar

     [exec] copy.resources:
     [exec]      [copy] Copying 2 files to C:\continuum-1.0.2\apps\continuum\working-directory\6\classlib\build

     [exec] build:

     [exec] compile.java:
     [exec]      [echo] Compiling MATH classes

     [exec] build.jar:
     [exec]       [jar] Building jar: C:\continuum-1.0.2\apps\continuum\working-directory\6\classlib\deploy\jdk\jre\lib\boot\math.jar

     [exec] build:

     [exec] compile.java:
     [exec]      [echo] Compiling MISC classes

     [exec] build.jar:
     [exec]       [jar] Building jar: C:\continuum-1.0.2\apps\continuum\working-directory\6\classlib\deploy\jdk\jre\lib\boot\misc.jar

     [exec] build:

     [exec] compile.java:
     [exec]      [echo] Compiling NIO classes

     [exec] build.jar:
     [exec]       [jar] Building jar: C:\continuum-1.0.2\apps\continuum\working-directory\6\classlib\deploy\jdk\jre\lib\boot\nio.jar

     [exec] build:

     [exec] compile.java:
     [exec]      [echo] Compiling NIO_CHAR classes

     [exec] build.jar:
     [exec]       [jar] Building jar: C:\continuum-1.0.2\apps\continuum\working-directory\6\classlib\deploy\jdk\jre\lib\boot\nio_char.jar

     [exec] build:

     [exec] compile.java:
     [exec]      [echo] Compiling PREFS classes

     [exec] build.jar:
     [exec]       [jar] Building jar: C:\continuum-1.0.2\apps\continuum\working-directory\6\classlib\deploy\jdk\jre\lib\boot\prefs.jar

     [exec] build:

     [exec] compile.java:
     [exec]      [echo] Compiling REGEX classes

     [exec] build.jar:
     [exec]       [jar] Building jar: C:\continuum-1.0.2\apps\continuum\working-directory\6\classlib\deploy\jdk\jre\lib\boot\regex.jar

     [exec] build:

     [exec] build:
     [exec]       [jar] Building jar: C:\continuum-1.0.2\apps\continuum\working-directory\6\classlib\deploy\jdk\jre\lib\boot\security-kernel-stubs.jar

     [exec] compile.java:
     [exec]      [echo] Compiling SECURITY classes

     [exec] build.jar:
     [exec]       [jar] Building jar: C:\continuum-1.0.2\apps\continuum\working-directory\6\classlib\deploy\jdk\jre\lib\boot\security.jar

     [exec] build:

     [exec] compile.java:
     [exec]      [echo] Compiling SQL classes

     [exec] build.jar:
     [exec]       [jar] Building jar: C:\continuum-1.0.2\apps\continuum\working-directory\6\classlib\deploy\jdk\jre\lib\boot\sql.jar

     [exec] build:

     [exec] compile.java:
     [exec]      [echo] Compiling SWING classes

     [exec] build.jar:
     [exec]       [jar] Building jar: C:\continuum-1.0.2\apps\continuum\working-directory\6\classlib\deploy\jdk\jre\lib\boot\swing.jar

     [exec] build:

     [exec] compile.java:
     [exec]      [echo] Compiling TEXT classes

     [exec] build.jar:
     [exec]       [jar] Building jar: C:\continuum-1.0.2\apps\continuum\working-directory\6\classlib\deploy\jdk\jre\lib\boot\text.jar

     [exec] build:

     [exec] compile.java:
     [exec]      [echo] Compiling TOOLS classes
     [exec]     [mkdir] Created dir: C:\continuum-1.0.2\apps\continuum\working-directory\6\classlib\deploy\jdk\lib
     [exec]     [javac] Compiling 9 source files to C:\continuum-1.0.2\apps\continuum\working-directory\6\classlib\build

     [exec] build.jar:
     [exec]       [jar] Building jar: C:\continuum-1.0.2\apps\continuum\working-directory\6\classlib\deploy\jdk\lib\tools.jar

     [exec] build:

     [exec] compile.java:
     [exec]      [echo] Compiling X-NET classes

     [exec] build.jar:
     [exec]       [jar] Building jar: C:\continuum-1.0.2\apps\continuum\working-directory\6\classlib\deploy\jdk\jre\lib\boot\x-net.jar

     [exec] build:

     [exec] compile.java:
     [exec]      [echo] Compiling RMI classes

     [exec] build.jar:
     [exec]       [jar] Building jar: C:\continuum-1.0.2\apps\continuum\working-directory\6\classlib\deploy\jdk\jre\lib\boot\rmi.jar

     [exec] build:

     [exec] call-modules-one:

     [exec] layout:
     [exec]     [mkdir] Created dir: C:\continuum-1.0.2\apps\continuum\working-directory\6\classlib\deploy\jdk\jre\bin
     [exec]     [mkdir] Created dir: C:\continuum-1.0.2\apps\continuum\working-directory\6\classlib\deploy\jdk\jre\lib\ext
     [exec]     [mkdir] Created dir: C:\continuum-1.0.2\apps\continuum\working-directory\6\classlib\deploy\jdk\jre\lib\security
     [exec]      [copy] Copying 11 files to C:\continuum-1.0.2\apps\continuum\working-directory\6\classlib\deploy\jdk\jre\lib\boot
     [exec]      [copy] Copying C:\continuum-1.0.2\apps\continuum\working-directory\6\classlib\depends\jars\mx4j_3.0.1\mx4j-remote.jar to C:\continuum-1.0.2\apps\continuum\working-directory\6\classlib\deploy\jdk\jre\lib\boot\mx4j_3.0.1\mx4j-remote.jar
     [exec]      [copy] Copying C:\continuum-1.0.2\apps\continuum\working-directory\6\classlib\depends\jars\xerces_2.8.0\xercesImpl.jar to C:\continuum-1.0.2\apps\continuum\working-directory\6\classlib\deploy\jdk\jre\lib\boot\xerces_2.8.0\xercesImpl.jar
     [exec]      [copy] Copying C:\continuum-1.0.2\apps\continuum\working-directory\6\classlib\depends\manifests\xerces_2.8.0\META-INF\MANIFEST.MF to C:\continuum-1.0.2\apps\continuum\working-directory\6\classlib\deploy\jdk\jre\lib\boot\xerces_2.8.0\META-INF\MANIFEST.MF
     [exec]      [copy] Copying C:\continuum-1.0.2\apps\continuum\working-directory\6\classlib\depends\manifests\mx4j_3.0.1\META-INF\MANIFEST.MF to C:\continuum-1.0.2\apps\continuum\working-directory\6\classlib\deploy\jdk\jre\lib\boot\mx4j_3.0.1\META-INF\MANIFEST.MF
     [exec]      [copy] Copying C:\continuum-1.0.2\apps\continuum\working-directory\6\classlib\depends\jars\xerces_2.8.0\xml-apis.jar to C:\continuum-1.0.2\apps\continuum\working-directory\6\classlib\deploy\jdk\jre\lib\boot\xerces_2.8.0\xml-apis.jar
     [exec]      [copy] Copying C:\continuum-1.0.2\apps\continuum\working-directory\6\classlib\depends\jars\mx4j_3.0.1\mx4j.jar to C:\continuum-1.0.2\apps\continuum\working-directory\6\classlib\deploy\jdk\jre\lib\boot\mx4j_3.0.1\mx4j.jar
     [exec]      [copy] Copying C:\continuum-1.0.2\apps\continuum\working-directory\6\classlib\depends\jars\xerces_2.8.0\resolver.jar to C:\continuum-1.0.2\apps\continuum\working-directory\6\classlib\deploy\jdk\jre\lib\boot\xerces_2.8.0\resolver.jar
     [exec]      [copy] Copying C:\continuum-1.0.2\apps\continuum\working-directory\6\classlib\depends\jars\xalan-j_2.7.0\xalan.jar to C:\continuum-1.0.2\apps\continuum\working-directory\6\classlib\deploy\jdk\jre\lib\boot\xalan-j_2.7.0\xalan.jar
     [exec]      [copy] Copying C:\continuum-1.0.2\apps\continuum\working-directory\6\classlib\depends\jars\icu4jni-3.4.jar to C:\continuum-1.0.2\apps\continuum\working-directory\6\classlib\deploy\jdk\jre\lib\boot\icu4jni-3.4.jar
     [exec]      [copy] Copying C:\continuum-1.0.2\apps\continuum\working-directory\6\classlib\depends\jars\icu4j_3.4.4\icu4j_3_4_4.jar to C:\continuum-1.0.2\apps\continuum\working-directory\6\classlib\deploy\jdk\jre\lib\boot\icu4j_3.4.4\icu4j_3_4_4.jar
     [exec]      [copy] Copying C:\continuum-1.0.2\apps\continuum\working-directory\6\classlib\depends\manifests\xalan-j_2.7.0\META-INF\MANIFEST.MF to C:\continuum-1.0.2\apps\continuum\working-directory\6\classlib\deploy\jdk\jre\lib\boot\xalan-j_2.7.0\META-INF\MANIFEST.MF
     [exec]      [copy] Copying 1 file to C:\continuum-1.0.2\apps\continuum\working-directory\6\classlib\deploy\jdk\jre\lib\ext
     [exec]      [copy] Copying C:\continuum-1.0.2\apps\continuum\working-directory\6\classlib\depends\jars\bcprov-jdk14-133\bcprov.jar to C:\continuum-1.0.2\apps\continuum\working-directory\6\classlib\deploy\jdk\jre\lib\ext\bcprov.jar
     [exec]      [copy] Copying 1 file to C:\continuum-1.0.2\apps\continuum\working-directory\6\classlib\deploy\jdk\lib
     [exec]      [copy] Copying C:\continuum-1.0.2\apps\continuum\working-directory\6\classlib\depends\jars\ecj_3.2MAINT\ecj_3.2MAINT.jar to C:\continuum-1.0.2\apps\continuum\working-directory\6\classlib\deploy\jdk\lib\ecj_3.2MAINT.jar
     [exec]      [copy] Copying 1 file to C:\continuum-1.0.2\apps\continuum\working-directory\6\classlib\deploy\jdk\jre\lib\boot
     [exec]      [copy] Copying 2 files to C:\continuum-1.0.2\apps\continuum\working-directory\6\classlib\deploy\jdk\jre\lib\security

     [exec] build:
     [exec]      [echo] 
     [exec]      [echo] ========================================
     [exec]      [echo] Building native libs and executables...
     [exec]      [echo] ========================================

     [exec] init:

     [exec] windows-properties:

     [exec] linux-properties:

     [exec] properties:

     [exec] overlay-oss:
     [exec]     [unzip] Expanding: C:\continuum-1.0.2\apps\continuum\working-directory\6\classlib\depends\oss\fdlibm_5.2.zip into C:\continuum-1.0.2\apps\continuum\working-directory\6\classlib\native-src\win.IA32\fdlibm\dist
     [exec]     [unzip] Expanding: C:\continuum-1.0.2\apps\continuum\working-directory\6\classlib\depends\oss\zlib_1.2.3.zip into C:\continuum-1.0.2\apps\continuum\working-directory\6\classlib\native-src\win.IA32\zlib\dist
     [exec]     [mkdir] Created dir: C:\continuum-1.0.2\apps\continuum\working-directory\6\classlib\native-src\win.IA32\text\unicode
     [exec]     [unzip] Expanding: C:\continuum-1.0.2\apps\continuum\working-directory\6\classlib\depends\oss\icu4c-3.4-harmony.zip into C:\continuum-1.0.2\apps\continuum\working-directory\6\classlib\native-src\win.IA32\text\unicode

     [exec] copy-includes:

     [exec] copy.native.includes:
     [exec]      [copy] Copying 1 file to C:\continuum-1.0.2\apps\continuum\working-directory\6\classlib\deploy\include

     [exec] copy.native.includes:
     [exec]      [copy] Copying 10 files to C:\continuum-1.0.2\apps\continuum\working-directory\6\classlib\deploy\include
     [exec]      [copy] Copying 2 files to C:\continuum-1.0.2\apps\continuum\working-directory\6\classlib\deploy\jdk\include

     [exec] copy.native.includes.windows:
     [exec]      [copy] Copying 4 files to C:\continuum-1.0.2\apps\continuum\working-directory\6\classlib\deploy\include

     [exec] copy.native.includes.linux:

     [exec] make-all:
     [exec]     [mkdir] Created dir: C:\continuum-1.0.2\apps\continuum\working-directory\6\classlib\deploy\lib

     [exec] init:

     [exec] windows-properties:

     [exec] linux-properties:

     [exec] properties:

     [exec] copy-makefile-includes:
     [exec]     [mkdir] Created dir: C:\continuum-1.0.2\apps\continuum\working-directory\6\classlib\deploy\build\make
     [exec]      [copy] Copying 4 files to C:\continuum-1.0.2\apps\continuum\working-directory\6\classlib\deploy\build\make

     [exec]      [exec] Microsoft (R) Program Maintenance Utility Version 7.10.3077
     [exec]      [exec] Copyright (C) Microsoft Corporation.  All rights reserved.

     [exec]      [exec] 	cd sig
     [exec]      [exec] 	nmake /NOLOGO
     [exec]      [exec] 	lib /NOLOGO -subsystem:windows -out:C:\continuum-1.0.2\apps\continuum\working-directory\6\classlib\deploy\lib\hysig.lib   -def:hysig.def -machine:i386  ..\..\shared\sig\hysig_copyright.obj hysigwin.obj hysig.res 
     [exec]      [exec]    Creating library C:\continuum-1.0.2\apps\continuum\working-directory\6\classlib\deploy\lib\hysig.lib and object C:\continuum-1.0.2\apps\continuum\working-directory\6\classlib\deploy\lib\hysig.exp
     [exec]      [exec] 	link  /debug /opt:icf /opt:ref /INCREMENTAL:NO /NOLOGO  -entry:_DllMainCRTStartup@12 -dll /BASE:0x13100000 -machine:i386  /comment:"Signal handling support DLL. (c) Copyright 1993, 2005 The Apache Software Foundation or its licensors, as applicable."  -subsystem:windows -out:..\hysig.dll -map:..\hysig.map  ..\..\shared\sig\hysig_copyright.obj hysigwin.obj hysig.res    kernel32.lib  ws2_32.lib advapi32.lib user32.lib gdi32.lib  comdlg32.lib winspool.lib  C:\continuum-1.0.2\apps\continuum\working-directory\6\classlib\deploy\lib\hysig.exp
     [exec]      [exec] 	cd ..
     [exec]      [exec] 	cd pool
     [exec]      [exec] 	nmake /NOLOGO
     [exec]      [exec] 	lib /NOLOGO -subsystem:windows -out:C:\continuum-1.0.2\apps\continuum\working-directory\6\classlib\deploy\lib\hypool.lib   -machine:i386  ..\..\shared\pool\pool.obj ..\..\shared\pool\pool_cap.obj  
     [exec]      [exec] 	cd ..
     [exec]      [exec] 	cd common
     [exec]      [exec] 	nmake /NOLOGO
     [exec]      [exec] 	lib /NOLOGO -subsystem:windows -out:C:\continuum-1.0.2\apps\continuum\working-directory\6\classlib\deploy\lib\hycommon.lib   -machine:i386  ..\..\shared\common\libglob.obj ..\..\shared\common\iohelp.obj  locklbl.obj lock386.obj  ..\..\shared\common\utf8decode.obj ..\..\shared\common\utf8encode.obj  
     [exec]      [exec] 	cd ..
     [exec]      [exec] 	cd thread
     [exec]      [exec] 	nmake /NOLOGO
     [exec]      [exec] 	lib /NOLOGO -subsystem:windows -out:C:\continuum-1.0.2\apps\continuum\working-directory\6\classlib\deploy\lib\hythr.lib   -def:hythr.def -machine:i386  ..\..\shared\thread\thread_copyright.obj thrhelp.obj thrspinlock.obj hythread.obj  ..\..\shared\thread\hythreadinspect.obj ..\..\shared\thread\rwmutex.obj thrdsup.obj  ..\..\shared\thread\thrprof.obj hythr.res C:\continuum-1.0.2\apps\continuum\working-directory\6\classlib\deploy\lib\hypool.lib C:\continuum-1.0.2\apps\continuum\working-directory\6\classlib\deploy\lib\hycommon.lib
     [exec]      [exec]    Creating library C:\continuum-1.0.2\apps\continuum\working-directory\6\classlib\deploy\lib\hythr.lib and object C:\continuum-1.0.2\apps\continuum\working-directory\6\classlib\deploy\lib\hythr.exp
     [exec]      [exec] 	link  /debug /opt:icf /opt:ref /INCREMENTAL:NO /NOLOGO  -entry:_DllMainCRTStartup@12 -dll /BASE:0x11500000 -machine:i386  /comment:"Thread support library. (c) Copyright 1993, 2005 The Apache Software Foundation or its licensors, as applicable."  -subsystem:windows -out:..\hythr.dll -map:..\hythr.map  ..\..\shared\thread\thread_copyright.obj thrhelp.obj thrspinlock.obj hythread.obj  ..\..\shared\thread\hythreadinspect.obj ..\..\shared\thread\rwmutex.obj thrdsup.obj  ..\..\shared\thread\thrprof.obj hythr.res C:\continuum-1.0.2\apps\continuum\working-directory\6\classlib\deploy\lib\hypool.lib C:\continuum-1.0.2\apps\continuum\working-directory\6\classlib\deploy\lib\hycommon.lib   kernel32.lib  ws2_32.lib advapi32.lib user32.lib gdi32.lib  comdlg32.lib winspool.lib  C:\continuum-1.0.2\apps\continuum\working-directory\6\classlib\deploy\lib\hythr.exp
     [exec]      [exec] 	cd ..
     [exec]      [exec] 	cd port
     [exec]      [exec] 	nmake /NOLOGO
     [exec]      [exec] 	lib /NOLOGO -subsystem:windows -out:C:\continuum-1.0.2\apps\continuum\working-directory\6\classlib\deploy\lib\hyprt.lib   -def:hyprt.def -machine:i386  ..\..\shared\port\port_copyright.obj hycpu.obj ..\..\shared\port\hyerror.obj  hyerrorhelpers.obj ..\..\shared\port\hyexit.obj hyfile.obj hyfiletext.obj  ..\..\shared\port\hygp.obj hyipcmutex.obj hymem.obj hymmap.obj  ..\..\shared\port\hynls.obj hynlshelpers.obj hyosdump.obj ..\..\shared\port\hyport.obj  ..\..\shared\port\hyportcontrol.obj hyportptb.obj hyshmem.obj hyshsem.obj  hysignal.obj hysl.obj hysock.obj ..\..\shared\port\hystr.obj  ..\..\shared\port\hystrftime.obj ..\..\shared\port\hystsl.obj hysysinfo.obj hytime.obj  ..\..\shared\port\hytlshelpers.obj hytty.obj hyvmem.obj hyprt.res C:\continuum-1.0.2\apps\continuum\working-directory\6\classlib\deploy\lib\hythr.lib C:\continuum-1.0.2\apps\continuum\working-directory\6\classlib\deploy\lib\hycommon.lib C:\continuum-1.0.2\apps\continuum\working-directory\6\classlib\deploy\lib\hysig.lib
     [exec]      [exec]    Creating library C:\continuum-1.0.2\apps\continuum\working-directory\6\classlib\deploy\lib\hyprt.lib and object C:\continuum-1.0.2\apps\continuum\working-directory\6\classlib\deploy\lib\hyprt.exp
     [exec]      [exec] 	link  /debug /opt:icf /opt:ref /INCREMENTAL:NO /NOLOGO  -entry:_DllMainCRTStartup@12 -dll /BASE:0x11100000 -machine:i386  /comment:"Platform port library. (c) Copyright 1993, 2005 The Apache Software Foundation or its licensors, as applicable."  -subsystem:windows -out:..\hyprt.dll -map:..\hyprt.map  ..\..\shared\port\port_copyright.obj hycpu.obj ..\..\shared\port\hyerror.obj  hyerrorhelpers.obj ..\..\shared\port\hyexit.obj hyfile.obj hyfiletext.obj  ..\..\shared\port\hygp.obj hyipcmutex.obj hymem.obj hymmap.obj  ..\..\shared\port\hynls.obj hynlshelpers.obj hyosdump.obj ..\..\shared\port\hyport.obj  ..\..\shared\port\hyportcontrol.obj hyportptb.obj hyshmem.obj hyshsem.obj  hysignal.obj hysl.obj hysock.obj ..\..\shared\port\hystr.obj  ..\..\shared\port\hystrftime.obj ..\..\shared\port\hystsl.obj hysysinfo.obj hytime.obj  ..\..\shared\port\hytlshelpers.obj hytty.obj hyvmem.obj hyprt.res C:\continuum-1.0.2\apps\continuum\working-directory\6\classlib\deploy\lib\hythr.lib C:\continuum-1.0.2\apps\continuum\working-directory\6\classlib\deploy\lib\hycommon.lib C:\continuum-1.0.2\apps\continuum\working-directory\6\classlib\deploy\lib\hysig.lib Delayimp.lib -delayload:shell32.dll -delayload:Iphlpapi.dll  ws2_32.lib Iphlpapi.lib shell32.lib  kernel32.lib  ws2_32.lib advapi32.lib user32.lib gdi32.lib  comdlg32.lib winspool.lib  C:\continuum-1.0.2\apps\continuum\working-directory\6\classlib\deploy\lib\hyprt.exp
     [exec]      [exec] 	cd ..
     [exec]      [exec] 	cd fdlibm
     [exec]      [exec] 	nmake /NOLOGO
     [exec]      [exec] 	cl -c -DCRTAPI1=_cdecl -DCRTAPI2=_cdecl -nologo -FIsehmap.h -D_X86_=1  -DWIN32 -D_WIN32 -W3 -D_WIN95 -D_WIN32_WINDOWS=0x0400 /D_WIN32_DCOM -D_WIN32_IE=0x0500 -DWINVER=0x0400 -Oityb1 -W3 -FdC:\continuum-1.0.2\apps\continuum\working-directory\6\classlib\deploy\lib\hyfdlibm.pdb -D_IEEE_LIBM  -DHY_PLATFORM_DOUBLE_ORDER /I..\..\shared\fdlibm\ /I..\..\..\modules\luni\src\main\native\include\shared /I..\..\..\modules\luni\src\main\native\include\windows -Fodist/e_acos.obj dist/e_acos.c
     [exec]      [exec] e_acos.c
     [exec]      [exec] 	cl -c -DCRTAPI1=_cdecl -DCRTAPI2=_cdecl -nologo -FIsehmap.h -D_X86_=1  -DWIN32 -D_WIN32 -W3 -D_WIN95 -D_WIN32_WINDOWS=0x0400 /D_WIN32_DCOM -D_WIN32_IE=0x0500 -DWINVER=0x0400 -Oityb1 -W3 -FdC:\continuum-1.0.2\apps\continuum\working-directory\6\classlib\deploy\lib\hyfdlibm.pdb -D_IEEE_LIBM  -DHY_PLATFORM_DOUBLE_ORDER /I..\..\shared\fdlibm\ /I..\..\..\modules\luni\src\main\native\include\shared /I..\..\..\modules\luni\src\main\native\include\windows -Fodist/e_acosh.obj dist/e_acosh.c
     [exec]      [exec] e_acosh.c
     [exec]      [exec] 	cl -c -DCRTAPI1=_cdecl -DCRTAPI2=_cdecl -nologo -FIsehmap.h -D_X86_=1  -DWIN32 -D_WIN32 -W3 -D_WIN95 -D_WIN32_WINDOWS=0x0400 /D_WIN32_DCOM -D_WIN32_IE=0x0500 -DWINVER=0x0400 -Oityb1 -W3 -FdC:\continuum-1.0.2\apps\continuum\working-directory\6\classlib\deploy\lib\hyfdlibm.pdb -D_IEEE_LIBM  -DHY_PLATFORM_DOUBLE_ORDER /I..\..\shared\fdlibm\ /I..\..\..\modules\luni\src\main\native\include\shared /I..\..\..\modules\luni\src\main\native\include\windows -Fodist/e_asin.obj dist/e_asin.c
     [exec]      [exec] e_asin.c
     [exec]      [exec] 	cl -c -DCRTAPI1=_cdecl -DCRTAPI2=_cdecl -nologo -FIsehmap.h -D_X86_=1  -DWIN32 -D_WIN32 -W3 -D_WIN95 -D_WIN32_WINDOWS=0x0400 /D_WIN32_DCOM -D_WIN32_IE=0x0500 -DWINVER=0x0400 -Oityb1 -W3 -FdC:\continuum-1.0.2\apps\continuum\working-directory\6\classlib\deploy\lib\hyfdlibm.pdb -D_IEEE_LIBM  -DHY_PLATFORM_DOUBLE_ORDER /I..\..\shared\fdlibm\ /I..\..\..\modules\luni\src\main\native\include\shared /I..\..\..\modules\luni\src\main\native\include\windows -Fodist/e_atan2.obj dist/e_atan2.c
     [exec]      [exec] e_atan2.c
     [exec]      [exec] dist\e_atan2.c(71) : warning C4146: unary minus operator applied to unsigned type, result still unsigned
     [exec]      [exec] dist\e_atan2.c(72) : warning C4146: unary minus operator applied to unsigned type, result still unsigned
     [exec]      [exec] 	cl -c -DCRTAPI1=_cdecl -DCRTAPI2=_cdecl -nologo -FIsehmap.h -D_X86_=1  -DWIN32 -D_WIN32 -W3 -D_WIN95 -D_WIN32_WINDOWS=0x0400 /D_WIN32_DCOM -D_WIN32_IE=0x0500 -DWINVER=0x0400 -Oityb1 -W3 -FdC:\continuum-1.0.2\apps\continuum\working-directory\6\classlib\deploy\lib\hyfdlibm.pdb -D_IEEE_LIBM  -DHY_PLATFORM_DOUBLE_ORDER /I..\..\shared\fdlibm\ /I..\..\..\modules\luni\src\main\native\include\shared /I..\..\..\modules\luni\src\main\native\include\windows -Fodist/e_atanh.obj dist/e_atanh.c
     [exec]      [exec] e_atanh.c
     [exec]      [exec] dist\e_atanh.c(56) : warning C4146: unary minus operator applied to unsigned type, result still unsigned
     [exec]      [exec] 	cl -c -DCRTAPI1=_cdecl -DCRTAPI2=_cdecl -nologo -FIsehmap.h -D_X86_=1  -DWIN32 -D_WIN32 -W3 -D_WIN95 -D_WIN32_WINDOWS=0x0400 /D_WIN32_DCOM -D_WIN32_IE=0x0500 -DWINVER=0x0400 -Oityb1 -W3 -FdC:\continuum-1.0.2\apps\continuum\working-directory\6\classlib\deploy\lib\hyfdlibm.pdb -D_IEEE_LIBM  -DHY_PLATFORM_DOUBLE_ORDER /I..\..\shared\fdlibm\ /I..\..\..\modules\luni\src\main\native\include\shared /I..\..\..\modules\luni\src\main\native\include\windows -Fodist/e_cosh.obj dist/e_cosh.c
     [exec]      [exec] e_cosh.c
     [exec]      [exec] 	cl -c -DCRTAPI1=_cdecl -DCRTAPI2=_cdecl -nologo -FIsehmap.h -D_X86_=1  -DWIN32 -D_WIN32 -W3 -D_WIN95 -D_WIN32_WINDOWS=0x0400 /D_WIN32_DCOM -D_WIN32_IE=0x0500 -DWINVER=0x0400 -Oityb1 -W3 -FdC:\continuum-1.0.2\apps\continuum\working-directory\6\classlib\deploy\lib\hyfdlibm.pdb -D_IEEE_LIBM  -DHY_PLATFORM_DOUBLE_ORDER /I..\..\shared\fdlibm\ /I..\..\..\modules\luni\src\main\native\include\shared /I..\..\..\modules\luni\src\main\native\include\windows -Fodist/e_exp.obj dist/e_exp.c
     [exec]      [exec] e_exp.c
     [exec]      [exec] dist\e_exp.c(133) : warning C4244: '=' : conversion from 'double' to 'int', possible loss of data
     [exec]      [exec] 	cl -c -DCRTAPI1=_cdecl -DCRTAPI2=_cdecl -nologo -FIsehmap.h -D_X86_=1  -DWIN32 -D_WIN32 -W3 -D_WIN95 -D_WIN32_WINDOWS=0x0400 /D_WIN32_DCOM -D_WIN32_IE=0x0500 -DWINVER=0x0400 -Oityb1 -W3 -FdC:\continuum-1.0.2\apps\continuum\working-directory\6\classlib\deploy\lib\hyfdlibm.pdb -D_IEEE_LIBM  -DHY_PLATFORM_DOUBLE_ORDER /I..\..\shared\fdlibm\ /I..\..\..\modules\luni\src\main\native\include\shared /I..\..\..\modules\luni\src\main\native\include\windows -Fodist/e_fmod.obj dist/e_fmod.c
     [exec]      [exec] e_fmod.c
     [exec]      [exec] dist\e_fmod.c(48) : warning C4146: unary minus operator applied to unsigned type, result still unsigned
     [exec]      [exec] 	cl -c -DCRTAPI1=_cdecl -DCRTAPI2=_cdecl -nologo -FIsehmap.h -D_X86_=1  -DWIN32 -D_WIN32 -W3 -D_WIN95 -D_WIN32_WINDOWS=0x0400 /D_WIN32_DCOM -D_WIN32_IE=0x0500 -DWINVER=0x0400 -Oityb1 -W3 -FdC:\continuum-1.0.2\apps\continuum\working-directory\6\classlib\deploy\lib\hyfdlibm.pdb -D_IEEE_LIBM  -DHY_PLATFORM_DOUBLE_ORDER /I..\..\shared\fdlibm\ /I..\..\..\modules\luni\src\main\native\include\shared /I..\..\..\modules\luni\src\main\native\include\windows -Fodist/e_gamma.obj dist/e_gamma.c
     [exec]      [exec] e_gamma.c
     [exec]      [exec] 	cl -c -DCRTAPI1=_cdecl -DCRTAPI2=_cdecl -nologo -FIsehmap.h -D_X86_=1  -DWIN32 -D_WIN32 -W3 -D_WIN95 -D_WIN32_WINDOWS=0x0400 /D_WIN32_DCOM -D_WIN32_IE=0x0500 -DWINVER=0x0400 -Oityb1 -W3 -FdC:\continuum-1.0.2\apps\continuum\working-directory\6\classlib\deploy\lib\hyfdlibm.pdb -D_IEEE_LIBM  -DHY_PLATFORM_DOUBLE_ORDER /I..\..\shared\fdlibm\ /I..\..\..\modules\luni\src\main\native\include\shared /I..\..\..\modules\luni\src\main\native\include\windows -Fodist/e_gamma_r.obj dist/e_gamma_r.c
     [exec]      [exec] e_gamma_r.c
     [exec]      [exec] 	cl -c -DCRTAPI1=_cdecl -DCRTAPI2=_cdecl -nologo -FIsehmap.h -D_X86_=1  -DWIN32 -D_WIN32 -W3 -D_WIN95 -D_WIN32_WINDOWS=0x0400 /D_WIN32_DCOM -D_WIN32_IE=0x0500 -DWINVER=0x0400 -Oityb1 -W3 -FdC:\continuum-1.0.2\apps\continuum\working-directory\6\classlib\deploy\lib\hyfdlibm.pdb -D_IEEE_LIBM  -DHY_PLATFORM_DOUBLE_ORDER /I..\..\shared\fdlibm\ /I..\..\..\modules\luni\src\main\native\include\shared /I..\..\..\modules\luni\src\main\native\include\windows -Fodist/e_hypot.obj dist/e_hypot.c
     [exec]      [exec] e_hypot.c
     [exec]      [exec] 	cl -c -DCRTAPI1=_cdecl -DCRTAPI2=_cdecl -nologo -FIsehmap.h -D_X86_=1  -DWIN32 -D_WIN32 -W3 -D_WIN95 -D_WIN32_WINDOWS=0x0400 /D_WIN32_DCOM -D_WIN32_IE=0x0500 -DWINVER=0x0400 -Oityb1 -W3 -FdC:\continuum-1.0.2\apps\continuum\working-directory\6\classlib\deploy\lib\hyfdlibm.pdb -D_IEEE_LIBM  -DHY_PLATFORM_DOUBLE_ORDER /I..\..\shared\fdlibm\ /I..\..\..\modules\luni\src\main\native\include\shared /I..\..\..\modules\luni\src\main\native\include\windows -Fodist/e_j0.obj dist/e_j0.c
     [exec]      [exec] e_j0.c
     [exec]      [exec] 	cl -c -DCRTAPI1=_cdecl -DCRTAPI2=_cdecl -nologo -FIsehmap.h -D_X86_=1  -DWIN32 -D_WIN32 -W3 -D_WIN95 -D_WIN32_WINDOWS=0x0400 /D_WIN32_DCOM -D_WIN32_IE=0x0500 -DWINVER=0x0400 -Oityb1 -W3 -FdC:\continuum-1.0.2\apps\continuum\working-directory\6\classlib\deploy\lib\hyfdlibm.pdb -D_IEEE_LIBM  -DHY_PLATFORM_DOUBLE_ORDER /I..\..\shared\fdlibm\ /I..\..\..\modules\luni\src\main\native\include\shared /I..\..\..\modules\luni\src\main\native\include\windows -Fodist/e_j1.obj dist/e_j1.c
     [exec]      [exec] e_j1.c
     [exec]      [exec] 	cl -c -DCRTAPI1=_cdecl -DCRTAPI2=_cdecl -nologo -FIsehmap.h -D_X86_=1  -DWIN32 -D_WIN32 -W3 -D_WIN95 -D_WIN32_WINDOWS=0x0400 /D_WIN32_DCOM -D_WIN32_IE=0x0500 -DWINVER=0x0400 -Oityb1 -W3 -FdC:\continuum-1.0.2\apps\continuum\working-directory\6\classlib\deploy\lib\hyfdlibm.pdb -D_IEEE_LIBM  -DHY_PLATFORM_DOUBLE_ORDER /I..\..\shared\fdlibm\ /I..\..\..\modules\luni\src\main\native\include\shared /I..\..\..\modules\luni\src\main\native\include\windows -Fodist/e_jn.obj dist/e_jn.c
     [exec]      [exec] e_jn.c
     [exec]      [exec] 	cl -c -DCRTAPI1=_cdecl -DCRTAPI2=_cdecl -nologo -FIsehmap.h -D_X86_=1  -DWIN32 -D_WIN32 -W3 -D_WIN95 -D_WIN32_WINDOWS=0x0400 /D_WIN32_DCOM -D_WIN32_IE=0x0500 -DWINVER=0x0400 -Oityb1 -W3 -FdC:\continuum-1.0.2\apps\continuum\working-directory\6\classlib\deploy\lib\hyfdlibm.pdb -D_IEEE_LIBM  -DHY_PLATFORM_DOUBLE_ORDER /I..\..\shared\fdlibm\ /I..\..\..\modules\luni\src\main\native\include\shared /I..\..\..\modules\luni\src\main\native\include\windows -Fodist/e_lgamma.obj dist/e_lgamma.c
     [exec]      [exec] e_lgamma.c
     [exec]      [exec] 	cl -c -DCRTAPI1=_cdecl -DCRTAPI2=_cdecl -nologo -FIsehmap.h -D_X86_=1  -DWIN32 -D_WIN32 -W3 -D_WIN95 -D_WIN32_WINDOWS=0x0400 /D_WIN32_DCOM -D_WIN32_IE=0x0500 -DWINVER=0x0400 -Oityb1 -W3 -FdC:\continuum-1.0.2\apps\continuum\working-directory\6\classlib\deploy\lib\hyfdlibm.pdb -D_IEEE_LIBM  -DHY_PLATFORM_DOUBLE_ORDER /I..\..\shared\fdlibm\ /I..\..\..\modules\luni\src\main\native\include\shared /I..\..\..\modules\luni\src\main\native\include\windows -Fodist/e_lgamma_r.obj dist/e_lgamma_r.c
     [exec]      [exec] e_lgamma_r.c
     [exec]      [exec] 	cl -c -DCRTAPI1=_cdecl -DCRTAPI2=_cdecl -nologo -FIsehmap.h -D_X86_=1  -DWIN32 -D_WIN32 -W3 -D_WIN95 -D_WIN32_WINDOWS=0x0400 /D_WIN32_DCOM -D_WIN32_IE=0x0500 -DWINVER=0x0400 -Oityb1 -W3 -FdC:\continuum-1.0.2\apps\continuum\working-directory\6\classlib\deploy\lib\hyfdlibm.pdb -D_IEEE_LIBM  -DHY_PLATFORM_DOUBLE_ORDER /I..\..\shared\fdlibm\ /I..\..\..\modules\luni\src\main\native\include\shared /I..\..\..\modules\luni\src\main\native\include\windows -Fodist/e_log.obj dist/e_log.c
     [exec]      [exec] e_log.c
     [exec]      [exec] 	cl -c -DCRTAPI1=_cdecl -DCRTAPI2=_cdecl -nologo -FIsehmap.h -D_X86_=1  -DWIN32 -D_WIN32 -W3 -D_WIN95 -D_WIN32_WINDOWS=0x0400 /D_WIN32_DCOM -D_WIN32_IE=0x0500 -DWINVER=0x0400 -Oityb1 -W3 -FdC:\continuum-1.0.2\apps\continuum\working-directory\6\classlib\deploy\lib\hyfdlibm.pdb -D_IEEE_LIBM  -DHY_PLATFORM_DOUBLE_ORDER /I..\..\shared\fdlibm\ /I..\..\..\modules\luni\src\main\native\include\shared /I..\..\..\modules\luni\src\main\native\include\windows -Fodist/e_log10.obj dist/e_log10.c
     [exec]      [exec] e_log10.c
     [exec]      [exec] 	cl -c -DCRTAPI1=_cdecl -DCRTAPI2=_cdecl -nologo -FIsehmap.h -D_X86_=1  -DWIN32 -D_WIN32 -W3 -D_WIN95 -D_WIN32_WINDOWS=0x0400 /D_WIN32_DCOM -D_WIN32_IE=0x0500 -DWINVER=0x0400 -Oityb1 -W3 -FdC:\continuum-1.0.2\apps\continuum\working-directory\6\classlib\deploy\lib\hyfdlibm.pdb -D_IEEE_LIBM  -DHY_PLATFORM_DOUBLE_ORDER /I..\..\shared\fdlibm\ /I..\..\..\modules\luni\src\main\native\include\shared /I..\..\..\modules\luni\src\main\native\include\windows -Fodist/e_pow.obj dist/e_pow.c
     [exec]      [exec] e_pow.c
     [exec]      [exec] 	cl -c -DCRTAPI1=_cdecl -DCRTAPI2=_cdecl -nologo -FIsehmap.h -D_X86_=1  -DWIN32 -D_WIN32 -W3 -D_WIN95 -D_WIN32_WINDOWS=0x0400 /D_WIN32_DCOM -D_WIN32_IE=0x0500 -DWINVER=0x0400 -Oityb1 -W3 -FdC:\continuum-1.0.2\apps\continuum\working-directory\6\classlib\deploy\lib\hyfdlibm.pdb -D_IEEE_LIBM  -DHY_PLATFORM_DOUBLE_ORDER /I..\..\shared\fdlibm\ /I..\..\..\modules\luni\src\main\native\include\shared /I..\..\..\modules\luni\src\main\native\include\windows -Fodist/e_rem_pio2.obj dist/e_rem_pio2.c
     [exec]      [exec] e_rem_pio2.c
     [exec]      [exec] 	cl -c -DCRTAPI1=_cdecl -DCRTAPI2=_cdecl -nologo -FIsehmap.h -D_X86_=1  -DWIN32 -D_WIN32 -W3 -D_WIN95 -D_WIN32_WINDOWS=0x0400 /D_WIN32_DCOM -D_WIN32_IE=0x0500 -DWINVER=0x0400 -Oityb1 -W3 -FdC:\continuum-1.0.2\apps\continuum\working-directory\6\classlib\deploy\lib\hyfdlibm.pdb -D_IEEE_LIBM  -DHY_PLATFORM_DOUBLE_ORDER /I..\..\shared\fdlibm\ /I..\..\..\modules\luni\src\main\native\include\shared /I..\..\..\modules\luni\src\main\native\include\windows -Fodist/e_remainder.obj dist/e_remainder.c
     [exec]      [exec] e_remainder.c
     [exec]      [exec] 	cl -c -DCRTAPI1=_cdecl -DCRTAPI2=_cdecl -nologo -FIsehmap.h -D_X86_=1  -DWIN32 -D_WIN32 -W3 -D_WIN95 -D_WIN32_WINDOWS=0x0400 /D_WIN32_DCOM -D_WIN32_IE=0x0500 -DWINVER=0x0400 -Oityb1 -W3 -FdC:\continuum-1.0.2\apps\continuum\working-directory\6\classlib\deploy\lib\hyfdlibm.pdb -D_IEEE_LIBM  -DHY_PLATFORM_DOUBLE_ORDER /I..\..\shared\fdlibm\ /I..\..\..\modules\luni\src\main\native\include\shared /I..\..\..\modules\luni\src\main\native\include\windows -Fodist/e_scalb.obj dist/e_scalb.c
     [exec]      [exec] e_scalb.c
     [exec]      [exec] 	cl -c -DCRTAPI1=_cdecl -DCRTAPI2=_cdecl -nologo -FIsehmap.h -D_X86_=1  -DWIN32 -D_WIN32 -W3 -D_WIN95 -D_WIN32_WINDOWS=0x0400 /D_WIN32_DCOM -D_WIN32_IE=0x0500 -DWINVER=0x0400 -Oityb1 -W3 -FdC:\continuum-1.0.2\apps\continuum\working-directory\6\classlib\deploy\lib\hyfdlibm.pdb -D_IEEE_LIBM  -DHY_PLATFORM_DOUBLE_ORDER /I..\..\shared\fdlibm\ /I..\..\..\modules\luni\src\main\native\include\shared /I..\..\..\modules\luni\src\main\native\include\windows -Fodist/e_sinh.obj dist/e_sinh.c
     [exec]      [exec] e_sinh.c
     [exec]      [exec] 	cl -c -DCRTAPI1=_cdecl -DCRTAPI2=_cdecl -nologo -FIsehmap.h -D_X86_=1  -DWIN32 -D_WIN32 -W3 -D_WIN95 -D_WIN32_WINDOWS=0x0400 /D_WIN32_DCOM -D_WIN32_IE=0x0500 -DWINVER=0x0400 -Oityb1 -W3 -FdC:\continuum-1.0.2\apps\continuum\working-directory\6\classlib\deploy\lib\hyfdlibm.pdb -D_IEEE_LIBM  -DHY_PLATFORM_DOUBLE_ORDER /I..\..\shared\fdlibm\ /I..\..\..\modules\luni\src\main\native\include\shared /I..\..\..\modules\luni\src\main\native\include\windows -Fodist/e_sqrt.obj dist/e_sqrt.c
     [exec]      [exec] e_sqrt.c
     [exec]      [exec] 	cl -c -DCRTAPI1=_cdecl -DCRTAPI2=_cdecl -nologo -FIsehmap.h -D_X86_=1  -DWIN32 -D_WIN32 -W3 -D_WIN95 -D_WIN32_WINDOWS=0x0400 /D_WIN32_DCOM -D_WIN32_IE=0x0500 -DWINVER=0x0400 -Oityb1 -W3 -FdC:\continuum-1.0.2\apps\continuum\working-directory\6\classlib\deploy\lib\hyfdlibm.pdb -D_IEEE_LIBM  -DHY_PLATFORM_DOUBLE_ORDER /I..\..\shared\fdlibm\ /I..\..\..\modules\luni\src\main\native\include\shared /I..\..\..\modules\luni\src\main\native\include\windows -Fodist/k_cos.obj dist/k_cos.c
     [exec]      [exec] k_cos.c
     [exec]      [exec] 	cl -c -DCRTAPI1=_cdecl -DCRTAPI2=_cdecl -nologo -FIsehmap.h -D_X86_=1  -DWIN32 -D_WIN32 -W3 -D_WIN95 -D_WIN32_WINDOWS=0x0400 /D_WIN32_DCOM -D_WIN32_IE=0x0500 -DWINVER=0x0400 -Oityb1 -W3 -FdC:\continuum-1.0.2\apps\continuum\working-directory\6\classlib\deploy\lib\hyfdlibm.pdb -D_IEEE_LIBM  -DHY_PLATFORM_DOUBLE_ORDER /I..\..\shared\fdlibm\ /I..\..\..\modules\luni\src\main\native\include\shared /I..\..\..\modules\luni\src\main\native\include\windows -Fodist/k_rem_pio2.obj dist/k_rem_pio2.c
     [exec]      [exec] k_rem_pio2.c
     [exec]      [exec] 	cl -c -DCRTAPI1=_cdecl -DCRTAPI2=_cdecl -nologo -FIsehmap.h -D_X86_=1  -DWIN32 -D_WIN32 -W3 -D_WIN95 -D_WIN32_WINDOWS=0x0400 /D_WIN32_DCOM -D_WIN32_IE=0x0500 -DWINVER=0x0400 -Oityb1 -W3 -FdC:\continuum-1.0.2\apps\continuum\working-directory\6\classlib\deploy\lib\hyfdlibm.pdb -D_IEEE_LIBM  -DHY_PLATFORM_DOUBLE_ORDER /I..\..\shared\fdlibm\ /I..\..\..\modules\luni\src\main\native\include\shared /I..\..\..\modules\luni\src\main\native\include\windows -Fodist/k_sin.obj dist/k_sin.c
     [exec]      [exec] k_sin.c
     [exec]      [exec] 	cl -c -DCRTAPI1=_cdecl -DCRTAPI2=_cdecl -nologo -FIsehmap.h -D_X86_=1  -DWIN32 -D_WIN32 -W3 -D_WIN95 -D_WIN32_WINDOWS=0x0400 /D_WIN32_DCOM -D_WIN32_IE=0x0500 -DWINVER=0x0400 -Oityb1 -W3 -FdC:\continuum-1.0.2\apps\continuum\working-directory\6\classlib\deploy\lib\hyfdlibm.pdb -D_IEEE_LIBM  -DHY_PLATFORM_DOUBLE_ORDER /I..\..\shared\fdlibm\ /I..\..\..\modules\luni\src\main\native\include\shared /I..\..\..\modules\luni\src\main\native\include\windows -Fodist/k_standard.obj dist/k_standard.c
     [exec]      [exec] k_standard.c
     [exec]      [exec] 	cl -c -DCRTAPI1=_cdecl -DCRTAPI2=_cdecl -nologo -FIsehmap.h -D_X86_=1  -DWIN32 -D_WIN32 -W3 -D_WIN95 -D_WIN32_WINDOWS=0x0400 /D_WIN32_DCOM -D_WIN32_IE=0x0500 -DWINVER=0x0400 -Oityb1 -W3 -FdC:\continuum-1.0.2\apps\continuum\working-directory\6\classlib\deploy\lib\hyfdlibm.pdb -D_IEEE_LIBM  -DHY_PLATFORM_DOUBLE_ORDER /I..\..\shared\fdlibm\ /I..\..\..\modules\luni\src\main\native\include\shared /I..\..\..\modules\luni\src\main\native\include\windows -Fodist/k_tan.obj dist/k_tan.c
     [exec]      [exec] k_tan.c
     [exec]      [exec] 	cl -c -DCRTAPI1=_cdecl -DCRTAPI2=_cdecl -nologo -FIsehmap.h -D_X86_=1  -DWIN32 -D_WIN32 -W3 -D_WIN95 -D_WIN32_WINDOWS=0x0400 /D_WIN32_DCOM -D_WIN32_IE=0x0500 -DWINVER=0x0400 -Oityb1 -W3 -FdC:\continuum-1.0.2\apps\continuum\working-directory\6\classlib\deploy\lib\hyfdlibm.pdb -D_IEEE_LIBM  -DHY_PLATFORM_DOUBLE_ORDER /I..\..\shared\fdlibm\ /I..\..\..\modules\luni\src\main\native\include\shared /I..\..\..\modules\luni\src\main\native\include\windows -Fodist/s_asinh.obj dist/s_asinh.c
     [exec]      [exec] s_asinh.c
     [exec]      [exec] 	cl -c -DCRTAPI1=_cdecl -DCRTAPI2=_cdecl -nologo -FIsehmap.h -D_X86_=1  -DWIN32 -D_WIN32 -W3 -D_WIN95 -D_WIN32_WINDOWS=0x0400 /D_WIN32_DCOM -D_WIN32_IE=0x0500 -DWINVER=0x0400 -Oityb1 -W3 -FdC:\continuum-1.0.2\apps\continuum\working-directory\6\classlib\deploy\lib\hyfdlibm.pdb -D_IEEE_LIBM  -DHY_PLATFORM_DOUBLE_ORDER /I..\..\shared\fdlibm\ /I..\..\..\modules\luni\src\main\native\include\shared /I..\..\..\modules\luni\src\main\native\include\windows -Fodist/s_atan.obj dist/s_atan.c
     [exec]      [exec] s_atan.c
     [exec]      [exec] 	cl -c -DCRTAPI1=_cdecl -DCRTAPI2=_cdecl -nologo -FIsehmap.h -D_X86_=1  -DWIN32 -D_WIN32 -W3 -D_WIN95 -D_WIN32_WINDOWS=0x0400 /D_WIN32_DCOM -D_WIN32_IE=0x0500 -DWINVER=0x0400 -Oityb1 -W3 -FdC:\continuum-1.0.2\apps\continuum\working-directory\6\classlib\deploy\lib\hyfdlibm.pdb -D_IEEE_LIBM  -DHY_PLATFORM_DOUBLE_ORDER /I..\..\shared\fdlibm\ /I..\..\..\modules\luni\src\main\native\include\shared /I..\..\..\modules\luni\src\main\native\include\windows -Fodist/s_cbrt.obj dist/s_cbrt.c
     [exec]      [exec] s_cbrt.c
     [exec]      [exec] 	cl -c -DCRTAPI1=_cdecl -DCRTAPI2=_cdecl -nologo -FIsehmap.h -D_X86_=1  -DWIN32 -D_WIN32 -W3 -D_WIN95 -D_WIN32_WINDOWS=0x0400 /D_WIN32_DCOM -D_WIN32_IE=0x0500 -DWINVER=0x0400 -Oityb1 -W3 -FdC:\continuum-1.0.2\apps\continuum\working-directory\6\classlib\deploy\lib\hyfdlibm.pdb -D_IEEE_LIBM  -DHY_PLATFORM_DOUBLE_ORDER /I..\..\shared\fdlibm\ /I..\..\..\modules\luni\src\main\native\include\shared /I..\..\..\modules\luni\src\main\native\include\windows -Fodist/s_ceil.obj dist/s_ceil.c
     [exec]      [exec] s_ceil.c
     [exec]      [exec] dist\s_ceil.c(68) : warning C4018: '<' : signed/unsigned mismatch
     [exec]      [exec] 	cl -c -DCRTAPI1=_cdecl -DCRTAPI2=_cdecl -nologo -FIsehmap.h -D_X86_=1  -DWIN32 -D_WIN32 -W3 -D_WIN95 -D_WIN32_WINDOWS=0x0400 /D_WIN32_DCOM -D_WIN32_IE=0x0500 -DWINVER=0x0400 -Oityb1 -W3 -FdC:\continuum-1.0.2\apps\continuum\working-directory\6\classlib\deploy\lib\hyfdlibm.pdb -D_IEEE_LIBM  -DHY_PLATFORM_DOUBLE_ORDER /I..\..\shared\fdlibm\ /I..\..\..\modules\luni\src\main\native\include\shared /I..\..\..\modules\luni\src\main\native\include\windows -Fodist/s_copysign.obj dist/s_copysign.c
     [exec]      [exec] s_copysign.c
     [exec]      [exec] 	cl -c -DCRTAPI1=_cdecl -DCRTAPI2=_cdecl -nologo -FIsehmap.h -D_X86_=1  -DWIN32 -D_WIN32 -W3 -D_WIN95 -D_WIN32_WINDOWS=0x0400 /D_WIN32_DCOM -D_WIN32_IE=0x0500 -DWINVER=0x0400 -Oityb1 -W3 -FdC:\continuum-1.0.2\apps\continuum\working-directory\6\classlib\deploy\lib\hyfdlibm.pdb -D_IEEE_LIBM  -DHY_PLATFORM_DOUBLE_ORDER /I..\..\shared\fdlibm\ /I..\..\..\modules\luni\src\main\native\include\shared /I..\..\..\modules\luni\src\main\native\include\windows -Fodist/s_cos.obj dist/s_cos.c
     [exec]      [exec] s_cos.c
     [exec]      [exec] 	cl -c -DCRTAPI1=_cdecl -DCRTAPI2=_cdecl -nologo -FIsehmap.h -D_X86_=1  -DWIN32 -D_WIN32 -W3 -D_WIN95 -D_WIN32_WINDOWS=0x0400 /D_WIN32_DCOM -D_WIN32_IE=0x0500 -DWINVER=0x0400 -Oityb1 -W3 -FdC:\continuum-1.0.2\apps\continuum\working-directory\6\classlib\deploy\lib\hyfdlibm.pdb -D_IEEE_LIBM  -DHY_PLATFORM_DOUBLE_ORDER /I..\..\shared\fdlibm\ /I..\..\..\modules\luni\src\main\native\include\shared /I..\..\..\modules\luni\src\main\native\include\windows -Fodist/s_erf.obj dist/s_erf.c
     [exec]      [exec] s_erf.c
     [exec]      [exec] 	cl -c -DCRTAPI1=_cdecl -DCRTAPI2=_cdecl -nologo -FIsehmap.h -D_X86_=1  -DWIN32 -D_WIN32 -W3 -D_WIN95 -D_WIN32_WINDOWS=0x0400 /D_WIN32_DCOM -D_WIN32_IE=0x0500 -DWINVER=0x0400 -Oityb1 -W3 -FdC:\continuum-1.0.2\apps\continuum\working-directory\6\classlib\deploy\lib\hyfdlibm.pdb -D_IEEE_LIBM  -DHY_PLATFORM_DOUBLE_ORDER /I..\..\shared\fdlibm\ /I..\..\..\modules\luni\src\main\native\include\shared /I..\..\..\modules\luni\src\main\native\include\windows -Fodist/s_expm1.obj dist/s_expm1.c
     [exec]      [exec] s_expm1.c
     [exec]      [exec] dist\s_expm1.c(170) : warning C4244: '=' : conversion from 'double' to 'int', possible loss of data
     [exec]      [exec] 	cl -c -DCRTAPI1=_cdecl -DCRTAPI2=_cdecl -nologo -FIsehmap.h -D_X86_=1  -DWIN32 -D_WIN32 -W3 -D_WIN95 -D_WIN32_WINDOWS=0x0400 /D_WIN32_DCOM -D_WIN32_IE=0x0500 -DWINVER=0x0400 -Oityb1 -W3 -FdC:\continuum-1.0.2\apps\continuum\working-directory\6\classlib\deploy\lib\hyfdlibm.pdb -D_IEEE_LIBM  -DHY_PLATFORM_DOUBLE_ORDER /I..\..\shared\fdlibm\ /I..\..\..\modules\luni\src\main\native\include\shared /I..\..\..\modules\luni\src\main\native\include\windows -Fodist/s_fabs.obj dist/s_fabs.c
     [exec]      [exec] s_fabs.c
     [exec]      [exec] 	cl -c -DCRTAPI1=_cdecl -DCRTAPI2=_cdecl -nologo -FIsehmap.h -D_X86_=1  -DWIN32 -D_WIN32 -W3 -D_WIN95 -D_WIN32_WINDOWS=0x0400 /D_WIN32_DCOM -D_WIN32_IE=0x0500 -DWINVER=0x0400 -Oityb1 -W3 -FdC:\continuum-1.0.2\apps\continuum\working-directory\6\classlib\deploy\lib\hyfdlibm.pdb -D_IEEE_LIBM  -DHY_PLATFORM_DOUBLE_ORDER /I..\..\shared\fdlibm\ /I..\..\..\modules\luni\src\main\native\include\shared /I..\..\..\modules\luni\src\main\native\include\windows -Fodist/s_finite.obj dist/s_finite.c
     [exec]      [exec] s_finite.c
     [exec]      [exec] 	cl -c -DCRTAPI1=_cdecl -DCRTAPI2=_cdecl -nologo -FIsehmap.h -D_X86_=1  -DWIN32 -D_WIN32 -W3 -D_WIN95 -D_WIN32_WINDOWS=0x0400 /D_WIN32_DCOM -D_WIN32_IE=0x0500 -DWINVER=0x0400 -Oityb1 -W3 -FdC:\continuum-1.0.2\apps\continuum\working-directory\6\classlib\deploy\lib\hyfdlibm.pdb -D_IEEE_LIBM  -DHY_PLATFORM_DOUBLE_ORDER /I..\..\shared\fdlibm\ /I..\..\..\modules\luni\src\main\native\include\shared /I..\..\..\modules\luni\src\main\native\include\windows -Fodist/s_floor.obj dist/s_floor.c
     [exec]      [exec] s_floor.c
     [exec]      [exec] dist\s_floor.c(69) : warning C4018: '<' : signed/unsigned mismatch
     [exec]      [exec] 	cl -c -DCRTAPI1=_cdecl -DCRTAPI2=_cdecl -nologo -FIsehmap.h -D_X86_=1  -DWIN32 -D_WIN32 -W3 -D_WIN95 -D_WIN32_WINDOWS=0x0400 /D_WIN32_DCOM -D_WIN32_IE=0x0500 -DWINVER=0x0400 -Oityb1 -W3 -FdC:\continuum-1.0.2\apps\continuum\working-directory\6\classlib\deploy\lib\hyfdlibm.pdb -D_IEEE_LIBM  -DHY_PLATFORM_DOUBLE_ORDER /I..\..\shared\fdlibm\ /I..\..\..\modules\luni\src\main\native\include\shared /I..\..\..\modules\luni\src\main\native\include\windows -Fodist/s_frexp.obj dist/s_frexp.c
     [exec]      [exec] s_frexp.c
     [exec]      [exec] 	cl -c -DCRTAPI1=_cdecl -DCRTAPI2=_cdecl -nologo -FIsehmap.h -D_X86_=1  -DWIN32 -D_WIN32 -W3 -D_WIN95 -D_WIN32_WINDOWS=0x0400 /D_WIN32_DCOM -D_WIN32_IE=0x0500 -DWINVER=0x0400 -Oityb1 -W3 -FdC:\continuum-1.0.2\apps\continuum\working-directory\6\classlib\deploy\lib\hyfdlibm.pdb -D_IEEE_LIBM  -DHY_PLATFORM_DOUBLE_ORDER /I..\..\shared\fdlibm\ /I..\..\..\modules\luni\src\main\native\include\shared /I..\..\..\modules\luni\src\main\native\include\windows -Fodist/s_ilogb.obj dist/s_ilogb.c
     [exec]      [exec] s_ilogb.c
     [exec]      [exec] 	cl -c -DCRTAPI1=_cdecl -DCRTAPI2=_cdecl -nologo -FIsehmap.h -D_X86_=1  -DWIN32 -D_WIN32 -W3 -D_WIN95 -D_WIN32_WINDOWS=0x0400 /D_WIN32_DCOM -D_WIN32_IE=0x0500 -DWINVER=0x0400 -Oityb1 -W3 -FdC:\continuum-1.0.2\apps\continuum\working-directory\6\classlib\deploy\lib\hyfdlibm.pdb -D_IEEE_LIBM  -DHY_PLATFORM_DOUBLE_ORDER /I..\..\shared\fdlibm\ /I..\..\..\modules\luni\src\main\native\include\shared /I..\..\..\modules\luni\src\main\native\include\windows -Fodist/s_isnan.obj dist/s_isnan.c
     [exec]      [exec] s_isnan.c
     [exec]      [exec] 	cl -c -DCRTAPI1=_cdecl -DCRTAPI2=_cdecl -nologo -FIsehmap.h -D_X86_=1  -DWIN32 -D_WIN32 -W3 -D_WIN95 -D_WIN32_WINDOWS=0x0400 /D_WIN32_DCOM -D_WIN32_IE=0x0500 -DWINVER=0x0400 -Oityb1 -W3 -FdC:\continuum-1.0.2\apps\continuum\working-directory\6\classlib\deploy\lib\hyfdlibm.pdb -D_IEEE_LIBM  -DHY_PLATFORM_DOUBLE_ORDER /I..\..\shared\fdlibm\ /I..\..\..\modules\luni\src\main\native\include\shared /I..\..\..\modules\luni\src\main\native\include\windows -Fodist/s_ldexp.obj dist/s_ldexp.c
     [exec]      [exec] s_ldexp.c
     [exec]      [exec] 	cl -c -DCRTAPI1=_cdecl -DCRTAPI2=_cdecl -nologo -FIsehmap.h -D_X86_=1  -DWIN32 -D_WIN32 -W3 -D_WIN95 -D_WIN32_WINDOWS=0x0400 /D_WIN32_DCOM -D_WIN32_IE=0x0500 -DWINVER=0x0400 -Oityb1 -W3 -FdC:\continuum-1.0.2\apps\continuum\working-directory\6\classlib\deploy\lib\hyfdlibm.pdb -D_IEEE_LIBM  -DHY_PLATFORM_DOUBLE_ORDER /I..\..\shared\fdlibm\ /I..\..\..\modules\luni\src\main\native\include\shared /I..\..\..\modules\luni\src\main\native\include\windows -Fodist/s_log1p.obj dist/s_log1p.c
     [exec]      [exec] s_log1p.c
     [exec]      [exec] 	cl -c -DCRTAPI1=_cdecl -DCRTAPI2=_cdecl -nologo -FIsehmap.h -D_X86_=1  -DWIN32 -D_WIN32 -W3 -D_WIN95 -D_WIN32_WINDOWS=0x0400 /D_WIN32_DCOM -D_WIN32_IE=0x0500 -DWINVER=0x0400 -Oityb1 -W3 -FdC:\continuum-1.0.2\apps\continuum\working-directory\6\classlib\deploy\lib\hyfdlibm.pdb -D_IEEE_LIBM  -DHY_PLATFORM_DOUBLE_ORDER /I..\..\shared\fdlibm\ /I..\..\..\modules\luni\src\main\native\include\shared /I..\..\..\modules\luni\src\main\native\include\windows -Fodist/s_logb.obj dist/s_logb.c
     [exec]      [exec] s_logb.c
     [exec]      [exec] 	cl -c -DCRTAPI1=_cdecl -DCRTAPI2=_cdecl -nologo -FIsehmap.h -D_X86_=1  -DWIN32 -D_WIN32 -W3 -D_WIN95 -D_WIN32_WINDOWS=0x0400 /D_WIN32_DCOM -D_WIN32_IE=0x0500 -DWINVER=0x0400 -Oityb1 -W3 -FdC:\continuum-1.0.2\apps\continuum\working-directory\6\classlib\deploy\lib\hyfdlibm.pdb -D_IEEE_LIBM  -DHY_PLATFORM_DOUBLE_ORDER /I..\..\shared\fdlibm\ /I..\..\..\modules\luni\src\main\native\include\shared /I..\..\..\modules\luni\src\main\native\include\windows -Fodist/s_matherr.obj dist/s_matherr.c
     [exec]      [exec] s_matherr.c
     [exec]      [exec] 	cl -c -DCRTAPI1=_cdecl -DCRTAPI2=_cdecl -nologo -FIsehmap.h -D_X86_=1  -DWIN32 -D_WIN32 -W3 -D_WIN95 -D_WIN32_WINDOWS=0x0400 /D_WIN32_DCOM -D_WIN32_IE=0x0500 -DWINVER=0x0400 -Oityb1 -W3 -FdC:\continuum-1.0.2\apps\continuum\working-directory\6\classlib\deploy\lib\hyfdlibm.pdb -D_IEEE_LIBM  -DHY_PLATFORM_DOUBLE_ORDER /I..\..\shared\fdlibm\ /I..\..\..\modules\luni\src\main\native\include\shared /I..\..\..\modules\luni\src\main\native\include\windows -Fodist/s_modf.obj dist/s_modf.c
     [exec]      [exec] s_modf.c
     [exec]      [exec] 	cl -c -DCRTAPI1=_cdecl -DCRTAPI2=_cdecl -nologo -FIsehmap.h -D_X86_=1  -DWIN32 -D_WIN32 -W3 -D_WIN95 -D_WIN32_WINDOWS=0x0400 /D_WIN32_DCOM -D_WIN32_IE=0x0500 -DWINVER=0x0400 -Oityb1 -W3 -FdC:\continuum-1.0.2\apps\continuum\working-directory\6\classlib\deploy\lib\hyfdlibm.pdb -D_IEEE_LIBM  -DHY_PLATFORM_DOUBLE_ORDER /I..\..\shared\fdlibm\ /I..\..\..\modules\luni\src\main\native\include\shared /I..\..\..\modules\luni\src\main\native\include\windows -Fodist/s_nextafter.obj dist/s_nextafter.c
     [exec]      [exec] s_nextafter.c
     [exec]      [exec] 	cl -c -DCRTAPI1=_cdecl -DCRTAPI2=_cdecl -nologo -FIsehmap.h -D_X86_=1  -DWIN32 -D_WIN32 -W3 -D_WIN95 -D_WIN32_WINDOWS=0x0400 /D_WIN32_DCOM -D_WIN32_IE=0x0500 -DWINVER=0x0400 -Oityb1 -W3 -FdC:\continuum-1.0.2\apps\continuum\working-directory\6\classlib\deploy\lib\hyfdlibm.pdb -D_IEEE_LIBM  -DHY_PLATFORM_DOUBLE_ORDER /I..\..\shared\fdlibm\ /I..\..\..\modules\luni\src\main\native\include\shared /I..\..\..\modules\luni\src\main\native\include\windows -Fodist/s_rint.obj dist/s_rint.c
     [exec]      [exec] s_rint.c
     [exec]      [exec] dist\s_rint.c(55) : warning C4146: unary minus operator applied to unsigned type, result still unsigned
     [exec]      [exec] 	cl -c -DCRTAPI1=_cdecl -DCRTAPI2=_cdecl -nologo -FIsehmap.h -D_X86_=1  -DWIN32 -D_WIN32 -W3 -D_WIN95 -D_WIN32_WINDOWS=0x0400 /D_WIN32_DCOM -D_WIN32_IE=0x0500 -DWINVER=0x0400 -Oityb1 -W3 -FdC:\continuum-1.0.2\apps\continuum\working-directory\6\classlib\deploy\lib\hyfdlibm.pdb -D_IEEE_LIBM  -DHY_PLATFORM_DOUBLE_ORDER /I..\..\shared\fdlibm\ /I..\..\..\modules\luni\src\main\native\include\shared /I..\..\..\modules\luni\src\main\native\include\windows -Fodist/s_scalbn.obj dist/s_scalbn.c
     [exec]      [exec] s_scalbn.c
     [exec]      [exec] 	cl -c -DCRTAPI1=_cdecl -DCRTAPI2=_cdecl -nologo -FIsehmap.h -D_X86_=1  -DWIN32 -D_WIN32 -W3 -D_WIN95 -D_WIN32_WINDOWS=0x0400 /D_WIN32_DCOM -D_WIN32_IE=0x0500 -DWINVER=0x0400 -Oityb1 -W3 -FdC:\continuum-1.0.2\apps\continuum\working-directory\6\classlib\deploy\lib\hyfdlibm.pdb -D_IEEE_LIBM  -DHY_PLATFORM_DOUBLE_ORDER /I..\..\shared\fdlibm\ /I..\..\..\modules\luni\src\main\native\include\shared /I..\..\..\modules\luni\src\main\native\include\windows -Fodist/s_signgam.obj dist/s_signgam.c
     [exec]      [exec] s_signgam.c
     [exec]      [exec] 	cl -c -DCRTAPI1=_cdecl -DCRTAPI2=_cdecl -nologo -FIsehmap.h -D_X86_=1  -DWIN32 -D_WIN32 -W3 -D_WIN95 -D_WIN32_WINDOWS=0x0400 /D_WIN32_DCOM -D_WIN32_IE=0x0500 -DWINVER=0x0400 -Oityb1 -W3 -FdC:\continuum-1.0.2\apps\continuum\working-directory\6\classlib\deploy\lib\hyfdlibm.pdb -D_IEEE_LIBM  -DHY_PLATFORM_DOUBLE_ORDER /I..\..\shared\fdlibm\ /I..\..\..\modules\luni\src\main\native\include\shared /I..\..\..\modules\luni\src\main\native\include\windows -Fodist/s_significand.obj dist/s_significand.c
     [exec]      [exec] s_significand.c
     [exec]      [exec] 	cl -c -DCRTAPI1=_cdecl -DCRTAPI2=_cdecl -nologo -FIsehmap.h -D_X86_=1  -DWIN32 -D_WIN32 -W3 -D_WIN95 -D_WIN32_WINDOWS=0x0400 /D_WIN32_DCOM -D_WIN32_IE=0x0500 -DWINVER=0x0400 -Oityb1 -W3 -FdC:\continuum-1.0.2\apps\continuum\working-directory\6\classlib\deploy\lib\hyfdlibm.pdb -D_IEEE_LIBM  -DHY_PLATFORM_DOUBLE_ORDER /I..\..\shared\fdlibm\ /I..\..\..\modules\luni\src\main\native\include\shared /I..\..\..\modules\luni\src\main\native\include\windows -Fodist/s_sin.obj dist/s_sin.c
     [exec]      [exec] s_sin.c
     [exec]      [exec] 	cl -c -DCRTAPI1=_cdecl -DCRTAPI2=_cdecl -nologo -FIsehmap.h -D_X86_=1  -DWIN32 -D_WIN32 -W3 -D_WIN95 -D_WIN32_WINDOWS=0x0400 /D_WIN32_DCOM -D_WIN32_IE=0x0500 -DWINVER=0x0400 -Oityb1 -W3 -FdC:\continuum-1.0.2\apps\continuum\working-directory\6\classlib\deploy\lib\hyfdlibm.pdb -D_IEEE_LIBM  -DHY_PLATFORM_DOUBLE_ORDER /I..\..\shared\fdlibm\ /I..\..\..\modules\luni\src\main\native\include\shared /I..\..\..\modules\luni\src\main\native\include\windows -Fodist/s_tan.obj dist/s_tan.c
     [exec]      [exec] s_tan.c
     [exec]      [exec] 	cl -c -DCRTAPI1=_cdecl -DCRTAPI2=_cdecl -nologo -FIsehmap.h -D_X86_=1  -DWIN32 -D_WIN32 -W3 -D_WIN95 -D_WIN32_WINDOWS=0x0400 /D_WIN32_DCOM -D_WIN32_IE=0x0500 -DWINVER=0x0400 -Oityb1 -W3 -FdC:\continuum-1.0.2\apps\continuum\working-directory\6\classlib\deploy\lib\hyfdlibm.pdb -D_IEEE_LIBM  -DHY_PLATFORM_DOUBLE_ORDER /I..\..\shared\fdlibm\ /I..\..\..\modules\luni\src\main\native\include\shared /I..\..\..\modules\luni\src\main\native\include\windows -Fodist/s_tanh.obj dist/s_tanh.c
     [exec]      [exec] s_tanh.c
     [exec]      [exec] 	cl -c -DCRTAPI1=_cdecl -DCRTAPI2=_cdecl -nologo -FIsehmap.h -D_X86_=1  -DWIN32 -D_WIN32 -W3 -D_WIN95 -D_WIN32_WINDOWS=0x0400 /D_WIN32_DCOM -D_WIN32_IE=0x0500 -DWINVER=0x0400 -Oityb1 -W3 -FdC:\continuum-1.0.2\apps\continuum\working-directory\6\classlib\deploy\lib\hyfdlibm.pdb -D_IEEE_LIBM  -DHY_PLATFORM_DOUBLE_ORDER /I..\..\shared\fdlibm\ /I..\..\..\modules\luni\src\main\native\include\shared /I..\..\..\modules\luni\src\main\native\include\windows -Fodist/w_acos.obj dist/w_acos.c
     [exec]      [exec] w_acos.c
     [exec]      [exec] 	cl -c -DCRTAPI1=_cdecl -DCRTAPI2=_cdecl -nologo -FIsehmap.h -D_X86_=1  -DWIN32 -D_WIN32 -W3 -D_WIN95 -D_WIN32_WINDOWS=0x0400 /D_WIN32_DCOM -D_WIN32_IE=0x0500 -DWINVER=0x0400 -Oityb1 -W3 -FdC:\continuum-1.0.2\apps\continuum\working-directory\6\classlib\deploy\lib\hyfdlibm.pdb -D_IEEE_LIBM  -DHY_PLATFORM_DOUBLE_ORDER /I..\..\shared\fdlibm\ /I..\..\..\modules\luni\src\main\native\include\shared /I..\..\..\modules\luni\src\main\native\include\windows -Fodist/w_acosh.obj dist/w_acosh.c
     [exec]      [exec] w_acosh.c
     [exec]      [exec] 	cl -c -DCRTAPI1=_cdecl -DCRTAPI2=_cdecl -nologo -FIsehmap.h -D_X86_=1  -DWIN32 -D_WIN32 -W3 -D_WIN95 -D_WIN32_WINDOWS=0x0400 /D_WIN32_DCOM -D_WIN32_IE=0x0500 -DWINVER=0x0400 -Oityb1 -W3 -FdC:\continuum-1.0.2\apps\continuum\working-directory\6\classlib\deploy\lib\hyfdlibm.pdb -D_IEEE_LIBM  -DHY_PLATFORM_DOUBLE_ORDER /I..\..\shared\fdlibm\ /I..\..\..\modules\luni\src\main\native\include\shared /I..\..\..\modules\luni\src\main\native\include\windows -Fodist/w_asin.obj dist/w_asin.c
     [exec]      [exec] w_asin.c
     [exec]      [exec] 	cl -c -DCRTAPI1=_cdecl -DCRTAPI2=_cdecl -nologo -FIsehmap.h -D_X86_=1  -DWIN32 -D_WIN32 -W3 -D_WIN95 -D_WIN32_WINDOWS=0x0400 /D_WIN32_DCOM -D_WIN32_IE=0x0500 -DWINVER=0x0400 -Oityb1 -W3 -FdC:\continuum-1.0.2\apps\continuum\working-directory\6\classlib\deploy\lib\hyfdlibm.pdb -D_IEEE_LIBM  -DHY_PLATFORM_DOUBLE_ORDER /I..\..\shared\fdlibm\ /I..\..\..\modules\luni\src\main\native\include\shared /I..\..\..\modules\luni\src\main\native\include\windows -Fodist/w_atan2.obj dist/w_atan2.c
     [exec]      [exec] w_atan2.c
     [exec]      [exec] 	cl -c -DCRTAPI1=_cdecl -DCRTAPI2=_cdecl -nologo -FIsehmap.h -D_X86_=1  -DWIN32 -D_WIN32 -W3 -D_WIN95 -D_WIN32_WINDOWS=0x0400 /D_WIN32_DCOM -D_WIN32_IE=0x0500 -DWINVER=0x0400 -Oityb1 -W3 -FdC:\continuum-1.0.2\apps\continuum\working-directory\6\classlib\deploy\lib\hyfdlibm.pdb -D_IEEE_LIBM  -DHY_PLATFORM_DOUBLE_ORDER /I..\..\shared\fdlibm\ /I..\..\..\modules\luni\src\main\native\include\shared /I..\..\..\modules\luni\src\main\native\include\windows -Fodist/w_atanh.obj dist/w_atanh.c
     [exec]      [exec] w_atanh.c
     [exec]      [exec] 	cl -c -DCRTAPI1=_cdecl -DCRTAPI2=_cdecl -nologo -FIsehmap.h -D_X86_=1  -DWIN32 -D_WIN32 -W3 -D_WIN95 -D_WIN32_WINDOWS=0x0400 /D_WIN32_DCOM -D_WIN32_IE=0x0500 -DWINVER=0x0400 -Oityb1 -W3 -FdC:\continuum-1.0.2\apps\continuum\working-directory\6\classlib\deploy\lib\hyfdlibm.pdb -D_IEEE_LIBM  -DHY_PLATFORM_DOUBLE_ORDER /I..\..\shared\fdlibm\ /I..\..\..\modules\luni\src\main\native\include\shared /I..\..\..\modules\luni\src\main\native\include\windows -Fodist/w_cosh.obj dist/w_cosh.c
     [exec]      [exec] w_cosh.c
     [exec]      [exec] 	cl -c -DCRTAPI1=_cdecl -DCRTAPI2=_cdecl -nologo -FIsehmap.h -D_X86_=1  -DWIN32 -D_WIN32 -W3 -D_WIN95 -D_WIN32_WINDOWS=0x0400 /D_WIN32_DCOM -D_WIN32_IE=0x0500 -DWINVER=0x0400 -Oityb1 -W3 -FdC:\continuum-1.0.2\apps\continuum\working-directory\6\classlib\deploy\lib\hyfdlibm.pdb -D_IEEE_LIBM  -DHY_PLATFORM_DOUBLE_ORDER /I..\..\shared\fdlibm\ /I..\..\..\modules\luni\src\main\native\include\shared /I..\..\..\modules\luni\src\main\native\include\windows -Fodist/w_exp.obj dist/w_exp.c
     [exec]      [exec] w_exp.c
     [exec]      [exec] 	cl -c -DCRTAPI1=_cdecl -DCRTAPI2=_cdecl -nologo -FIsehmap.h -D_X86_=1  -DWIN32 -D_WIN32 -W3 -D_WIN95 -D_WIN32_WINDOWS=0x0400 /D_WIN32_DCOM -D_WIN32_IE=0x0500 -DWINVER=0x0400 -Oityb1 -W3 -FdC:\continuum-1.0.2\apps\continuum\working-directory\6\classlib\deploy\lib\hyfdlibm.pdb -D_IEEE_LIBM  -DHY_PLATFORM_DOUBLE_ORDER /I..\..\shared\fdlibm\ /I..\..\..\modules\luni\src\main\native\include\shared /I..\..\..\modules\luni\src\main\native\include\windows -Fodist/w_fmod.obj dist/w_fmod.c
     [exec]      [exec] w_fmod.c
     [exec]      [exec] 	cl -c -DCRTAPI1=_cdecl -DCRTAPI2=_cdecl -nologo -FIsehmap.h -D_X86_=1  -DWIN32 -D_WIN32 -W3 -D_WIN95 -D_WIN32_WINDOWS=0x0400 /D_WIN32_DCOM -D_WIN32_IE=0x0500 -DWINVER=0x0400 -Oityb1 -W3 -FdC:\continuum-1.0.2\apps\continuum\working-directory\6\classlib\deploy\lib\hyfdlibm.pdb -D_IEEE_LIBM  -DHY_PLATFORM_DOUBLE_ORDER /I..\..\shared\fdlibm\ /I..\..\..\modules\luni\src\main\native\include\shared /I..\..\..\modules\luni\src\main\native\include\windows -Fodist/w_gamma.obj dist/w_gamma.c
     [exec]      [exec] w_gamma.c
     [exec]      [exec] 	cl -c -DCRTAPI1=_cdecl -DCRTAPI2=_cdecl -nologo -FIsehmap.h -D_X86_=1  -DWIN32 -D_WIN32 -W3 -D_WIN95 -D_WIN32_WINDOWS=0x0400 /D_WIN32_DCOM -D_WIN32_IE=0x0500 -DWINVER=0x0400 -Oityb1 -W3 -FdC:\continuum-1.0.2\apps\continuum\working-directory\6\classlib\deploy\lib\hyfdlibm.pdb -D_IEEE_LIBM  -DHY_PLATFORM_DOUBLE_ORDER /I..\..\shared\fdlibm\ /I..\..\..\modules\luni\src\main\native\include\shared /I..\..\..\modules\luni\src\main\native\include\windows -Fodist/w_gamma_r.obj dist/w_gamma_r.c
     [exec]      [exec] w_gamma_r.c
     [exec]      [exec] 	cl -c -DCRTAPI1=_cdecl -DCRTAPI2=_cdecl -nologo -FIsehmap.h -D_X86_=1  -DWIN32 -D_WIN32 -W3 -D_WIN95 -D_WIN32_WINDOWS=0x0400 /D_WIN32_DCOM -D_WIN32_IE=0x0500 -DWINVER=0x0400 -Oityb1 -W3 -FdC:\continuum-1.0.2\apps\continuum\working-directory\6\classlib\deploy\lib\hyfdlibm.pdb -D_IEEE_LIBM  -DHY_PLATFORM_DOUBLE_ORDER /I..\..\shared\fdlibm\ /I..\..\..\modules\luni\src\main\native\include\shared /I..\..\..\modules\luni\src\main\native\include\windows -Fodist/w_hypot.obj dist/w_hypot.c
     [exec]      [exec] w_hypot.c
     [exec]      [exec] 	cl -c -DCRTAPI1=_cdecl -DCRTAPI2=_cdecl -nologo -FIsehmap.h -D_X86_=1  -DWIN32 -D_WIN32 -W3 -D_WIN95 -D_WIN32_WINDOWS=0x0400 /D_WIN32_DCOM -D_WIN32_IE=0x0500 -DWINVER=0x0400 -Oityb1 -W3 -FdC:\continuum-1.0.2\apps\continuum\working-directory\6\classlib\deploy\lib\hyfdlibm.pdb -D_IEEE_LIBM  -DHY_PLATFORM_DOUBLE_ORDER /I..\..\shared\fdlibm\ /I..\..\..\modules\luni\src\main\native\include\shared /I..\..\..\modules\luni\src\main\native\include\windows -Fodist/w_j0.obj dist/w_j0.c
     [exec]      [exec] w_j0.c
     [exec]      [exec] 	cl -c -DCRTAPI1=_cdecl -DCRTAPI2=_cdecl -nologo -FIsehmap.h -D_X86_=1  -DWIN32 -D_WIN32 -W3 -D_WIN95 -D_WIN32_WINDOWS=0x0400 /D_WIN32_DCOM -D_WIN32_IE=0x0500 -DWINVER=0x0400 -Oityb1 -W3 -FdC:\continuum-1.0.2\apps\continuum\working-directory\6\classlib\deploy\lib\hyfdlibm.pdb -D_IEEE_LIBM  -DHY_PLATFORM_DOUBLE_ORDER /I..\..\shared\fdlibm\ /I..\..\..\modules\luni\src\main\native\include\shared /I..\..\..\modules\luni\src\main\native\include\windows -Fodist/w_j1.obj dist/w_j1.c
     [exec]      [exec] w_j1.c
     [exec]      [exec] 	cl -c -DCRTAPI1=_cdecl -DCRTAPI2=_cdecl -nologo -FIsehmap.h -D_X86_=1  -DWIN32 -D_WIN32 -W3 -D_WIN95 -D_WIN32_WINDOWS=0x0400 /D_WIN32_DCOM -D_WIN32_IE=0x0500 -DWINVER=0x0400 -Oityb1 -W3 -FdC:\continuum-1.0.2\apps\continuum\working-directory\6\classlib\deploy\lib\hyfdlibm.pdb -D_IEEE_LIBM  -DHY_PLATFORM_DOUBLE_ORDER /I..\..\shared\fdlibm\ /I..\..\..\modules\luni\src\main\native\include\shared /I..\..\..\modules\luni\src\main\native\include\windows -Fodist/w_jn.obj dist/w_jn.c
     [exec]      [exec] w_jn.c
     [exec]      [exec] 	cl -c -DCRTAPI1=_cdecl -DCRTAPI2=_cdecl -nologo -FIsehmap.h -D_X86_=1  -DWIN32 -D_WIN32 -W3 -D_WIN95 -D_WIN32_WINDOWS=0x0400 /D_WIN32_DCOM -D_WIN32_IE=0x0500 -DWINVER=0x0400 -Oityb1 -W3 -FdC:\continuum-1.0.2\apps\continuum\working-directory\6\classlib\deploy\lib\hyfdlibm.pdb -D_IEEE_LIBM  -DHY_PLATFORM_DOUBLE_ORDER /I..\..\shared\fdlibm\ /I..\..\..\modules\luni\src\main\native\include\shared /I..\..\..\modules\luni\src\main\native\include\windows -Fodist/w_lgamma.obj dist/w_lgamma.c
     [exec]      [exec] w_lgamma.c
     [exec]      [exec] 	cl -c -DCRTAPI1=_cdecl -DCRTAPI2=_cdecl -nologo -FIsehmap.h -D_X86_=1  -DWIN32 -D_WIN32 -W3 -D_WIN95 -D_WIN32_WINDOWS=0x0400 /D_WIN32_DCOM -D_WIN32_IE=0x0500 -DWINVER=0x0400 -Oityb1 -W3 -FdC:\continuum-1.0.2\apps\continuum\working-directory\6\classlib\deploy\lib\hyfdlibm.pdb -D_IEEE_LIBM  -DHY_PLATFORM_DOUBLE_ORDER /I..\..\shared\fdlibm\ /I..\..\..\modules\luni\src\main\native\include\shared /I..\..\..\modules\luni\src\main\native\include\windows -Fodist/w_lgamma_r.obj dist/w_lgamma_r.c
     [exec]      [exec] w_lgamma_r.c
     [exec]      [exec] 	cl -c -DCRTAPI1=_cdecl -DCRTAPI2=_cdecl -nologo -FIsehmap.h -D_X86_=1  -DWIN32 -D_WIN32 -W3 -D_WIN95 -D_WIN32_WINDOWS=0x0400 /D_WIN32_DCOM -D_WIN32_IE=0x0500 -DWINVER=0x0400 -Oityb1 -W3 -FdC:\continuum-1.0.2\apps\continuum\working-directory\6\classlib\deploy\lib\hyfdlibm.pdb -D_IEEE_LIBM  -DHY_PLATFORM_DOUBLE_ORDER /I..\..\shared\fdlibm\ /I..\..\..\modules\luni\src\main\native\include\shared /I..\..\..\modules\luni\src\main\native\include\windows -Fodist/w_log.obj dist/w_log.c
     [exec]      [exec] w_log.c
     [exec]      [exec] 	cl -c -DCRTAPI1=_cdecl -DCRTAPI2=_cdecl -nologo -FIsehmap.h -D_X86_=1  -DWIN32 -D_WIN32 -W3 -D_WIN95 -D_WIN32_WINDOWS=0x0400 /D_WIN32_DCOM -D_WIN32_IE=0x0500 -DWINVER=0x0400 -Oityb1 -W3 -FdC:\continuum-1.0.2\apps\continuum\working-directory\6\classlib\deploy\lib\hyfdlibm.pdb -D_IEEE_LIBM  -DHY_PLATFORM_DOUBLE_ORDER /I..\..\shared\fdlibm\ /I..\..\..\modules\luni\src\main\native\include\shared /I..\..\..\modules\luni\src\main\native\include\windows -Fodist/w_log10.obj dist/w_log10.c
     [exec]      [exec] w_log10.c
     [exec]      [exec] 	cl -c -DCRTAPI1=_cdecl -DCRTAPI2=_cdecl -nologo -FIsehmap.h -D_X86_=1  -DWIN32 -D_WIN32 -W3 -D_WIN95 -D_WIN32_WINDOWS=0x0400 /D_WIN32_DCOM -D_WIN32_IE=0x0500 -DWINVER=0x0400 -Oityb1 -W3 -FdC:\continuum-1.0.2\apps\continuum\working-directory\6\classlib\deploy\lib\hyfdlibm.pdb -D_IEEE_LIBM  -DHY_PLATFORM_DOUBLE_ORDER /I..\..\shared\fdlibm\ /I..\..\..\modules\luni\src\main\native\include\shared /I..\..\..\modules\luni\src\main\native\include\windows -Fodist/w_pow.obj dist/w_pow.c
     [exec]      [exec] w_pow.c
     [exec]      [exec] 	cl -c -DCRTAPI1=_cdecl -DCRTAPI2=_cdecl -nologo -FIsehmap.h -D_X86_=1  -DWIN32 -D_WIN32 -W3 -D_WIN95 -D_WIN32_WINDOWS=0x0400 /D_WIN32_DCOM -D_WIN32_IE=0x0500 -DWINVER=0x0400 -Oityb1 -W3 -FdC:\continuum-1.0.2\apps\continuum\working-directory\6\classlib\deploy\lib\hyfdlibm.pdb -D_IEEE_LIBM  -DHY_PLATFORM_DOUBLE_ORDER /I..\..\shared\fdlibm\ /I..\..\..\modules\luni\src\main\native\include\shared /I..\..\..\modules\luni\src\main\native\include\windows -Fodist/w_remainder.obj dist/w_remainder.c
     [exec]      [exec] w_remainder.c
     [exec]      [exec] 	cl -c -DCRTAPI1=_cdecl -DCRTAPI2=_cdecl -nologo -FIsehmap.h -D_X86_=1  -DWIN32 -D_WIN32 -W3 -D_WIN95 -D_WIN32_WINDOWS=0x0400 /D_WIN32_DCOM -D_WIN32_IE=0x0500 -DWINVER=0x0400 -Oityb1 -W3 -FdC:\continuum-1.0.2\apps\continuum\working-directory\6\classlib\deploy\lib\hyfdlibm.pdb -D_IEEE_LIBM  -DHY_PLATFORM_DOUBLE_ORDER /I..\..\shared\fdlibm\ /I..\..\..\modules\luni\src\main\native\include\shared /I..\..\..\modules\luni\src\main\native\include\windows -Fodist/w_scalb.obj dist/w_scalb.c
     [exec]      [exec] w_scalb.c
     [exec]      [exec] 	cl -c -DCRTAPI1=_cdecl -DCRTAPI2=_cdecl -nologo -FIsehmap.h -D_X86_=1  -DWIN32 -D_WIN32 -W3 -D_WIN95 -D_WIN32_WINDOWS=0x0400 /D_WIN32_DCOM -D_WIN32_IE=0x0500 -DWINVER=0x0400 -Oityb1 -W3 -FdC:\continuum-1.0.2\apps\continuum\working-directory\6\classlib\deploy\lib\hyfdlibm.pdb -D_IEEE_LIBM  -DHY_PLATFORM_DOUBLE_ORDER /I..\..\shared\fdlibm\ /I..\..\..\modules\luni\src\main\native\include\shared /I..\..\..\modules\luni\src\main\native\include\windows -Fodist/w_sinh.obj dist/w_sinh.c
     [exec]      [exec] w_sinh.c
     [exec]      [exec] 	cl -c -DCRTAPI1=_cdecl -DCRTAPI2=_cdecl -nologo -FIsehmap.h -D_X86_=1  -DWIN32 -D_WIN32 -W3 -D_WIN95 -D_WIN32_WINDOWS=0x0400 /D_WIN32_DCOM -D_WIN32_IE=0x0500 -DWINVER=0x0400 -Oityb1 -W3 -FdC:\continuum-1.0.2\apps\continuum\working-directory\6\classlib\deploy\lib\hyfdlibm.pdb -D_IEEE_LIBM  -DHY_PLATFORM_DOUBLE_ORDER /I..\..\shared\fdlibm\ /I..\..\..\modules\luni\src\main\native\include\shared /I..\..\..\modules\luni\src\main\native\include\windows -Fodist/w_sqrt.obj dist/w_sqrt.c
     [exec]      [exec] w_sqrt.c
     [exec]      [exec] 	lib @templrf
     [exec]      [exec] 	cd ..
     [exec]      [exec] 	cd zip
     [exec]      [exec] 	nmake /NOLOGO
     [exec]      [exec] 	lib /NOLOGO -subsystem:windows -out:C:\continuum-1.0.2\apps\continuum\working-directory\6\classlib\deploy\lib\hyzip.lib   -machine:i386  ..\..\shared\zip\zcpool.obj ..\..\shared\zip\zipalloc.obj  ..\..\shared\zip\zipcache.obj ..\..\shared\zip\zipsup.obj  
     [exec]      [exec] 	cd ..
     [exec]      [exec] 	cd zlib
     [exec]      [exec] 	nmake /NOLOGO
     [exec]      [exec] 	cl -c -DCRTAPI1=_cdecl -DCRTAPI2=_cdecl -nologo -FIsehmap.h -D_X86_=1  -DWIN32 -D_WIN32 -W3 -D_WIN95 -D_WIN32_WINDOWS=0x0400 /D_WIN32_DCOM -D_WIN32_IE=0x0500 -DWINVER=0x0400 -Ogityb1 -W3 -GF -Gs -MD -Zi -Zm400  -D_DLL -D_MT -DWIN32 -D_WIN32_WINNT=0x0400 -D_WINSOCKAPI_ -DWINVER=0x0400   /I..\include /I..\..\shared\include /I. /I..\..\..\modules\archive\src\main\native\include\shared -Fodist\adler32.obj dist\adler32.c
     [exec]      [exec] adler32.c
     [exec]      [exec] 	cl -c -DCRTAPI1=_cdecl -DCRTAPI2=_cdecl -nologo -FIsehmap.h -D_X86_=1  -DWIN32 -D_WIN32 -W3 -D_WIN95 -D_WIN32_WINDOWS=0x0400 /D_WIN32_DCOM -D_WIN32_IE=0x0500 -DWINVER=0x0400 -Ogityb1 -W3 -GF -Gs -MD -Zi -Zm400  -D_DLL -D_MT -DWIN32 -D_WIN32_WINNT=0x0400 -D_WINSOCKAPI_ -DWINVER=0x0400   /I..\include /I..\..\shared\include /I. /I..\..\..\modules\archive\src\main\native\include\shared -Fodist\compress.obj dist\compress.c
     [exec]      [exec] compress.c
     [exec]      [exec] 	cl -c -DCRTAPI1=_cdecl -DCRTAPI2=_cdecl -nologo -FIsehmap.h -D_X86_=1  -DWIN32 -D_WIN32 -W3 -D_WIN95 -D_WIN32_WINDOWS=0x0400 /D_WIN32_DCOM -D_WIN32_IE=0x0500 -DWINVER=0x0400 -Ogityb1 -W3 -GF -Gs -MD -Zi -Zm400  -D_DLL -D_MT -DWIN32 -D_WIN32_WINNT=0x0400 -D_WINSOCKAPI_ -DWINVER=0x0400   /I..\include /I..\..\shared\include /I. /I..\..\..\modules\archive\src\main\native\include\shared -Fodist\crc32.obj dist\crc32.c
     [exec]      [exec] crc32.c
     [exec]      [exec] 	cl -c -DCRTAPI1=_cdecl -DCRTAPI2=_cdecl -nologo -FIsehmap.h -D_X86_=1  -DWIN32 -D_WIN32 -W3 -D_WIN95 -D_WIN32_WINDOWS=0x0400 /D_WIN32_DCOM -D_WIN32_IE=0x0500 -DWINVER=0x0400 -Ogityb1 -W3 -GF -Gs -MD -Zi -Zm400  -D_DLL -D_MT -DWIN32 -D_WIN32_WINNT=0x0400 -D_WINSOCKAPI_ -DWINVER=0x0400   /I..\include /I..\..\shared\include /I. /I..\..\..\modules\archive\src\main\native\include\shared -Fodist\deflate.obj dist\deflate.c
     [exec]      [exec] deflate.c
     [exec]      [exec] 	cl -c -DCRTAPI1=_cdecl -DCRTAPI2=_cdecl -nologo -FIsehmap.h -D_X86_=1  -DWIN32 -D_WIN32 -W3 -D_WIN95 -D_WIN32_WINDOWS=0x0400 /D_WIN32_DCOM -D_WIN32_IE=0x0500 -DWINVER=0x0400 -Ogityb1 -W3 -GF -Gs -MD -Zi -Zm400  -D_DLL -D_MT -DWIN32 -D_WIN32_WINNT=0x0400 -D_WINSOCKAPI_ -DWINVER=0x0400   /I..\include /I..\..\shared\include /I. /I..\..\..\modules\archive\src\main\native\include\shared -Fodist\gzio.obj dist\gzio.c
     [exec]      [exec] gzio.c
     [exec]      [exec] 	cl -c -DCRTAPI1=_cdecl -DCRTAPI2=_cdecl -nologo -FIsehmap.h -D_X86_=1  -DWIN32 -D_WIN32 -W3 -D_WIN95 -D_WIN32_WINDOWS=0x0400 /D_WIN32_DCOM -D_WIN32_IE=0x0500 -DWINVER=0x0400 -Ogityb1 -W3 -GF -Gs -MD -Zi -Zm400  -D_DLL -D_MT -DWIN32 -D_WIN32_WINNT=0x0400 -D_WINSOCKAPI_ -DWINVER=0x0400   /I..\include /I..\..\shared\include /I. /I..\..\..\modules\archive\src\main\native\include\shared -Fodist\infback.obj dist\infback.c
     [exec]      [exec] infback.c
     [exec]      [exec] 	cl -c -DCRTAPI1=_cdecl -DCRTAPI2=_cdecl -nologo -FIsehmap.h -D_X86_=1  -DWIN32 -D_WIN32 -W3 -D_WIN95 -D_WIN32_WINDOWS=0x0400 /D_WIN32_DCOM -D_WIN32_IE=0x0500 -DWINVER=0x0400 -Ogityb1 -W3 -GF -Gs -MD -Zi -Zm400  -D_DLL -D_MT -DWIN32 -D_WIN32_WINNT=0x0400 -D_WINSOCKAPI_ -DWINVER=0x0400   /I..\include /I..\..\shared\include /I. /I..\..\..\modules\archive\src\main\native\include\shared -Fodist\inffast.obj dist\inffast.c
     [exec]      [exec] inffast.c
     [exec]      [exec] 	cl -c -DCRTAPI1=_cdecl -DCRTAPI2=_cdecl -nologo -FIsehmap.h -D_X86_=1  -DWIN32 -D_WIN32 -W3 -D_WIN95 -D_WIN32_WINDOWS=0x0400 /D_WIN32_DCOM -D_WIN32_IE=0x0500 -DWINVER=0x0400 -Ogityb1 -W3 -GF -Gs -MD -Zi -Zm400  -D_DLL -D_MT -DWIN32 -D_WIN32_WINNT=0x0400 -D_WINSOCKAPI_ -DWINVER=0x0400   /I..\include /I..\..\shared\include /I. /I..\..\..\modules\archive\src\main\native\include\shared -Fodist\inflate.obj dist\inflate.c
     [exec]      [exec] inflate.c
     [exec]      [exec] 	cl -c -DCRTAPI1=_cdecl -DCRTAPI2=_cdecl -nologo -FIsehmap.h -D_X86_=1  -DWIN32 -D_WIN32 -W3 -D_WIN95 -D_WIN32_WINDOWS=0x0400 /D_WIN32_DCOM -D_WIN32_IE=0x0500 -DWINVER=0x0400 -Ogityb1 -W3 -GF -Gs -MD -Zi -Zm400  -D_DLL -D_MT -DWIN32 -D_WIN32_WINNT=0x0400 -D_WINSOCKAPI_ -DWINVER=0x0400   /I..\include /I..\..\shared\include /I. /I..\..\..\modules\archive\src\main\native\include\shared -Fodist\inftrees.obj dist\inftrees.c
     [exec]      [exec] inftrees.c
     [exec]      [exec] 	cl -c -DCRTAPI1=_cdecl -DCRTAPI2=_cdecl -nologo -FIsehmap.h -D_X86_=1  -DWIN32 -D_WIN32 -W3 -D_WIN95 -D_WIN32_WINDOWS=0x0400 /D_WIN32_DCOM -D_WIN32_IE=0x0500 -DWINVER=0x0400 -Ogityb1 -W3 -GF -Gs -MD -Zi -Zm400  -D_DLL -D_MT -DWIN32 -D_WIN32_WINNT=0x0400 -D_WINSOCKAPI_ -DWINVER=0x0400   /I..\include /I..\..\shared\include /I. /I..\..\..\modules\archive\src\main\native\include\shared -Fodist\trees.obj dist\trees.c
     [exec]      [exec] trees.c
     [exec]      [exec] 	cl -c -DCRTAPI1=_cdecl -DCRTAPI2=_cdecl -nologo -FIsehmap.h -D_X86_=1  -DWIN32 -D_WIN32 -W3 -D_WIN95 -D_WIN32_WINDOWS=0x0400 /D_WIN32_DCOM -D_WIN32_IE=0x0500 -DWINVER=0x0400 -Ogityb1 -W3 -GF -Gs -MD -Zi -Zm400  -D_DLL -D_MT -DWIN32 -D_WIN32_WINNT=0x0400 -D_WINSOCKAPI_ -DWINVER=0x0400   /I..\include /I..\..\shared\include /I. /I..\..\..\modules\archive\src\main\native\include\shared -Fodist\uncompr.obj dist\uncompr.c
     [exec]      [exec] uncompr.c
     [exec]      [exec] 	cl -c -DCRTAPI1=_cdecl -DCRTAPI2=_cdecl -nologo -FIsehmap.h -D_X86_=1  -DWIN32 -D_WIN32 -W3 -D_WIN95 -D_WIN32_WINDOWS=0x0400 /D_WIN32_DCOM -D_WIN32_IE=0x0500 -DWINVER=0x0400 -Ogityb1 -W3 -GF -Gs -MD -Zi -Zm400  -D_DLL -D_MT -DWIN32 -D_WIN32_WINNT=0x0400 -D_WINSOCKAPI_ -DWINVER=0x0400   /I..\include /I..\..\shared\include /I. /I..\..\..\modules\archive\src\main\native\include\shared -Fodist\zutil.obj dist\zutil.c
     [exec]      [exec] zutil.c
     [exec]      [exec] 	lib /NOLOGO -subsystem:windows -out:C:\continuum-1.0.2\apps\continuum\working-directory\6\classlib\deploy\lib\hyzlib.lib   -def:hyzlib.def -machine:i386  ..\..\shared\zlib\zlib_copyright.obj dist\adler32.obj dist\compress.obj  dist\crc32.obj dist\deflate.obj dist\gzio.obj dist\infback.obj  dist\inffast.obj dist\inflate.obj dist\inftrees.obj dist\trees.obj  dist\uncompr.obj dist\zutil.obj hyzlib.res 
     [exec]      [exec]    Creating library C:\continuum-1.0.2\apps\continuum\working-directory\6\classlib\deploy\lib\hyzlib.lib and object C:\continuum-1.0.2\apps\continuum\working-directory\6\classlib\deploy\lib\hyzlib.exp
     [exec]      [exec] 	link  /debug /opt:icf /opt:ref /INCREMENTAL:NO /NOLOGO  -entry:_DllMainCRTStartup@12 -dll /BASE:0x11700000 -machine:i386  /comment:"zlib data compression library Copyright (C) 1995-2003 Jean-loup Gailly and Mark Adler"  -subsystem:windows -out:..\hyzlib.dll -map:..\hyzlib.map  ..\..\shared\zlib\zlib_copyright.obj dist\adler32.obj dist\compress.obj  dist\crc32.obj dist\deflate.obj dist\gzio.obj dist\infback.obj  dist\inffast.obj dist\inflate.obj dist\inftrees.obj dist\trees.obj  dist\uncompr.obj dist\zutil.obj hyzlib.res    kernel32.lib  ws2_32.lib advapi32.lib user32.lib gdi32.lib  comdlg32.lib winspool.lib  C:\continuum-1.0.2\apps\continuum\working-directory\6\classlib\deploy\lib\hyzlib.exp
     [exec]      [exec] 	cd ..
     [exec]      [exec] 	cd vmi
     [exec]      [exec] 	nmake /NOLOGO
     [exec]      [exec] 	lib /NOLOGO -subsystem:windows -out:C:\continuum-1.0.2\apps\continuum\working-directory\6\classlib\deploy\lib\vmi.lib   -def:vmi.def -machine:i386  ..\..\shared\vmi\vmi_copyright.obj ..\..\shared\vmi\vmi.obj vmi.res 
     [exec]      [exec]    Creating library C:\continuum-1.0.2\apps\continuum\working-directory\6\classlib\deploy\lib\vmi.lib and object C:\continuum-1.0.2\apps\continuum\working-directory\6\classlib\deploy\lib\vmi.exp
     [exec]      [exec] 	cd ..
     [exec]      [exec] 	cd luni
     [exec]      [exec] 	nmake /NOLOGO
     [exec]      [exec] 	lib /NOLOGO -subsystem:windows -out:C:\continuum-1.0.2\apps\continuum\working-directory\6\classlib\deploy\lib\hyluni.lib   -def:hyluni.def -machine:i386  ..\..\shared\luni\luni_copyright.obj ..\..\shared\luni\file.obj procimpl.obj  ..\..\shared\luni\oos.obj  ..\..\shared\luni\nethelp.obj ..\..\shared\luni\floatbits.obj  ..\..\shared\luni\ois.obj helpers.obj ..\..\shared\luni\math.obj  ..\..\shared\luni\luniglob.obj ..\..\shared\luni\proxy.obj ..\..\shared\luni\netif.obj  ..\..\shared\luni\cbigint.obj ..\..\shared\luni\dblparse.obj ..\..\shared\luni\fltparse.obj  ..\..\shared\luni\process.obj ..\..\shared\luni\bigint.obj ..\..\shared\luni\osc.obj  ..\..\shared\luni\socket.obj ..\..\shared\luni\inetadds.obj  ..\..\shared\luni\filedesc.obj ..\..\shared\luni\timezone.obj  OSFileSystemWin32.obj  ..\..\shared\luni\OSFileSystem.obj OSMemoryWin32.obj OSMemory.obj  ..\..\shared\luni\OSNetworkSystem.obj OSNetworkSystemWin32.obj hyluni.res C:\continuum-1.0.2\apps\continuum\working-directory\6\classlib\deploy\lib\hycommon.lib C:\continuum-1.0.2\apps\continuum\working-directory\6\classlib\deploy\lib\hysig.lib C:\continuum-1.0.2\apps\continuum\working-directory\6\classlib\deploy\lib\hyzip.lib C:\continuum-1.0.2\apps\continuum\working-directory\6\classlib\deploy\lib\hyzlib.lib  C:\continuum-1.0.2\apps\continuum\working-directory\6\classlib\deploy\lib\hypool.lib C:\continuum-1.0.2\apps\continuum\working-directory\6\classlib\deploy\lib\hyfdlibm.lib C:\continuum-1.0.2\apps\continuum\working-directory\6\classlib\deploy\lib\hythr.lib C:\continuum-1.0.2\apps\continuum\working-directory\6\classlib\deploy\lib\vmi.lib
     [exec]      [exec]    Creating library C:\continuum-1.0.2\apps\continuum\working-directory\6\classlib\deploy\lib\hyluni.lib and object C:\continuum-1.0.2\apps\continuum\working-directory\6\classlib\deploy\lib\hyluni.exp
     [exec]      [exec] 	link  /debug /opt:icf /opt:ref /INCREMENTAL:NO /NOLOGO  -entry:_DllMainCRTStartup@12 -dll /BASE:0x13200000 -machine:i386  /comment:"LUNI component native code. (c) Copyright 1991, 2005 The Apache Software Foundation or its licensors, as applicable."  -subsystem:windows -out:..\hyluni.dll -map:..\hyluni.map  ..\..\shared\luni\luni_copyright.obj ..\..\shared\luni\file.obj procimpl.obj  ..\..\shared\luni\oos.obj  ..\..\shared\luni\nethelp.obj ..\..\shared\luni\floatbits.obj  ..\..\shared\luni\ois.obj helpers.obj ..\..\shared\luni\math.obj  ..\..\shared\luni\luniglob.obj ..\..\shared\luni\proxy.obj ..\..\shared\luni\netif.obj  ..\..\shared\luni\cbigint.obj ..\..\shared\luni\dblparse.obj ..\..\shared\luni\fltparse.obj  ..\..\shared\luni\process.obj ..\..\shared\luni\bigint.obj ..\..\shared\luni\osc.obj  ..\..\shared\luni\socket.obj ..\..\shared\luni\inetadds.obj  ..\..\shared\luni\filedesc.obj ..\..\shared\luni\timezone.obj  OSFileSystemWin32.obj  ..\..\shared\luni\OSFileSystem.obj OSMemoryWin32.obj OSMemory.obj  ..\..\shared\luni\OSNetworkSystem.obj OSNetworkSystemWin32.obj hyluni.res C:\continuum-1.0.2\apps\continuum\working-directory\6\classlib\deploy\lib\hycommon.lib C:\continuum-1.0.2\apps\continuum\working-directory\6\classlib\deploy\lib\hysig.lib C:\continuum-1.0.2\apps\continuum\working-directory\6\classlib\deploy\lib\hyzip.lib C:\continuum-1.0.2\apps\continuum\working-directory\6\classlib\deploy\lib\hyzlib.lib  C:\continuum-1.0.2\apps\continuum\working-directory\6\classlib\deploy\lib\hypool.lib C:\continuum-1.0.2\apps\continuum\working-directory\6\classlib\deploy\lib\hyfdlibm.lib C:\continuum-1.0.2\apps\continuum\working-directory\6\classlib\deploy\lib\hythr.lib C:\continuum-1.0.2\apps\continuum\working-directory\6\classlib\deploy\lib\vmi.lib ws2_32.lib Iphlpapi.lib Mswsock.lib  kernel32.lib  ws2_32.lib advapi32.lib user32.lib gdi32.lib  comdlg32.lib winspool.lib  C:\continuum-1.0.2\apps\continuum\working-directory\6\classlib\deploy\lib\hyluni.exp
     [exec]      [exec] LINK : warning LNK4098: defaultlib 'LIBC' conflicts with use of other libs; use /NODEFAULTLIB:library
     [exec]      [exec] 	cd ..
     [exec]      [exec] 	cd auth
     [exec]      [exec] 	nmake /NOLOGO
     [exec]      [exec] 	lib /NOLOGO -subsystem:windows -out:C:\continuum-1.0.2\apps\continuum\working-directory\6\classlib\deploy\lib\hyauth.lib   -def:hyauth.def -machine:i386  ..\..\shared\auth\auth_copyright.obj authwin32.obj hyauth.res C:\continuum-1.0.2\apps\continuum\working-directory\6\classlib\deploy\lib\hycommon.lib C:\continuum-1.0.2\apps\continuum\working-directory\6\classlib\deploy\lib\hysig.lib C:\continuum-1.0.2\apps\continuum\working-directory\6\classlib\deploy\lib\hyzip.lib  C:\continuum-1.0.2\apps\continuum\working-directory\6\classlib\deploy\lib\hyzlib.lib C:\continuum-1.0.2\apps\continuum\working-directory\6\classlib\deploy\lib\hypool.lib C:\continuum-1.0.2\apps\continuum\working-directory\6\classlib\deploy\lib\hyfdlibm.lib  C:\continuum-1.0.2\apps\continuum\working-directory\6\classlib\deploy\lib\hythr.lib C:\continuum-1.0.2\apps\continuum\working-directory\6\classlib\deploy\lib\vmi.lib
     [exec]      [exec]    Creating library C:\continuum-1.0.2\apps\continuum\working-directory\6\classlib\deploy\lib\hyauth.lib and object C:\continuum-1.0.2\apps\continuum\working-directory\6\classlib\deploy\lib\hyauth.exp
     [exec]      [exec] 	link  /debug /opt:icf /opt:ref /INCREMENTAL:NO /NOLOGO  -entry:_DllMainCRTStartup@12 -dll /BASE:0x1300000 -machine:i386  /comment:"Auth component native code. (c) Copyright 2005, 2006 The Apache Software Foundation or its licensors, as applicable."  -subsystem:windows -out:..\hyauth.dll -map:..\hyauth.map  ..\..\shared\auth\auth_copyright.obj authwin32.obj hyauth.res C:\continuum-1.0.2\apps\continuum\working-directory\6\classlib\deploy\lib\hycommon.lib C:\continuum-1.0.2\apps\continuum\working-directory\6\classlib\deploy\lib\hysig.lib C:\continuum-1.0.2\apps\continuum\working-directory\6\classlib\deploy\lib\hyzip.lib  C:\continuum-1.0.2\apps\continuum\working-directory\6\classlib\deploy\lib\hyzlib.lib C:\continuum-1.0.2\apps\continuum\working-directory\6\classlib\deploy\lib\hypool.lib C:\continuum-1.0.2\apps\continuum\working-directory\6\classlib\deploy\lib\hyfdlibm.lib  C:\continuum-1.0.2\apps\continuum\working-directory\6\classlib\deploy\lib\hythr.lib C:\continuum-1.0.2\apps\continuum\working-directory\6\classlib\deploy\lib\vmi.lib ws2_32.lib Iphlpapi.lib  kernel32.lib  ws2_32.lib advapi32.lib user32.lib gdi32.lib  comdlg32.lib winspool.lib  C:\continuum-1.0.2\apps\continuum\working-directory\6\classlib\deploy\lib\hyauth.exp
     [exec]      [exec] 	cd ..
     [exec]      [exec] 	cd archive
     [exec]      [exec] 	nmake /NOLOGO
     [exec]      [exec] 	lib /NOLOGO -subsystem:windows -out:C:\continuum-1.0.2\apps\continuum\working-directory\6\classlib\deploy\lib\hyarchive.lib   -def:hyarchive.def -machine:i386  ..\..\shared\archive\archive_copyright.obj ..\..\shared\archive\jclcrc32.obj  ..\..\shared\archive\zip.obj ..\..\shared\archive\adler32.obj ..\..\shared\archive\inflater.obj  ..\..\shared\archive\jarfile.obj ..\..\shared\archive\deflater.obj  ..\..\shared\archive\archiveglob.obj hyarchive.res C:\continuum-1.0.2\apps\continuum\working-directory\6\classlib\deploy\lib\hycommon.lib C:\continuum-1.0.2\apps\continuum\working-directory\6\classlib\deploy\lib\hysig.lib C:\continuum-1.0.2\apps\continuum\working-directory\6\classlib\deploy\lib\hyzip.lib  C:\continuum-1.0.2\apps\continuum\working-directory\6\classlib\deploy\lib\hyzlib.lib C:\continuum-1.0.2\apps\continuum\working-directory\6\classlib\deploy\lib\hypool.lib C:\continuum-1.0.2\apps\continuum\working-directory\6\classlib\deploy\lib\hyfdlibm.lib  C:\continuum-1.0.2\apps\continuum\working-directory\6\classlib\deploy\lib\hythr.lib C:\continuum-1.0.2\apps\continuum\working-directory\6\classlib\deploy\lib\vmi.lib
     [exec]      [exec]    Creating library C:\continuum-1.0.2\apps\continuum\working-directory\6\classlib\deploy\lib\hyarchive.lib and object C:\continuum-1.0.2\apps\continuum\working-directory\6\classlib\deploy\lib\hyarchive.exp
     [exec]      [exec] 	link  /debug /opt:icf /opt:ref /INCREMENTAL:NO /NOLOGO  -entry:_DllMainCRTStartup@12 -dll /BASE:0x13100000 -machine:i386    -subsystem:windows -out:..\hyarchive.dll -map:..\hyarchive.map  ..\..\shared\archive\archive_copyright.obj ..\..\shared\archive\jclcrc32.obj  ..\..\shared\archive\zip.obj ..\..\shared\archive\adler32.obj ..\..\shared\archive\inflater.obj  ..\..\shared\archive\jarfile.obj ..\..\shared\archive\deflater.obj  ..\..\shared\archive\archiveglob.obj hyarchive.res C:\continuum-1.0.2\apps\continuum\working-directory\6\classlib\deploy\lib\hycommon.lib C:\continuum-1.0.2\apps\continuum\working-directory\6\classlib\deploy\lib\hysig.lib C:\continuum-1.0.2\apps\continuum\working-directory\6\classlib\deploy\lib\hyzip.lib  C:\continuum-1.0.2\apps\continuum\working-directory\6\classlib\deploy\lib\hyzlib.lib C:\continuum-1.0.2\apps\continuum\working-directory\6\classlib\deploy\lib\hypool.lib C:\continuum-1.0.2\apps\continuum\working-directory\6\classlib\deploy\lib\hyfdlibm.lib  C:\continuum-1.0.2\apps\continuum\working-directory\6\classlib\deploy\lib\hythr.lib C:\continuum-1.0.2\apps\continuum\working-directory\6\classlib\deploy\lib\vmi.lib ws2_32.lib Iphlpapi.lib  kernel32.lib  ws2_32.lib advapi32.lib user32.lib gdi32.lib  comdlg32.lib winspool.lib  C:\continuum-1.0.2\apps\continuum\working-directory\6\classlib\deploy\lib\hyarchive.exp
     [exec]      [exec] 	cd ..
     [exec]      [exec] 	cd launcher
     [exec]      [exec] 	nmake /NOLOGO
     [exec]      [exec] 	nmake /NOLOGO -f makefile.javae
     [exec]      [exec] 	cl -c -DCRTAPI1=_cdecl -DCRTAPI2=_cdecl -nologo -FIsehmap.h -D_X86_=1  -DWIN32 -D_WIN32 -W3 -D_WIN95 -D_WIN32_WINDOWS=0x0400 /D_WIN32_DCOM -D_WIN32_IE=0x0500 -DWINVER=0x0400 -Ogityb1 -WX -GF -Gs -MD -Zi -Zm400  -D_DLL -D_MT -DWIN32 -D_WIN32_WINNT=0x0400 -D_WINSOCKAPI_ -DWINVER=0x0400   /IC:\continuum-1.0.2\apps\continuum\working-directory\6\classlib\deploy\include /IC:\continuum-1.0.2\apps\continuum\working-directory\6\classlib\deploy\jdk\include /I. /I..\..\shared\launcher\ -Fo..\..\shared\launcher\launcher_copyright.obj ..\..\shared\launcher\launcher_copyright.c
     [exec]      [exec] launcher_copyright.c
     [exec]      [exec] 	cl -c -DCRTAPI1=_cdecl -DCRTAPI2=_cdecl -nologo -FIsehmap.h -D_X86_=1  -DWIN32 -D_WIN32 -W3 -D_WIN95 -D_WIN32_WINDOWS=0x0400 /D_WIN32_DCOM -D_WIN32_IE=0x0500 -DWINVER=0x0400 -Ogityb1 -WX -GF -Gs -MD -Zi -Zm400  -D_DLL -D_MT -DWIN32 -D_WIN32_WINNT=0x0400 -D_WINSOCKAPI_ -DWINVER=0x0400   /IC:\continuum-1.0.2\apps\continuum\working-directory\6\classlib\deploy\include /IC:\continuum-1.0.2\apps\continuum\working-directory\6\classlib\deploy\jdk\include /I. /I..\..\shared\launcher\ -Fo..\..\shared\launcher\cmain.obj ..\..\shared\launcher\cmain.c
     [exec]      [exec] cmain.c
     [exec]      [exec] 	cl -c -DCRTAPI1=_cdecl -DCRTAPI2=_cdecl -nologo -FIsehmap.h -D_X86_=1  -DWIN32 -D_WIN32 -W3 -D_WIN95 -D_WIN32_WINDOWS=0x0400 /D_WIN32_DCOM -D_WIN32_IE=0x0500 -DWINVER=0x0400 -Ogityb1 -WX -GF -Gs -MD -Zi -Zm400  -D_DLL -D_MT -DWIN32 -D_WIN32_WINNT=0x0400 -D_WINSOCKAPI_ -DWINVER=0x0400   /IC:\continuum-1.0.2\apps\continuum\working-directory\6\classlib\deploy\include /IC:\continuum-1.0.2\apps\continuum\working-directory\6\classlib\deploy\jdk\include /I. /I..\..\shared\launcher\ -Fo..\..\shared\launcher\main.obj ..\..\shared\launcher\main.c
     [exec]      [exec] main.c
     [exec]      [exec] 	cl -c -DCRTAPI1=_cdecl -DCRTAPI2=_cdecl -nologo -FIsehmap.h -D_X86_=1  -DWIN32 -D_WIN32 -W3 -D_WIN95 -D_WIN32_WINDOWS=0x0400 /D_WIN32_DCOM -D_WIN32_IE=0x0500 -DWINVER=0x0400 -Ogityb1 -WX -GF -Gs -MD -Zi -Zm400  -D_DLL -D_MT -DWIN32 -D_WIN32_WINNT=0x0400 -D_WINSOCKAPI_ -DWINVER=0x0400   /IC:\continuum-1.0.2\apps\continuum\working-directory\6\classlib\deploy\include /IC:\continuum-1.0.2\apps\continuum\working-directory\6\classlib\deploy\jdk\include /I. /I..\..\shared\launcher\ -Fo..\..\shared\launcher\strbuf.obj ..\..\shared\launcher\strbuf.c
     [exec]      [exec] strbuf.c
     [exec]      [exec] 	cl -c -DCRTAPI1=_cdecl -DCRTAPI2=_cdecl -nologo -FIsehmap.h -D_X86_=1  -DWIN32 -D_WIN32 -W3 -D_WIN95 -D_WIN32_WINDOWS=0x0400 /D_WIN32_DCOM -D_WIN32_IE=0x0500 -DWINVER=0x0400 -Ogityb1 -WX -GF -Gs -MD -Zi -Zm400  -D_DLL -D_MT -DWIN32 -D_WIN32_WINNT=0x0400 -D_WINSOCKAPI_ -DWINVER=0x0400   /IC:\continuum-1.0.2\apps\continuum\working-directory\6\classlib\deploy\include /IC:\continuum-1.0.2\apps\continuum\working-directory\6\classlib\deploy\jdk\include /I. /I..\..\shared\launcher\ -Fo..\..\shared\launcher\libhlp.obj ..\..\shared\launcher\libhlp.c
     [exec]      [exec] libhlp.c
     [exec]      [exec] 	rc -I..\include java.rc
     [exec]      [exec] 	link /NOLOGO  /INCREMENTAL:NO /NOLOGO -subsystem:console,4.0 -subsystem:console /debug /opt:icf /opt:ref   -out:..\java.exe -machine:i386 setargv.obj   ..\..\shared\launcher\launcher_copyright.obj ..\..\shared\launcher\cmain.obj  ..\..\shared\launcher\main.obj ..\..\shared\launcher\strbuf.obj ..\..\shared\launcher\libhlp.obj java.res C:\continuum-1.0.2\apps\continuum\working-directory\6\classlib\deploy\lib\hyprt.lib C:\continuum-1.0.2\apps\continuum\working-directory\6\classlib\deploy\lib\hythr.lib kernel32.lib  wsock32.lib advapi32.lib
     [exec]      [exec] 	nmake /NOLOGO -f makefile.javaw
     [exec]      [exec] 	cl -c -DCRTAPI1=_cdecl -DCRTAPI2=_cdecl -nologo -FIsehmap.h -D_X86_=1  -DWIN32 -D_WIN32 -W3 -D_WIN95 -D_WIN32_WINDOWS=0x0400 /D_WIN32_DCOM -D_WIN32_IE=0x0500 -DWINVER=0x0400 -Ogityb1 -WX -GF -Gs -MD -Zi -Zm400  -D_DLL -D_MT -DWIN32 -D_WIN32_WINNT=0x0400 -D_WINSOCKAPI_ -DWINVER=0x0400   /IC:\continuum-1.0.2\apps\continuum\working-directory\6\classlib\deploy\include /IC:\continuum-1.0.2\apps\continuum\working-directory\6\classlib\deploy\jdk\include /I. -Fowinmain.obj winmain.c
     [exec]      [exec] winmain.c
     [exec]      [exec] 	rc -I..\include javaw.rc
     [exec]      [exec] 	link /NOLOGO  /INCREMENTAL:NO /NOLOGO -subsystem:windows,4.0 -subsystem:windows /debug /opt:icf /opt:ref   -out:..\javaw.exe -machine:i386 setargv.obj   ..\..\shared\launcher\launcher_copyright.obj ..\..\shared\launcher\main.obj  winmain.obj ..\..\shared\launcher\strbuf.obj ..\..\shared\launcher\libhlp.obj javaw.res C:\continuum-1.0.2\apps\continuum\working-directory\6\classlib\deploy\lib\hyprt.lib C:\continuum-1.0.2\apps\continuum\working-directory\6\classlib\deploy\lib\hythr.lib kernel32.lib  wsock32.lib advapi32.lib user32.lib gdi32.lib comdlg32.lib winspool.lib
     [exec]      [exec] 	cd ..
     [exec]      [exec] 	cd text
     [exec]      [exec] 	nmake /NOLOGO
     [exec]      [exec] 	lib /NOLOGO -subsystem:windows -out:C:\continuum-1.0.2\apps\continuum\working-directory\6\classlib\deploy\lib\hytext.lib   -def:hytext.def -machine:i386  text_copyright.obj ..\..\shared\text\BidiWrapper.obj hytext.res C:\continuum-1.0.2\apps\continuum\working-directory\6\classlib\deploy\lib\hysig.lib C:\continuum-1.0.2\apps\continuum\working-directory\6\classlib\deploy\lib\hycommon.lib C:\continuum-1.0.2\apps\continuum\working-directory\6\classlib\deploy\lib\hypool.lib C:\continuum-1.0.2\apps\continuum\working-directory\6\classlib\deploy\lib\hyfdlibm.lib  C:\continuum-1.0.2\apps\continuum\working-directory\6\classlib\deploy\lib\hythr.lib C:\continuum-1.0.2\apps\continuum\working-directory\6\classlib\deploy\lib\vmi.lib unicode\icuuc.lib
     [exec]      [exec]    Creating library C:\continuum-1.0.2\apps\continuum\working-directory\6\classlib\deploy\lib\hytext.lib and object C:\continuum-1.0.2\apps\continuum\working-directory\6\classlib\deploy\lib\hytext.exp
     [exec]      [exec] 	link  /debug /opt:icf /opt:ref /INCREMENTAL:NO /NOLOGO  -entry:_DllMainCRTStartup@12 -dll /BASE:0x13300000 -machine:i386  /comment:"Text component native code. (c) Copyright 1993, 2005 The Apache Software Foundation or its licensors, as applicable."  -subsystem:windows -out:..\hytext.dll -map:..\hytext.map  text_copyright.obj ..\..\shared\text\BidiWrapper.obj hytext.res C:\continuum-1.0.2\apps\continuum\working-directory\6\classlib\deploy\lib\hysig.lib C:\continuum-1.0.2\apps\continuum\working-directory\6\classlib\deploy\lib\hycommon.lib C:\continuum-1.0.2\apps\continuum\working-directory\6\classlib\deploy\lib\hypool.lib C:\continuum-1.0.2\apps\continuum\working-directory\6\classlib\deploy\lib\hyfdlibm.lib  C:\continuum-1.0.2\apps\continuum\working-directory\6\classlib\deploy\lib\hythr.lib C:\continuum-1.0.2\apps\continuum\working-directory\6\classlib\deploy\lib\vmi.lib unicode\icuuc.lib ws2_32.lib Iphlpapi.lib  kernel32.lib  ws2_32.lib advapi32.lib user32.lib gdi32.lib  comdlg32.lib winspool.lib  C:\continuum-1.0.2\apps\continuum\working-directory\6\classlib\deploy\lib\hytext.exp
     [exec]      [exec] 	cd ..
     [exec]      [exec] 	cd vmls
     [exec]      [exec] 	nmake /NOLOGO
     [exec]      [exec] 	lib /NOLOGO -subsystem:windows -out:C:\continuum-1.0.2\apps\continuum\working-directory\6\classlib\deploy\lib\hyvmls.lib   -machine:i386  ..\..\shared\vmls\vmls.obj  
     [exec]      [exec] 	cd ..

     [exec] build.native:

     [exec]      [exec] Microsoft (R) Program Maintenance Utility Version 7.10.3077
     [exec]      [exec] Copyright (C) Microsoft Corporation.  All rights reserved.

     [exec]      [exec] 	lib /NOLOGO -subsystem:windows -out:C:\continuum-1.0.2\apps\continuum\working-directory\6\classlib\deploy\lib\hyprefs.lib   -def:hyprefs.def -machine:i386  prefs_copyright.obj PreferencesImpl.obj hyprefs.res C:\continuum-1.0.2\apps\continuum\working-directory\6\classlib\deploy\lib\hycommon.lib C:\continuum-1.0.2\apps\continuum\working-directory\6\classlib\deploy\lib\hysig.lib C:\continuum-1.0.2\apps\continuum\working-directory\6\classlib\deploy\lib\hyzip.lib  C:\continuum-1.0.2\apps\continuum\working-directory\6\classlib\deploy\lib\hyzlib.lib C:\continuum-1.0.2\apps\continuum\working-directory\6\classlib\deploy\lib\hypool.lib C:\continuum-1.0.2\apps\continuum\working-directory\6\classlib\deploy\lib\hyfdlibm.lib  C:\continuum-1.0.2\apps\continuum\working-directory\6\classlib\deploy\lib\hythr.lib C:\continuum-1.0.2\apps\continuum\working-directory\6\classlib\deploy\lib\vmi.lib
     [exec]      [exec]    Creating library C:\continuum-1.0.2\apps\continuum\working-directory\6\classlib\deploy\lib\hyprefs.lib and object C:\continuum-1.0.2\apps\continuum\working-directory\6\classlib\deploy\lib\hyprefs.exp
     [exec]      [exec] 	link  /debug /opt:icf /opt:ref /INCREMENTAL:NO /NOLOGO  -entry:_DllMainCRTStartup@12 -dll /BASE:0x13300000 -machine:i386  /comment:"Preferences component native code. (c) Copyright 1993, 2005 The Apache Software Foundation or its licensors, as applicable."  -subsystem:windows -out:..\hyprefs.dll -map:..\hyprefs.map  prefs_copyright.obj PreferencesImpl.obj hyprefs.res C:\continuum-1.0.2\apps\continuum\working-directory\6\classlib\deploy\lib\hycommon.lib C:\continuum-1.0.2\apps\continuum\working-directory\6\classlib\deploy\lib\hysig.lib C:\continuum-1.0.2\apps\continuum\working-directory\6\classlib\deploy\lib\hyzip.lib  C:\continuum-1.0.2\apps\continuum\working-directory\6\classlib\deploy\lib\hyzlib.lib C:\continuum-1.0.2\apps\continuum\working-directory\6\classlib\deploy\lib\hypool.lib C:\continuum-1.0.2\apps\continuum\working-directory\6\classlib\deploy\lib\hyfdlibm.lib  C:\continuum-1.0.2\apps\continuum\working-directory\6\classlib\deploy\lib\hythr.lib C:\continuum-1.0.2\apps\continuum\working-directory\6\classlib\deploy\lib\vmi.lib ws2_32.lib Iphlpapi.lib  kernel32.lib  ws2_32.lib advapi32.lib user32.lib gdi32.lib  comdlg32.lib winspool.lib  C:\continuum-1.0.2\apps\continuum\working-directory\6\classlib\deploy\lib\hyprefs.exp
     [exec]      [copy] Copying 1 file to C:\continuum-1.0.2\apps\continuum\working-directory\6\classlib\deploy\jdk\jre\bin

     [exec] layout:
     [exec]      [copy] Copying 9 files to C:\continuum-1.0.2\apps\continuum\working-directory\6\classlib\deploy\jdk\jre\bin
     [exec]      [copy] Copying 2 files to C:\continuum-1.0.2\apps\continuum\working-directory\6\classlib\deploy\jdk\jre\bin
     [exec]      [copy] Copying 18 files to C:\continuum-1.0.2\apps\continuum\working-directory\6\classlib\deploy\jdk\jre\bin
     [exec]      [copy] Copying 5 files to C:\continuum-1.0.2\apps\continuum\working-directory\6\classlib\deploy\jdk\jre\bin

     [exec] build:

     [exec] build-awt-swing:

     [exec] default:

     [exec] svn-prop:

     [exec] properties:

     [exec] snapshot-tar:

     [exec] snapshot-zip:
     [exec]      [echo] 
     [exec]      [echo] ========================================
     [exec]      [echo] Generating snapshot zip
     [exec]      [echo] ========================================
     [exec]       [zip] Building zip: C:\continuum-1.0.2\apps\continuum\working-directory\6\classlib\incubator-harmony-classlib-r417146-windows-x86-snapshot.zip

     [exec] snapshot:

     [exec] BUILD SUCCESSFUL
     [exec] Total time: 1 minute 30 seconds

copy-depends:
     [echo] Copying VME to C:\continuum-1.0.2\apps\continuum\working-directory\6/classlib/deploy/jdk/jre
     [copy] Copying 44 files to C:\continuum-1.0.2\apps\continuum\working-directory\6\classlib\deploy\jdk\jre\bin\default

run-tests:
     [exec] Buildfile: build.xml

     [exec] test:
     [exec]      [echo] 
     [exec]      [echo] ========================================
     [exec]      [echo] Testing class libraries...
     [exec]      [echo] ========================================

     [exec] clean:

     [exec] copy-test-resources:
     [exec]     [mkdir] Created dir: C:\continuum-1.0.2\apps\continuum\working-directory\6\classlib\build\tests
     [exec]      [copy] Copying 64 files to C:\continuum-1.0.2\apps\continuum\working-directory\6\classlib\build\tests

     [exec] check-support-jars:

     [exec] check:
     [exec]      [echo] Checking for depends/jars/xalan-j_2.7.0/xalan.jar
     [exec]      [echo] Checking for depends/jars/xerces_2.8.0/resolver.jar
     [exec]      [echo] Checking for depends/jars/xerces_2.8.0/xercesImpl.jar
     [exec]      [echo] Checking for depends/jars/xerces_2.8.0/xml-apis.jar
     [exec]      [echo] Checking for depends/jars/junit_3.8.2/junit.jar
     [exec]      [echo] Checking for depends/jars/bcprov-jdk14-133/signed.bcprov.jar
     [exec]      [echo] Checking for depends/jars/icu4j_3.4.4/icu4j_3_4_4.jar
     [exec]      [echo] Checking for depends/jars/mx4j_3.0.1/mx4j.jar
     [exec]      [echo] Checking for depends/jars/mx4j_3.0.1/mx4j-remote.jar
     [exec]      [echo] Checking for depends/jars/ecj_3.2MAINT/ecj_3.2MAINT.jar

     [exec] create-unsigned-bcprov-jar:

     [exec] check-win:
     [exec]      [echo] Checking for depends/libs/win.IA32/msvcr71.dll

     [exec] compile-support:
     [exec]     [javac] Compiling 53 source files to C:\continuum-1.0.2\apps\continuum\working-directory\6\classlib\build\tests
     [exec]     [javac] Note: C:\continuum-1.0.2\apps\continuum\working-directory\6\classlib\support\src\test\java\tests\support\Support_PortManager.java uses or overrides a deprecated API.
     [exec]     [javac] Note: Recompile with -Xlint:deprecation for details.
     [exec]     [javac] Note: Some input files use unchecked or unsafe operations.
     [exec]     [javac] Note: Recompile with -Xlint:unchecked for details.

     [exec] test-modules:

     [exec] call-modules-all:

     [exec] compile.java:
     [exec]      [echo] Compiling ACCESSIBILITY classes

     [exec] build.jar:

     [exec] build:

     [exec] compile.tests:
     [exec]      [echo] Compiling ACCESSIBILITY tests

     [exec] run.tests:
     [exec]     [mkdir] Created dir: C:\continuum-1.0.2\apps\continuum\working-directory\6\classlib\build\test_report

     [exec] touch-failures-file:

     [exec] touch-errors-file:

     [exec] test:

     [exec] compile.java:
     [exec]      [echo] Compiling ANNOTATION classes

     [exec] build.jar:

     [exec] build:

     [exec] compile.tests:
     [exec]      [echo] Compiling ANNOTATION tests

     [exec] run.tests:

     [exec] touch-failures-file:

     [exec] touch-errors-file:

     [exec] test:

     [exec] compile.java:
     [exec]      [echo] Compiling APPLET classes

     [exec] build.jar:

     [exec] build:

     [exec] compile.tests:
     [exec]      [echo] Compiling APPLET tests
     [exec]     [javac] Compiling 1 source file to C:\continuum-1.0.2\apps\continuum\working-directory\6\classlib\modules\applet\bin\test

     [exec] run.tests:
     [exec]     [junit] Running org.apache.harmony.tests.applet.AllTests
     [exec]     [junit] (c) Copyright 1991, 2006 The Apache Software Foundation or its licensors, as applicable.
     [exec]     [junit] java version 1.5 (subset)

     [exec]     [junit] Tests run: 0, Failures: 0, Errors: 0, Time elapsed: 0.078 sec

     [exec] touch-failures-file:

     [exec] touch-errors-file:

     [exec] test:

     [exec] compile.java:
     [exec]      [echo] Compiling ARCHIVE classes

     [exec] build.jar:

     [exec] build:

     [exec] compile.tests:
     [exec]      [echo] Compiling ARCHIVE tests
     [exec]     [javac] Compiling 29 source files to C:\continuum-1.0.2\apps\continuum\working-directory\6\classlib\modules\archive\bin\test
     [exec]     [javac] Note: Some input files use unchecked or unsafe operations.
     [exec]     [javac] Note: Recompile with -Xlint:unchecked for details.

     [exec] run.tests:
     [exec]     [junit] Running org.apache.harmony.archive.tests.java.util.zip.ZipOutputStreamTest
     [exec]     [junit] java version 1.5 (subset)

     [exec]     [junit] (c) Copyright 1991, 2006 The Apache Software Foundation or its licensors, as applicable.
     [exec]     [junit] Tests run: 6, Failures: 0, Errors: 0, Time elapsed: 0.14 sec
     [exec]     [junit] Tests run: 1, Failures: 0, Errors: 0, Time elapsed: 0.031 sec
     [exec]     [junit] Not yet implemented
     [exec]     [junit] Not yet implemented
     [exec]     [junit] Not yet implemented
     [exec]     [junit] Tests run: 1, Failures: 0, Errors: 0, Time elapsed: 0.031 sec
     [exec]     [junit] Tests run: 1, Failures: 0, Errors: 0, Time elapsed: 0.015 sec
     [exec]     [junit] Tests run: 17, Failures: 0, Errors: 0, Time elapsed: 0.016 sec
     [exec]     [junit] Tests run: 4, Failures: 0, Errors: 0, Time elapsed: 0.516 sec
     [exec]     [junit] Tests run: 1, Failures: 0, Errors: 0, Time elapsed: 0 sec
     [exec]     [junit] Tests run: 15, Failures: 0, Errors: 0, Time elapsed: 1.031 sec
     [exec]     [junit] Tests run: 12, Failures: 0, Errors: 0, Time elapsed: 0.562 sec
     [exec]     [junit] Tests run: 7, Failures: 0, Errors: 0, Time elapsed: 0.093 sec
     [exec]     [junit] Tests run: 6, Failures: 0, Errors: 0, Time elapsed: 0.016 sec
     [exec]     [junit] Tests run: 6, Failures: 0, Errors: 0, Time elapsed: 0.016 sec
     [exec]     [junit] Tests run: 3, Failures: 0, Errors: 0, Time elapsed: 0.016 sec
     [exec]     [junit] Tests run: 4, Failures: 0, Errors: 0, Time elapsed: 0.031 sec
     [exec]     [junit] Tests run: 7, Failures: 0, Errors: 0, Time elapsed: 0.031 sec
     [exec]     [junit] Tests run: 23, Failures: 0, Errors: 0, Time elapsed: 0.079 sec
     [exec]     [junit] Tests run: 5, Failures: 0, Errors: 0, Time elapsed: 0.015 sec
     [exec]     [junit] Tests run: 12, Failures: 0, Errors: 0, Time elapsed: 0.016 sec
     [exec]     [junit] Tests run: 18, Failures: 0, Errors: 0, Time elapsed: 0.031 sec
     [exec]     [junit] Tests run: 20, Failures: 0, Errors: 0, Time elapsed: 0.203 sec
     [exec]     [junit] Tests run: 9, Failures: 0, Errors: 0, Time elapsed: 0.062 sec
     [exec]     [junit] Tests run: 6, Failures: 0, Errors: 0, Time elapsed: 0.016 sec
     [exec]     [junit] Tests run: 9, Failures: 0, Errors: 0, Time elapsed: 0.016 sec

     [exec] touch-failures-file:

     [exec] touch-errors-file:

     [exec] test:

     [exec] compile.java:
     [exec]      [echo] Compiling AUTH classes

     [exec] build.jar:

     [exec] build:

     [exec] compile.tests:
     [exec]      [echo] Compiling AUTH tests
     [exec]     [javac] Compiling 86 source files to C:\continuum-1.0.2\apps\continuum\working-directory\6\classlib\modules\auth\bin\test
     [exec]     [javac] Note: C:\continuum-1.0.2\apps\continuum\working-directory\6\classlib\modules\auth\src\test\java\common\javax\security\auth\PolicyTest.java uses or overrides a deprecated API.
     [exec]     [javac] Note: Recompile with -Xlint:deprecation for details.
     [exec]     [javac] Note: Some input files use unchecked or unsafe operations.
     [exec]     [javac] Note: Recompile with -Xlint:unchecked for details.

     [exec] run.tests:
     [exec]     [junit] Running tests.api.javax.security.auth.x500.X500PrincipalTest
     [exec]     [junit] Tests run: 5, Failures: 0, Errors: 0, Time elapsed: 0.265 sec
     [exec]     [junit] Tests run: 5, Failures: 0, Errors: 0, Time elapsed: 0.016 sec
     [exec]     [junit] Tests run: 3, Failures: 0, Errors: 0, Time elapsed: 0.032 sec
     [exec]     [junit] Tests run: 5, Failures: 0, Errors: 0, Time elapsed: 0.109 sec
     [exec]     [junit] Tests run: 54, Failures: 0, Errors: 0, Time elapsed: 0.047 sec
     [exec]     [junit] Tests run: 3, Failures: 0, Errors: 0, Time elapsed: 0 sec
     [exec]     [junit] Tests run: 3, Failures: 0, Errors: 0, Time elapsed: 0 sec
     [exec]     [junit] Tests run: 659, Failures: 0, Errors: 0, Time elapsed: 0.219 sec
     [exec]     [junit] Tests run: 5, Failures: 0, Errors: 0, Time elapsed: 0.016 sec
     [exec]     [junit] Tests run: 11, Failures: 0, Errors: 0, Time elapsed: 0 sec
     [exec]     [junit] Tests run: 2, Failures: 0, Errors: 0, Time elapsed: 0 sec
     [exec]     [junit] Tests run: 2, Failures: 0, Errors: 0, Time elapsed: 0.015 sec
     [exec]     [junit] Tests run: 3, Failures: 0, Errors: 0, Time elapsed: 0 sec
     [exec]     [junit] Tests run: 2, Failures: 0, Errors: 0, Time elapsed: 0 sec
     [exec]     [junit] Tests run: 4, Failures: 0, Errors: 0, Time elapsed: 0 sec
     [exec]     [junit] Tests run: 3, Failures: 0, Errors: 0, Time elapsed: 0 sec
     [exec]     [junit] Tests run: 2, Failures: 0, Errors: 0, Time elapsed: 0.016 sec
     [exec]     [junit] Tests run: 2, Failures: 0, Errors: 0, Time elapsed: 0 sec
     [exec]     [junit] Tests run: 2, Failures: 0, Errors: 0, Time elapsed: 0.016 sec
     [exec]     [junit] Tests run: 2, Failures: 0, Errors: 0, Time elapsed: 0.015 sec
     [exec]     [junit] Tests run: 2, Failures: 0, Errors: 0, Time elapsed: 0 sec
     [exec]     [junit] Tests run: 2, Failures: 0, Errors: 0, Time elapsed: 0.016 sec
     [exec]     [junit] Tests run: 2, Failures: 0, Errors: 0, Time elapsed: 0 sec
     [exec]     [junit] Tests run: 2, Failures: 0, Errors: 0, Time elapsed: 0.016 sec
     [exec]     [junit] Tests run: 8, Failures: 0, Errors: 0, Time elapsed: 0 sec
     [exec]     [junit] Tests run: 4, Failures: 0, Errors: 0, Time elapsed: 0.031 sec
     [exec]     [junit] Tests run: 4, Failures: 0, Errors: 0, Time elapsed: 0 sec
     [exec]     [junit] Tests run: 8, Failures: 0, Errors: 0, Time elapsed: 0 sec
     [exec]     [junit] Tests run: 2, Failures: 0, Errors: 0, Time elapsed: 0.016 sec
     [exec]     [junit] Tests run: 2, Failures: 0, Errors: 0, Time elapsed: 0.015 sec
     [exec]     [junit] Tests run: 2, Failures: 0, Errors: 0, Time elapsed: 0.016 sec
     [exec]     [junit] Tests run: 2, Failures: 0, Errors: 0, Time elapsed: 0 sec
     [exec]     [junit] Tests run: 3, Failures: 0, Errors: 0, Time elapsed: 0 sec
     [exec]     [junit] Tests run: 3, Failures: 0, Errors: 0, Time elapsed: 0 sec
     [exec]     [junit] Tests run: 3, Failures: 0, Errors: 0, Time elapsed: 0 sec
     [exec]     [junit] Tests run: 3, Failures: 0, Errors: 0, Time elapsed: 0 sec
     [exec]     [junit] Tests run: 5, Failures: 0, Errors: 0, Time elapsed: 0 sec
     [exec]     [junit] Tests run: 3, Failures: 0, Errors: 0, Time elapsed: 0.016 sec
     [exec]     [junit] Tests run: 3, Failures: 0, Errors: 0, Time elapsed: 0.015 sec
     [exec]     [junit] Tests run: 3, Failures: 0, Errors: 0, Time elapsed: 0 sec
     [exec]     [junit] Tests run: 3, Failures: 0, Errors: 0, Time elapsed: 0 sec
     [exec]     [junit] Tests run: 3, Failures: 0, Errors: 0, Time elapsed: 0 sec
     [exec]     [junit] Tests run: 29, Failures: 0, Errors: 0, Time elapsed: 0 sec
     [exec]     [junit] Tests run: 3, Failures: 0, Errors: 0, Time elapsed: 0 sec
     [exec]     [junit] Tests run: 2, Failures: 0, Errors: 0, Time elapsed: 0.015 sec
     [exec]     [junit] Tests run: 2, Failures: 0, Errors: 0, Time elapsed: 0.016 sec
     [exec]     [junit] Tests run: 2, Failures: 0, Errors: 0, Time elapsed: 0.016 sec
     [exec]     [junit] Tests run: 2, Failures: 0, Errors: 0, Time elapsed: 0.016 sec
     [exec]     [junit] Tests run: 2, Failures: 0, Errors: 0, Time elapsed: 0 sec
     [exec]     [junit] Tests run: 2, Failures: 0, Errors: 0, Time elapsed: 0.016 sec
     [exec]     [junit] Tests run: 2, Failures: 0, Errors: 0, Time elapsed: 0.016 sec
     [exec]     [junit] Tests run: 2, Failures: 0, Errors: 0, Time elapsed: 0 sec
     [exec]     [junit] Tests run: 2, Failures: 0, Errors: 0, Time elapsed: 0.016 sec
     [exec]     [junit] Tests run: 2, Failures: 0, Errors: 0, Time elapsed: 0 sec
     [exec]     [junit] Tests run: 2, Failures: 0, Errors: 0, Time elapsed: 0.016 sec
     [exec]     [junit] Tests run: 2, Failures: 0, Errors: 0, Time elapsed: 0 sec
     [exec]     [junit] Tests run: 2, Failures: 0, Errors: 0, Time elapsed: 0.016 sec
     [exec]     [junit] Tests run: 2, Failures: 0, Errors: 0, Time elapsed: 0.015 sec
     [exec]     [junit] Tests run: 131, Failures: 0, Errors: 0, Time elapsed: 0.109 sec
     [exec]     [junit] Tests run: 8, Failures: 0, Errors: 0, Time elapsed: 0.031 sec
     [exec]     [junit] Tests run: 2, Failures: 0, Errors: 0, Time elapsed: 0.016 sec
     [exec]     [junit] Tests run: 8, Failures: 0, Errors: 0, Time elapsed: 0 sec
     [exec]     [junit] Tests run: 2, Failures: 0, Errors: 0, Time elapsed: 0 sec
     [exec]     [junit] Tests run: 4, Failures: 0, Errors: 0, Time elapsed: 0 sec
     [exec]     [junit] Tests run: 3, Failures: 0, Errors: 0, Time elapsed: 0 sec
     [exec]     [junit] Tests run: 2, Failures: 0, Errors: 0, Time elapsed: 0 sec
     [exec]     [junit] Tests run: 8, Failures: 0, Errors: 0, Time elapsed: 0.032 sec
     [exec]     [junit] Tests run: 5, Failures: 0, Errors: 0, Time elapsed: 0.016 sec
     [exec]     [junit] Tests run: 5, Failures: 0, Errors: 0, Time elapsed: 0 sec
     [exec]     [junit] Tests run: 11, Failures: 0, Errors: 0, Time elapsed: 0.016 sec
     [exec]     [junit] Tests run: 2, Failures: 0, Errors: 0, Time elapsed: 0.062 sec
     [exec]     [junit] Tests run: 2, Failures: 0, Errors: 0, Time elapsed: 0.016 sec
     [exec]     [junit] Tests run: 2, Failures: 0, Errors: 0, Time elapsed: 0.016 sec
     [exec]     [junit] Tests run: 2, Failures: 0, Errors: 0, Time elapsed: 0.016 sec
     [exec]     [junit] Tests run: 2, Failures: 0, Errors: 0, Time elapsed: 0.047 sec
     [exec]     [junit] Tests run: 4, Failures: 0, Errors: 0, Time elapsed: 0.109 sec
     [exec]     [junit] Tests run: 3, Failures: 0, Errors: 0, Time elapsed: 0.047 sec
     [exec]     [junit] Tests run: 30, Failures: 0, Errors: 0, Time elapsed: 0.015 sec
     [exec]     [junit] Tests run: 23, Failures: 0, Errors: 0, Time elapsed: 0 sec
     [exec]     [junit] Tests run: 2, Failures: 0, Errors: 0, Time elapsed: 0 sec
     [exec]     [junit] Tests run: 6, Failures: 0, Errors: 0, Time elapsed: 0 sec
     [exec]     [junit] Tests run: 20, Failures: 0, Errors: 0, Time elapsed: 0 sec
     [exec]     [junit] Tests run: 11, Failures: 0, Errors: 0, Time elapsed: 0 sec
     [exec]     [junit] Tests run: 2, Failures: 0, Errors: 0, Time elapsed: 0 sec

     [exec] touch-failures-file:

     [exec] touch-errors-file:

     [exec] test:

     [exec] compile.java:
     [exec]      [echo] Compiling AWT classes

     [exec] build.jar:

     [exec] build:

     [exec] compile.tests:
     [exec]      [echo] Compiling AWT tests
     [exec]     [javac] Compiling 2 source files to C:\continuum-1.0.2\apps\continuum\working-directory\6\classlib\modules\awt\bin\test

     [exec] run.tests:
     [exec]     [junit] Running org.apache.harmony.tests.java.awt.AllTests
     [exec]     [junit] java version 1.5 (subset)

     [exec]     [junit] (c) Copyright 1991, 2006 The Apache Software Foundation or its licensors, as applicable.
     [exec]     [junit] Tests run: 1, Failures: 0, Errors: 0, Time elapsed: 0.141 sec
     [exec]     [junit] Tests run: 1, Failures: 0, Errors: 0, Time elapsed: 0.015 sec

     [exec] touch-failures-file:

     [exec] touch-errors-file:

     [exec] test:

     [exec] compile.java:
     [exec]      [echo] Compiling BEANS classes

     [exec] build.jar:

     [exec] build:

     [exec] copy.test.resources:
     [exec]      [copy] Copying 37 files to C:\continuum-1.0.2\apps\continuum\working-directory\6\classlib\modules\beans\bin\test

     [exec] compile.tests:
     [exec]      [echo] Compiling internal BEANS tests
     [exec]      [echo] Compiling BEANS tests
     [exec]     [javac] Compiling 156 source files to C:\continuum-1.0.2\apps\continuum\working-directory\6\classlib\modules\beans\bin\test
     [exec]     [javac] Note: Some input files use unchecked or unsafe operations.
     [exec]     [javac] Note: Recompile with -Xlint:unchecked for details.

     [exec] run.tests:
     [exec]      [echo] Running internal BEANS tests
     [exec]     [junit] Running org.apache.harmony.beans.StringPersistenceDelegateTest
     [exec]     [junit] java version 1.5 (subset)
     [exec]     [junit] (c) Copyright 1991, 2006 The Apache Software Foundation or its licensors, as applicable.

     [exec]     [junit] Tests run: 17, Failures: 0, Errors: 0, Time elapsed: 0.172 sec
     [exec]     [junit] Tests run: 32, Failures: 0, Errors: 0, Time elapsed: 0.031 sec
     [exec]     [junit] Tests run: 3, Failures: 0, Errors: 0, Time elapsed: 0.031 sec
     [exec]     [junit] Tests run: 5, Failures: 0, Errors: 0, Time elapsed: 0.032 sec
     [exec]     [junit] Tests run: 3, Failures: 0, Errors: 0, Time elapsed: 0.016 sec
     [exec]      [echo] Running BEANS tests
     [exec]     [junit] Running org.apache.harmony.beans.tests.java.beans.beancontext.InterfacesTest
     [exec]     [junit] java version 1.5 (subset)

     [exec]     [junit] (c) Copyright 1991, 2006 The Apache Software Foundation or its licensors, as applicable.
     [exec]     [junit] Tests run: 1, Failures: 0, Errors: 0, Time elapsed: 0.157 sec
     [exec]     [junit] Tests run: 8, Failures: 0, Errors: 0, Time elapsed: 0.032 sec
     [exec]     [junit] Tests run: 1, Failures: 0, Errors: 0, Time elapsed: 0.031 sec
     [exec]     [junit] Tests run: 1, Failures: 0, Errors: 0, Time elapsed: 0.015 sec
     [exec]     [junit] Tests run: 1, Failures: 0, Errors: 0, Time elapsed: 0 sec
     [exec]     [junit] Tests run: 1, Failures: 0, Errors: 0, Time elapsed: 0 sec
     [exec]     [junit] Tests run: 17, Failures: 0, Errors: 0, Time elapsed: 0.016 sec
     [exec]     [junit] Tests run: 5, Failures: 0, Errors: 0, Time elapsed: 0.11 sec
     [exec]     [junit] Tests run: 7, Failures: 0, Errors: 0, Time elapsed: 0 sec
     [exec]     [junit] Tests run: 1, Failures: 0, Errors: 0, Time elapsed: 0.015 sec
     [exec]     [junit] Tests run: 8, Failures: 0, Errors: 0, Time elapsed: 0.015 sec
     [exec]     [junit] Tests run: 3, Failures: 0, Errors: 0, Time elapsed: 0 sec
     [exec]     [junit] Tests run: 1, Failures: 0, Errors: 0, Time elapsed: 0.016 sec
     [exec]     [junit] Tests run: 1, Failures: 0, Errors: 0, Time elapsed: 0.015 sec
     [exec]     [junit] Tests run: 6, Failures: 0, Errors: 0, Time elapsed: 0.015 sec
     [exec]     [junit] Tests run: 8, Failures: 0, Errors: 0, Time elapsed: 0 sec
     [exec]     [junit] Tests run: 1, Failures: 0, Errors: 0, Time elapsed: 0.016 sec
     [exec]     [junit] Tests run: 1, Failures: 0, Errors: 0, Time elapsed: 0 sec
     [exec]     [junit] Tests run: 6, Failures: 0, Errors: 0, Time elapsed: 0 sec
     [exec]     [junit] Tests run: 11, Failures: 0, Errors: 0, Time elapsed: 0.031 sec

     [exec] touch-failures-file:

     [exec] touch-errors-file:

     [exec] test:

     [exec] compile.java:
     [exec]      [echo] Compiling CRYPTO classes

     [exec] build.jar:

     [exec] build:

     [exec] compile.tests:
     [exec]      [echo] Compiling CRYPTO test support files
     [exec]     [javac] Compiling 47 source files to C:\continuum-1.0.2\apps\continuum\working-directory\6\classlib\build\tests
     [exec]     [javac] Note: Some input files use or override a deprecated API.
     [exec]     [javac] Note: Recompile with -Xlint:deprecation for details.
     [exec]     [javac] Note: Some input files use unchecked or unsafe operations.
     [exec]     [javac] Note: Recompile with -Xlint:unchecked for details.
     [exec]      [echo] Compiling CRYPTO api tests
     [exec]     [javac] Compiling 35 source files to C:\continuum-1.0.2\apps\continuum\working-directory\6\classlib\modules\crypto\bin\test\api
     [exec]      [echo] Compiling CRYPTO api injected tests
     [exec]     [javac] Compiling 10 source files to C:\continuum-1.0.2\apps\continuum\working-directory\6\classlib\modules\crypto\bin\test\api.injected
     [exec]      [echo] Compiling CRYPTO impl injected tests
     [exec]     [javac] Compiling 1 source file to C:\continuum-1.0.2\apps\continuum\working-directory\6\classlib\modules\crypto\bin\test\impl.injected
     [exec]      [echo] Compiling CRYPTO impl tests
     [exec]     [javac] Compiling 10 source files to C:\continuum-1.0.2\apps\continuum\working-directory\6\classlib\modules\crypto\bin\test\impl

     [exec] run.tests.api:
     [exec]      [echo] Running CRYPTO api tests
     [exec]     [junit] Running org.apache.harmony.crypto.tests.javax.crypto.spec.SecretKeySpecTest
     [exec]     [junit] java version 1.5 (subset)
     [exec]     [junit] (c) Copyright 1991, 2006 The Apache Software Foundation or its licensors, as applicable.

     [exec]     [junit] Tests run: 3, Failures: 0, Errors: 0, Time elapsed: 0.141 sec
     [exec]     [junit] Tests run: 18, Failures: 0, Errors: 0, Time elapsed: 0.281 sec
     [exec]     [junit] Tests run: 40, Failures: 0, Errors: 0, Time elapsed: 0.297 sec
     [exec]     [junit] Tests run: 3, Failures: 0, Errors: 0, Time elapsed: 0 sec
     [exec]     [junit] Tests run: 1, Failures: 0, Errors: 0, Time elapsed: 0 sec
     [exec]     [junit] Tests run: 3, Failures: 0, Errors: 0, Time elapsed: 0 sec
     [exec]     [junit] Tests run: 14, Failures: 0, Errors: 0, Time elapsed: 0.313 sec
     [exec]     [junit] Tests run: 12, Failures: 0, Errors: 0, Time elapsed: 0.032 sec
     [exec]     [junit] Tests run: 22, Failures: 0, Errors: 0, Time elapsed: 0.016 sec
     [exec]     [junit] Tests run: 3, Failures: 0, Errors: 0, Time elapsed: 0 sec
     [exec]     [junit] Tests run: 19, Failures: 0, Errors: 0, Time elapsed: 0.015 sec
     [exec]     [junit] Tests run: 10, Failures: 0, Errors: 0, Time elapsed: 0 sec
     [exec]     [junit] Tests run: 1, Failures: 0, Errors: 0, Time elapsed: 0.016 sec
     [exec]     [junit] Tests run: 3, Failures: 0, Errors: 0, Time elapsed: 0 sec
     [exec]     [junit] Tests run: 1, Failures: 0, Errors: 0, Time elapsed: 0.016 sec
     [exec]     [junit] Tests run: 1, Failures: 0, Errors: 0, Time elapsed: 0 sec
     [exec]     [junit] Tests run: 1, Failures: 0, Errors: 0, Time elapsed: 0 sec
     [exec]     [junit] Tests run: 2, Failures: 0, Errors: 0, Time elapsed: 0.109 sec
     [exec]     [junit] Tests run: 2, Failures: 0, Errors: 0, Time elapsed: 0.125 sec
     [exec]     [junit] Tests run: 2, Failures: 0, Errors: 0, Time elapsed: 0.047 sec
     [exec]     [junit] Tests run: 2, Failures: 0, Errors: 0, Time elapsed: 0.062 sec
     [exec]     [junit] Tests run: 2, Failures: 0, Errors: 0, Time elapsed: 0.047 sec
     [exec]     [junit] Tests run: 4, Failures: 0, Errors: 0, Time elapsed: 0 sec
     [exec]     [junit] Tests run: 3, Failures: 0, Errors: 0, Time elapsed: 0 sec
     [exec]     [junit] Tests run: 1, Failures: 0, Errors: 0, Time elapsed: 0.015 sec
     [exec]     [junit] Tests run: 1, Failures: 0, Errors: 0, Time elapsed: 0 sec
     [exec]     [junit] Tests run: 1, Failures: 0, Errors: 0, Time elapsed: 0.016 sec
     [exec]     [junit] Tests run: 1, Failures: 0, Errors: 0, Time elapsed: 0 sec
     [exec]     [junit] Tests run: 3, Failures: 0, Errors: 0, Time elapsed: 0.015 sec
     [exec]     [junit] Tests run: 5, Failures: 0, Errors: 0, Time elapsed: 0 sec
     [exec]     [junit] Tests run: 8, Failures: 0, Errors: 0, Time elapsed: 0 sec
     [exec]     [junit] Tests run: 3, Failures: 0, Errors: 0, Time elapsed: 0 sec
     [exec]     [junit] Tests run: 6, Failures: 0, Errors: 0, Time elapsed: 0 sec
     [exec]     [junit] Tests run: 8, Failures: 0, Errors: 0, Time elapsed: 0.016 sec
     [exec]     [junit] Tests run: 7, Failures: 0, Errors: 0, Time elapsed: 0 sec
     [exec]      [echo] Running CRYPTO api.injected tests
     [exec]     [junit] Running javax.crypto.spec.PSourceTest
     [exec]     [junit] java version 1.5 (subset)

     [exec]     [junit] (c) Copyright 1991, 2006 The Apache Software Foundation or its licensors, as applicable.
     [exec]     [junit] Tests run: 8, Failures: 0, Errors: 0, Time elapsed: 0.141 sec
     [exec]     [junit] Tests run: 6, Failures: 0, Errors: 0, Time elapsed: 0.047 sec
     [exec]     [junit] Tests run: 6, Failures: 0, Errors: 0, Time elapsed: 0.047 sec
     [exec]     [junit] Tests run: 1, Failures: 0, Errors: 0, Time elapsed: 0.031 sec
     [exec]     [junit] Tests run: 1, Failures: 0, Errors: 0, Time elapsed: 0.094 sec
     [exec]     [junit] Tests run: 1, Failures: 0, Errors: 0, Time elapsed: 0.015 sec
     [exec]     [junit] Tests run: 1, Failures: 0, Errors: 0, Time elapsed: 0.016 sec
     [exec]     [junit] Tests run: 7, Failures: 0, Errors: 0, Time elapsed: 0.11 sec
     [exec]     [junit] Tests run: 1, Failures: 0, Errors: 0, Time elapsed: 0 sec
     [exec]     [junit] Tests run: 4, Failures: 0, Errors: 0, Time elapsed: 0.015 sec

     [exec] touch-failures-file:

     [exec] touch-errors-file:

     [exec] run.tests.impl:
     [exec]      [echo] Running CRYPTO impl tests
     [exec]     [junit] Running org.apache.harmony.crypto.tests.javax.crypto.SecretKeyFactory_ImplTest
     [exec]     [junit] java version 1.5 (subset)
     [exec]     [junit] (c) Copyright 1991, 2006 The Apache Software Foundation or its licensors, as applicable.

     [exec]     [junit] Tests run: 2, Failures: 0, Errors: 0, Time elapsed: 0.188 sec
     [exec]     [junit] Tests run: 11, Failures: 0, Errors: 0, Time elapsed: 0.094 sec
     [exec]     [junit] Tests run: 3, Failures: 0, Errors: 0, Time elapsed: 0.047 sec
     [exec]     [junit] Tests run: 3, Failures: 0, Errors: 0, Time elapsed: 0.015 sec
     [exec]     [junit] Tests run: 1, Failures: 0, Errors: 0, Time elapsed: 0 sec
     [exec]     [junit] Tests run: 3, Failures: 0, Errors: 0, Time elapsed: 0.015 sec
     [exec]     [junit] Tests run: 3, Failures: 0, Errors: 0, Time elapsed: 0.015 sec
     [exec]     [junit] Tests run: 3, Failures: 0, Errors: 0, Time elapsed: 0.016 sec
     [exec]     [junit] Tests run: 1, Failures: 0, Errors: 0, Time elapsed: 0.016 sec
     [exec]     [junit] Tests run: 3, Failures: 0, Errors: 0, Time elapsed: 0.015 sec
     [exec]      [echo] Running CRYPTO impl injected tests
     [exec]     [junit] Running org.apache.harmony.crypto.internal.NullCipherSpiTest
     [exec]     [junit] java version 1.5 (subset)

     [exec]     [junit] (c) Copyright 1991, 2006 The Apache Software Foundation or its licensors, as applicable.
     [exec]     [junit] Tests run: 12, Failures: 0, Errors: 0, Time elapsed: 0.141 sec

     [exec] touch-failures-file:

     [exec] touch-errors-file:

     [exec] run.tests:

     [exec] test:

     [exec] compile.java:
     [exec]      [echo] Compiling JNDI classes

     [exec] build.jar:

     [exec] build:

     [exec] copy.test.resources:
     [exec]      [copy] Copying 14 files to C:\continuum-1.0.2\apps\continuum\working-directory\6\classlib\modules\jndi\bin\test

     [exec] compile.tests:
     [exec]      [echo] Compiling JNDI tests
     [exec]     [javac] Compiling 107 source files to C:\continuum-1.0.2\apps\continuum\working-directory\6\classlib\modules\jndi\bin\test
     [exec]     [javac] Note: Some input files use unchecked or unsafe operations.
     [exec]     [javac] Note: Recompile with -Xlint:unchecked for details.

     [exec] run.tests:
     [exec]     [junit] Running org.apache.harmony.jndi.tests.javax.naming.spi.ResolveResultTest
     [exec]     [junit] java version 1.5 (subset)

     [exec]     [junit] (c) Copyright 1991, 2006 The Apache Software Foundation or its licensors, as applicable.
     [exec]     [junit] Tests run: 1, Failures: 0, Errors: 0, Time elapsed: 0.11 sec
     [exec]     [junit] Tests run: 2, Failures: 0, Errors: 0, Time elapsed: 0.032 sec
     [exec]     [junit] Tests run: 2, Failures: 0, Errors: 0, Time elapsed: 0.015 sec
     [exec]     [junit] Tests run: 22, Failures: 0, Errors: 0, Time elapsed: 0.157 sec
     [exec]     [junit] Tests run: 8, Failures: 0, Errors: 0, Time elapsed: 0.016 sec
     [exec]     [junit] Tests run: 3, Failures: 0, Errors: 0, Time elapsed: 0.016 sec
     [exec]     [junit] Tests run: 24, Failures: 0, Errors: 0, Time elapsed: 0.031 sec
     [exec]     [junit] Tests run: 76, Failures: 0, Errors: 0, Time elapsed: 0.063 sec
     [exec]     [junit] Tests run: 1, Failures: 0, Errors: 0, Time elapsed: 0.016 sec
     [exec]     [junit] Tests run: 1, Failures: 0, Errors: 0, Time elapsed: 0 sec
     [exec]     [junit] Tests run: 2, Failures: 0, Errors: 0, Time elapsed: 0.031 sec
     [exec]     [junit] Tests run: 1, Failures: 0, Errors: 0, Time elapsed: 0 sec
     [exec]     [junit] Tests run: 66, Failures: 0, Errors: 0, Time elapsed: 0.109 sec
     [exec]     [junit] Tests run: 1, Failures: 0, Errors: 0, Time elapsed: 0 sec
     [exec]     [junit] Tests run: 1, Failures: 0, Errors: 0, Time elapsed: 0 sec
     [exec]     [junit] Tests run: 2, Failures: 0, Errors: 0, Time elapsed: 0.015 sec
     [exec]     [junit] Tests run: 6, Failures: 0, Errors: 0, Time elapsed: 0.016 sec
     [exec]     [junit] Tests run: 2, Failures: 0, Errors: 0, Time elapsed: 0 sec
     [exec]     [junit] Tests run: 16, Failures: 0, Errors: 0, Time elapsed: 0.016 sec
     [exec]     [junit] Tests run: 2, Failures: 0, Errors: 0, Time elapsed: 0.015 sec
     [exec]     [junit] Tests run: 7, Failures: 0, Errors: 0, Time elapsed: 0 sec
     [exec]     [junit] Tests run: 10, Failures: 0, Errors: 0, Time elapsed: 0 sec
     [exec]     [junit] Tests run: 2, Failures: 0, Errors: 0, Time elapsed: 0 sec
     [exec]     [junit] Tests run: 2, Failures: 0, Errors: 0, Time elapsed: 0 sec
     [exec]     [junit] Tests run: 2, Failures: 0, Errors: 0, Time elapsed: 0.015 sec
     [exec]     [junit] Tests run: 44, Failures: 0, Errors: 0, Time elapsed: 0.016 sec
     [exec]     [junit] Tests run: 1, Failures: 0, Errors: 0, Time elapsed: 0.015 sec
     [exec]     [junit] Tests run: 20, Failures: 0, Errors: 0, Time elapsed: 0.016 sec
     [exec]     [junit] Tests run: 2, Failures: 0, Errors: 0, Time elapsed: 0 sec
     [exec]     [junit] Tests run: 8, Failures: 0, Errors: 0, Time elapsed: 0 sec
     [exec]     [junit] Tests run: 100, Failures: 0, Errors: 0, Time elapsed: 0.015 sec
     [exec]     [junit] Tests run: 62, Failures: 0, Errors: 0, Time elapsed: 0.016 sec
     [exec]     [junit] Tests run: 31, Failures: 0, Errors: 0, Time elapsed: 0.032 sec
     [exec]     [junit] Tests run: 6, Failures: 0, Errors: 0, Time elapsed: 0 sec
     [exec]     [junit] Tests run: 7, Failures: 0, Errors: 0, Time elapsed: 0 sec
     [exec]     [junit] Tests run: 7, Failures: 0, Errors: 0, Time elapsed: 0 sec
     [exec]     [junit] Tests run: 15, Failures: 0, Errors: 0, Time elapsed: 0 sec
     [exec]     [junit] Tests run: 3, Failures: 0, Errors: 0, Time elapsed: 0 sec
     [exec]     [junit] Tests run: 10, Failures: 0, Errors: 0, Time elapsed: 0.016 sec
     [exec]     [junit] Tests run: 14, Failures: 0, Errors: 0, Time elapsed: 0.016 sec
     [exec]     [junit] Tests run: 1, Failures: 0, Errors: 0, Time elapsed: 0 sec
     [exec]     [junit] Tests run: 4, Failures: 0, Errors: 0, Time elapsed: 0.016 sec
     [exec]     [junit] Tests run: 3, Failures: 0, Errors: 0, Time elapsed: 0 sec
     [exec]     [junit] Tests run: 1, Failures: 0, Errors: 0, Time elapsed: 0.016 sec
     [exec]     [junit] Tests run: 3, Failures: 0, Errors: 0, Time elapsed: 0.015 sec
     [exec]     [junit] Tests run: 2, Failures: 0, Errors: 0, Time elapsed: 0 sec
     [exec]     [junit] Tests run: 27, Failures: 0, Errors: 0, Time elapsed: 0 sec
     [exec]     [junit] Running org.apache.harmony.jndi.tests.javax.naming.spi.NamingManagerTest
     [exec]     [junit] java version 1.5 (subset)

     [exec]     [junit] (c) Copyright 1991, 2006 The Apache Software Foundation or its licensors, as applicable.
     [exec]     [junit] Tests run: 61, Failures: 0, Errors: 0, Time elapsed: 1.843 sec
     [exec]     [junit] Running org.apache.harmony.jndi.tests.javax.naming.spi.NamingManagerBuilderTest
     [exec]     [junit] java version 1.5 (subset)
     [exec]     [junit] (c) Copyright 1991, 2006 The Apache Software Foundation or its licensors, as applicable.

     [exec]     [junit] Tests run: 2, Failures: 0, Errors: 0, Time elapsed: 0.156 sec
     [exec]     [junit] Running org.apache.harmony.jndi.tests.javax.naming.spi.DirectoryManagerTest
     [exec]     [junit] java version 1.5 (subset)
     [exec]     [junit] (c) Copyright 1991, 2006 The Apache Software Foundation or its licensors, as applicable.

     [exec]     [junit] Tests run: 37, Failures: 0, Errors: 0, Time elapsed: 0.485 sec

     [exec] touch-failures-file:

     [exec] touch-errors-file:

     [exec] test:

     [exec] copy.resources:
     [exec]      [copy] Copying 1 file to C:\continuum-1.0.2\apps\continuum\working-directory\6\classlib\deploy\jdk\jre\lib

     [exec] compile.java:
     [exec]      [echo] Compiling LOGGING classes

     [exec] build.jar:

     [exec] build:

     [exec] copy.test.resources:
     [exec]      [copy] Copying 9 files to C:\continuum-1.0.2\apps\continuum\working-directory\6\classlib\modules\logging\bin\test

     [exec] compile.tests:
     [exec]      [echo] Compiling LOGGING tests
     [exec]     [javac] Compiling 20 source files to C:\continuum-1.0.2\apps\continuum\working-directory\6\classlib\modules\logging\bin\test

     [exec] run.tests:
     [exec]     [junit] Running org.apache.harmony.logging.tests.java.util.logging.XMLFormatterTest
     [exec]     [junit] java version 1.5 (subset)
     [exec]     [junit] (c) Copyright 1991, 2006 The Apache Software Foundation or its licensors, as applicable.

     [exec]     [junit] Tests run: 16, Failures: 0, Errors: 0, Time elapsed: 0.312 sec
     [exec]     [junit] java.util.logging.ErrorManager: the error code is -1.

     [exec]     [junit] java.util.logging.ErrorManager: the error code is 3.
     [exec]     [junit] The error message is: test message, pls ignore it
     [exec]     [junit] java.lang.RuntimeException: test exception, pls ignore it
     [exec]     [junit] Tests run: 3, Failures: 0, Errors: 0, Time elapsed: 0.031 sec
     [exec]     [junit] Tests run: 1, Failures: 0, Errors: 0, Time elapsed: 0.031 sec
     [exec]     [junit] Tests run: 5, Failures: 0, Errors: 0, Time elapsed: 0.015 sec
     [exec]     [junit] java.util.logging.ErrorManager: the error code is 0.
     [exec]     [junit] The error message is: Null pointer of LogRecord
     [exec]     [junit] java.lang.NullPointerException: null
     [exec]     [junit] Tests run: 26, Failures: 0, Errors: 0, Time elapsed: 0.016 sec
     [exec]     [junit] Tests run: 26, Failures: 0, Errors: 0, Time elapsed: 0.047 sec
     [exec]     [junit] Tests run: 17, Failures: 0, Errors: 0, Time elapsed: 0.125 sec
     [exec]     [junit] Tests run: 160, Failures: 0, Errors: 0, Time elapsed: 0.125 sec
     [exec]     [junit] Tests run: 2, Failures: 0, Errors: 0, Time elapsed: 0 sec
     [exec]     [junit] Invalid level name: impossible_level.java.util.logging.ErrorManager: the error code is 0.
     [exec]     [junit] The error message is: Null pointer of LogRecord
     [exec]     [junit] java.lang.NullPointerException: null
     [exec]     [junit] java.util.logging.ErrorManager: the error code is 0.
     [exec]     [junit] The error message is: Invalid property value for java.util.logging.MemoryHandler.formatter:badname
     [exec]     [junit] java.security.PrivilegedActionException: java.lang.ClassNotFoundException: badname
     [exec]     [junit] java.util.logging.ErrorManager: the error code is 0.
     [exec]     [junit] The error message is: Invalid property value for java.util.logging.MemoryHandler.level:badname
     [exec]     [junit] java.lang.IllegalArgumentException: Cannot parse this name: badname
     [exec]     [junit] java.util.logging.ErrorManager: the error code is 0.
     [exec]     [junit] The error message is: Invalid property value for java.util.logging.MemoryHandler.java.util.logging.MemoryHandler.push:badname
     [exec]     [junit] java.lang.IllegalArgumentException: Cannot parse this name: badname
     [exec]     [junit] java.util.logging.ErrorManager: the error code is 0.
     [exec]     [junit] The error message is: Invalid property value for java.util.logging.MemoryHandler.filter:badname
     [exec]     [junit] java.security.PrivilegedActionException: java.lang.ClassNotFoundException: badname
     [exec]     [junit] java.util.logging.ErrorManager: the error code is 0.
     [exec]     [junit] The error message is: Invalid property value for java.util.logging.MemoryHandler.java.util.logging.MemoryHandler.size:badsize
     [exec]     [junit] java.lang.NumberFormatException: badsize
     [exec]     [junit] Tests run: 11, Failures: 0, Errors: 0, Time elapsed: 0.063 sec
     [exec]     [junit] Tests run: 5, Failures: 0, Errors: 0, Time elapsed: 0.015 sec
     [exec]     [junit] java.util.logging.ErrorManager: the error code is 0.
     [exec]     [junit] The error message is: Invalid property value for java.util.logging.StreamHandler.filter:org.apache.harmony.logging.tests.java.util.logging.StreamHandlerTest
     [exec]     [junit] java.lang.ClassCastException: K0340
     [exec]     [junit] java.util.logging.ErrorManager: the error code is 0.
     [exec]     [junit] The error message is: Invalid property value for java.util.logging.StreamHandler.filter:org.apache.harmony.logging.tests.java.util.logging.StreamHandlerTest
     [exec]     [junit] java.lang.ClassCastException: K0340
     [exec]     [junit] java.util.logging.ErrorManager: the error code is 2.
     [exec]     [junit] The error message is: Exception occured when flushing the output stream.
     [exec]     [junit] java.lang.NullPointerException
     [exec]     [junit] java.util.logging.ErrorManager: the error code is 0.
     [exec]     [junit] The error message is: Null pointer of LogRecord
     [exec]     [junit] java.lang.NullPointerException: null
     [exec]     [junit] java.util.logging.ErrorManager: the error code is 0.
     [exec]     [junit] The error message is: Null pointer of LogRecord
     [exec]     [junit] java.lang.NullPointerException: null
     [exec]     [junit] java.util.logging.ErrorManager: the error code is 0.
     [exec]     [junit] The error message is: Null pointer of LogRecord
     [exec]     [junit] java.lang.NullPointerException: null
     [exec]     [junit] java.util.logging.ErrorManager: the error code is 0.
     [exec]     [junit] The error message is: Null pointer of LogRecord
     [exec]     [junit] java.lang.NullPointerException: null
     [exec]     [junit] java.util.logging.ErrorManager: the error code is 1.
     [exec]     [junit] The error message is: Exception occured when writing to the output stream.
     [exec]     [junit] java.lang.NullPointerException
     [exec]     [junit] Tests run: 40, Failures: 0, Errors: 0, Time elapsed: 0.047 sec
     [exec]     [junit] Tests run: 6, Failures: 0, Errors: 0, Time elapsed: 0.016 sec

     [exec] touch-failures-file:

     [exec] touch-errors-file:

     [exec] test:

     [exec] test:

     [exec] compile.java:
     [exec]      [echo] Compiling LUNI classes

     [exec] build.jar:
     [exec]       [jar] Building jar: C:\continuum-1.0.2\apps\continuum\working-directory\6\classlib\deploy\jdk\jre\lib\boot\luni.jar

     [exec] copy.resources:

     [exec] build:

     [exec] copy.test.resources:
     [exec]      [copy] Copying 35 files to C:\continuum-1.0.2\apps\continuum\working-directory\6\classlib\modules\luni\bin\test

     [exec] compile.tests:
     [exec]      [echo] Compiling LUNI tests
     [exec]     [javac] Compiling 313 source files to C:\continuum-1.0.2\apps\continuum\working-directory\6\classlib\modules\luni\bin\test
     [exec]     [javac] Note: Some input files use or override a deprecated API.
     [exec]     [javac] Note: Recompile with -Xlint:deprecation for details.
     [exec]     [javac] Note: Some input files use unchecked or unsafe operations.
     [exec]     [javac] Note: Recompile with -Xlint:unchecked for details.

     [exec] run.tests:
     [exec]     [junit] Running tests.impl.com.ibm.misc.util.NYITest
     [exec]     [junit] java version 1.5 (subset)
     [exec]     [junit] (c) Copyright 1991, 2006 The Apache Software Foundation or its licensors, as applicable.

     [exec]     [junit] Tests run: 4, Failures: 0, Errors: 0, Time elapsed: 2.266 sec
     [exec]     [junit] Tests run: 1, Failures: 0, Errors: 0, Time elapsed: 0.016 sec
     [exec]     [junit] Tests run: 2, Failures: 0, Errors: 0, Time elapsed: 0.031 sec
     [exec]     [junit] Tests run: 1, Failures: 0, Errors: 0, Time elapsed: 0.015 sec
     [exec]     [junit] Tests run: 1, Failures: 0, Errors: 0, Time elapsed: 0.016 sec
     [exec]     [junit] Tests run: 1, Failures: 0, Errors: 0, Time elapsed: 0.016 sec
     [exec]     [junit] Tests run: 3, Failures: 0, Errors: 0, Time elapsed: 0 sec
     [exec]     [junit] Tests run: 3, Failures: 0, Errors: 0, Time elapsed: 0.031 sec
     [exec]     [junit] Tests run: 3, Failures: 0, Errors: 0, Time elapsed: 0.016 sec
     [exec]     [junit] Tests run: 2, Failures: 0, Errors: 0, Time elapsed: 0 sec
     [exec]     [junit] Tests run: 3, Failures: 0, Errors: 0, Time elapsed: 0.016 sec
     [exec]     [junit] Tests run: 1, Failures: 0, Errors: 0, Time elapsed: 0.063 sec
     [exec]     [junit] Tests run: 3, Failures: 0, Errors: 0, Time elapsed: 0.016 sec
     [exec]     [junit] Tests run: 1, Failures: 0, Errors: 0, Time elapsed: 0 sec
     [exec]     [junit] Tests run: 12, Failures: 0, Errors: 0, Time elapsed: 0 sec
     [exec]     [junit] Tests run: 19, Failures: 0, Errors: 0, Time elapsed: 0 sec
     [exec]     [junit] Tests run: 20, Failures: 0, Errors: 0, Time elapsed: 0.703 sec
     [exec]     [junit] Tests run: 5, Failures: 0, Errors: 0, Time elapsed: 0.016 sec
     [exec]     [junit] Tests run: 4, Failures: 0, Errors: 0, Time elapsed: 0.031 sec
     [exec]     [junit] Tests run: 3, Failures: 0, Errors: 0, Time elapsed: 0 sec
     [exec]     [junit] Tests run: 9, Failures: 0, Errors: 0, Time elapsed: 0.016 sec
     [exec]     [junit] Tests run: 4, Failures: 0, Errors: 0, Time elapsed: 0.015 sec
     [exec]     [junit] Tests run: 28, Failures: 0, Errors: 0, Time elapsed: 0 sec
     [exec]     [junit] Tests run: 28, Failures: 0, Errors: 0, Time elapsed: 0 sec
     [exec]     [junit] Tests run: 1, Failures: 0, Errors: 0, Time elapsed: 0.016 sec
     [exec]     [junit] Tests run: 19, Failures: 0, Errors: 0, Time elapsed: 0.015 sec
     [exec]     [junit] Tests run: 18, Failures: 0, Errors: 0, Time elapsed: 0.235 sec
     [exec]     [junit] Tests run: 57, Failures: 0, Errors: 0, Time elapsed: 0.031 sec
     [exec]     [junit] Tests run: 19, Failures: 0, Errors: 0, Time elapsed: 0.015 sec
     [exec]     [junit] Tests run: 2, Failures: 0, Errors: 0, Time elapsed: 0 sec
     [exec]     [junit] Tests run: 3, Failures: 0, Errors: 0, Time elapsed: 0.016 sec
     [exec]     [junit] Tests run: 4, Failures: 0, Errors: 0, Time elapsed: 0 sec
     [exec]     [junit] Tests run: 4, Failures: 0, Errors: 0, Time elapsed: 0 sec
     [exec]     [junit] Tests run: 1, Failures: 0, Errors: 0, Time elapsed: 0.015 sec
     [exec]     [junit] Tests run: 3, Failures: 0, Errors: 0, Time elapsed: 0.015 sec
     [exec]     [junit] Tests run: 1, Failures: 0, Errors: 0, Time elapsed: 0 sec
     [exec]     [junit] Tests run: 20, Failures: 0, Errors: 0, Time elapsed: 0.032 sec
     [exec]     [junit] Tests run: 4, Failures: 0, Errors: 0, Time elapsed: 0 sec
     [exec]     [junit] Tests run: 24, Failures: 0, Errors: 0, Time elapsed: 0.032 sec
     [exec]     [junit] Tests run: 1, Failures: 0, Errors: 0, Time elapsed: 0.015 sec
     [exec]     [junit] Tests run: 2, Failures: 0, Errors: 0, Time elapsed: 0 sec
     [exec]     [junit] Tests run: 2, Failures: 0, Errors: 0, Time elapsed: 0 sec
     [exec]     [junit] Tests run: 1, Failures: 0, Errors: 0, Time elapsed: 0.187 sec
     [exec]     [junit] Tests run: 17, Failures: 0, Errors: 0, Time elapsed: 0.015 sec
     [exec]     [junit] Tests run: 1, Failures: 0, Errors: 0, Time elapsed: 0 sec
     [exec]     [junit] Tests run: 1, Failures: 0, Errors: 0, Time elapsed: 0.031 sec
     [exec]     [junit] Tests run: 1, Failures: 0, Errors: 0, Time elapsed: 0.015 sec
     [exec]     [junit] Tests run: 10, Failures: 0, Errors: 0, Time elapsed: 0.031 sec
     [exec]     [junit] Tests run: 5, Failures: 0, Errors: 0, Time elapsed: 0 sec
     [exec]     [junit] Tests run: 11, Failures: 0, Errors: 0, Time elapsed: 0 sec
     [exec]     [junit] Tests run: 8, Failures: 0, Errors: 0, Time elapsed: 0 sec
     [exec]     [junit] Tests run: 10, Failures: 0, Errors: 0, Time elapsed: 0 sec
     [exec]     [junit] Tests run: 13, Failures: 0, Errors: 0, Time elapsed: 0.016 sec
     [exec]     [junit] Tests run: 10, Failures: 0, Errors: 0, Time elapsed: 0 sec
     [exec]     [junit] Tests run: 17, Failures: 0, Errors: 0, Time elapsed: 0 sec
     [exec]     [junit] Tests run: 2, Failures: 0, Errors: 0, Time elapsed: 0 sec
     [exec]     [junit] Tests run: 19, Failures: 0, Errors: 0, Time elapsed: 0.015 sec
     [exec]     [junit] Tests run: 16, Failures: 0, Errors: 0, Time elapsed: 0 sec
     [exec]     [junit] Tests run: 2, Failures: 0, Errors: 0, Time elapsed: 0 sec
     [exec]     [junit] Tests run: 3, Failures: 0, Errors: 0, Time elapsed: 0.031 sec
     [exec]     [junit] Tests run: 11, Failures: 0, Errors: 0, Time elapsed: 0.047 sec
     [exec]     [junit] Tests run: 2, Failures: 0, Errors: 0, Time elapsed: 0 sec
     [exec]     [junit] Tests run: 11, Failures: 0, Errors: 0, Time elapsed: 0.047 sec
     [exec]     [junit] Tests run: 6, Failures: 0, Errors: 0, Time elapsed: 0.031 sec
     [exec]     [junit] Tests run: 3, Failures: 0, Errors: 0, Time elapsed: 0.015 sec
     [exec]     [junit] Tests run: 45, Failures: 0, Errors: 0, Time elapsed: 1.156 sec
     [exec]     [junit] Tests run: 4, Failures: 0, Errors: 0, Time elapsed: 0.016 sec
     [exec]     [junit] Tests run: 9, Failures: 0, Errors: 0, Time elapsed: 0.031 sec
     [exec]     [junit] Tests run: 6, Failures: 0, Errors: 0, Time elapsed: 0.016 sec
     [exec]     [junit] Tests run: 2, Failures: 0, Errors: 0, Time elapsed: 0 sec
     [exec]     [junit] Tests run: 2, Failures: 0, Errors: 0, Time elapsed: 0 sec
     [exec]     [junit] Tests run: 3, Failures: 0, Errors: 0, Time elapsed: 0 sec
     [exec]     [junit] Tests run: 9, Failures: 0, Errors: 0, Time elapsed: 0.015 sec
     [exec]     [junit] Tests run: 10, Failures: 0, Errors: 0, Time elapsed: 0 sec
     [exec]     [junit] Tests run: 2, Failures: 0, Errors: 0, Time elapsed: 0 sec
     [exec]     [junit] Tests run: 2, Failures: 0, Errors: 0, Time elapsed: 0.016 sec
     [exec]     [junit] Tests run: 7, Failures: 0, Errors: 0, Time elapsed: 0 sec
     [exec]     [junit] Tests run: 8, Failures: 0, Errors: 0, Time elapsed: 0.016 sec
     [exec]     [junit] Tests run: 2, Failures: 0, Errors: 0, Time elapsed: 0 sec
     [exec]     [junit] Tests run: 8, Failures: 0, Errors: 0, Time elapsed: 0 sec
     [exec]     [junit] Tests run: 10, Failures: 0, Errors: 0, Time elapsed: 2.516 sec
     [exec]     [junit] Tests run: 12, Failures: 0, Errors: 0, Time elapsed: 0.016 sec
     [exec]     [junit] Tests run: 33, Failures: 0, Errors: 0, Time elapsed: 0 sec
     [exec]     [junit] Tests run: 42, Failures: 0, Errors: 0, Time elapsed: 0.016 sec
     [exec]     [junit] Tests run: 10, Failures: 0, Errors: 0, Time elapsed: 0 sec
     [exec]     [junit] Tests run: 13, Failures: 0, Errors: 0, Time elapsed: 0 sec
     [exec]     [junit] Tests run: 43, Failures: 0, Errors: 0, Time elapsed: 0.156 sec
     [exec]     [junit] Tests run: 6, Failures: 0, Errors: 0, Time elapsed: 0 sec
     [exec]     [junit] Tests run: 2, Failures: 0, Errors: 0, Time elapsed: 0 sec
     [exec]     [junit] Tests run: 30, Failures: 0, Errors: 0, Time elapsed: 0.093 sec
     [exec]     [junit] Tests run: 2, Failures: 0, Errors: 0, Time elapsed: 0 sec
     [exec]     [junit] Tests run: 18, Failures: 0, Errors: 0, Time elapsed: 0 sec
     [exec]     [junit] Tests run: 6, Failures: 0, Errors: 0, Time elapsed: 0.016 sec
     [exec]     [junit] Tests run: 9, Failures: 0, Errors: 0, Time elapsed: 0 sec
     [exec]     [junit] Tests run: 15, Failures: 0, Errors: 0, Time elapsed: 0 sec
     [exec]     [junit] Tests run: 1, Failures: 0, Errors: 0, Time elapsed: 0 sec
     [exec]     [junit] Tests run: 2, Failures: 0, Errors: 0, Time elapsed: 0 sec
     [exec]     [junit] Tests run: 2, Failures: 0, Errors: 0, Time elapsed: 0 sec
     [exec]     [junit] Tests run: 2, Failures: 0, Errors: 0, Time elapsed: 0 sec
     [exec]     [junit] Tests run: 3, Failures: 0, Errors: 0, Time elapsed: 0.016 sec
     [exec]     [junit] Tests run: 2, Failures: 0, Errors: 0, Time elapsed: 0.016 sec
     [exec]     [junit] Tests run: 1, Failures: 0, Errors: 0, Time elapsed: 0.015 sec
     [exec]     [junit] Tests run: 3, Failures: 0, Errors: 0, Time elapsed: 0.016 sec
     [exec]     [junit] Tests run: 2, Failures: 0, Errors: 0, Time elapsed: 0.015 sec
     [exec]     [junit] Tests run: 8, Failures: 0, Errors: 0, Time elapsed: 0 sec
     [exec]     [junit] Tests run: 18, Failures: 0, Errors: 0, Time elapsed: 0.016 sec
     [exec]     [junit] Tests run: 31, Failures: 0, Errors: 0, Time elapsed: 0.015 sec
     [exec]     [junit] Tests run: 2, Failures: 0, Errors: 0, Time elapsed: 0 sec
     [exec]     [junit] Tests run: 4, Failures: 0, Errors: 0, Time elapsed: 0.015 sec
     [exec]     [junit] Tests run: 2, Failures: 0, Errors: 0, Time elapsed: 0 sec
     [exec]     [junit] Tests run: 2, Failures: 0, Errors: 0, Time elapsed: 0 sec
     [exec]     [junit] Tests run: 5, Failures: 0, Errors: 0, Time elapsed: 0 sec
     [exec]     [junit] Tests run: 22, Failures: 0, Errors: 0, Time elapsed: 0.109 sec
     [exec]     [junit] Tests run: 2, Failures: 0, Errors: 0, Time elapsed: 0 sec
     [exec]     [junit] Tests run: 4, Failures: 0, Errors: 0, Time elapsed: 0 sec
     [exec]     [junit] Tests run: 2, Failures: 0, Errors: 0, Time elapsed: 0 sec
     [exec]     [junit] Tests run: 22, Failures: 0, Errors: 0, Time elapsed: 0.015 sec
     [exec]     [junit] Hello world from the test suites
     [exec]     [junit] Tests run: 1, Failures: 0, Errors: 0, Time elapsed: 0 sec
     [exec]     [junit] Tests run: 2, Failures: 0, Errors: 0, Time elapsed: 0 sec
     [exec]     [junit] Tests run: 2, Failures: 0, Errors: 0, Time elapsed: 0 sec
     [exec]     [junit] Tests run: 4, Failures: 0, Errors: 0, Time elapsed: 0.015 sec
     [exec]     [junit] Tests run: 2, Failures: 0, Errors: 0, Time elapsed: 0 sec
     [exec]     [junit] Tests run: 4, Failures: 0, Errors: 0, Time elapsed: 0.016 sec
     [exec]     [junit] Tests run: 2, Failures: 0, Errors: 0, Time elapsed: 0 sec
     [exec]     [junit] Tests run: 2, Failures: 0, Errors: 0, Time elapsed: 0 sec
     [exec]     [junit] Tests run: 1, Failures: 0, Errors: 0, Time elapsed: 0 sec
     [exec]     [junit] Tests run: 1, Failures: 0, Errors: 0, Time elapsed: 0 sec
     [exec]     [junit] Tests run: 2, Failures: 0, Errors: 0, Time elapsed: 0 sec
     [exec]     [junit] Tests run: 25, Failures: 0, Errors: 0, Time elapsed: 0 sec
     [exec]     [junit] Tests run: 2, Failures: 0, Errors: 0, Time elapsed: 0 sec
     [exec]     [junit] Tests run: 2, Failures: 0, Errors: 0, Time elapsed: 0.015 sec
     [exec]     [junit] Tests run: 2, Failures: 0, Errors: 0, Time elapsed: 0 sec
     [exec]     [junit] Tests run: 25, Failures: 0, Errors: 0, Time elapsed: 0 sec
     [exec]     [junit] Tests run: 32, Failures: 0, Errors: 0, Time elapsed: 0.016 sec
     [exec]     [junit] Tests run: 2, Failures: 0, Errors: 0, Time elapsed: 0 sec
     [exec]     [junit] Tests run: 2, Failures: 0, Errors: 0, Time elapsed: 0 sec
     [exec]     [junit] Tests run: 2, Failures: 0, Errors: 0, Time elapsed: 0 sec
     [exec]     [junit] Tests run: 2, Failures: 0, Errors: 0, Time elapsed: 0 sec
     [exec]     [junit] Tests run: 2, Failures: 0, Errors: 0, Time elapsed: 0 sec
     [exec]     [junit] Tests run: 2, Failures: 0, Errors: 0, Time elapsed: 0 sec
     [exec]     [junit] Tests run: 2, Failures: 0, Errors: 0, Time elapsed: 0 sec
     [exec]     [junit] Tests run: 2, Failures: 0, Errors: 0, Time elapsed: 0 sec
     [exec]     [junit] Tests run: 3, Failures: 0, Errors: 0, Time elapsed: 0 sec
     [exec]     [junit] Tests run: 10, Failures: 0, Errors: 0, Time elapsed: 19.125 sec
     [exec]     [junit] Tests run: 2, Failures: 0, Errors: 0, Time elapsed: 4.515 sec
     [exec]     [junit] Tests run: 9, Failures: 0, Errors: 0, Time elapsed: 1.312 sec
     [exec]     [junit] Tests run: 2, Failures: 0, Errors: 0, Time elapsed: 0 sec
     [exec]     [junit] Tests run: 2, Failures: 0, Errors: 0, Time elapsed: 0 sec
     [exec]     [junit] Tests run: 7, Failures: 0, Errors: 0, Time elapsed: 0.25 sec
     [exec]     [junit] Tests run: 4, Failures: 0, Errors: 0, Time elapsed: 0.015 sec
     [exec]     [junit] Tests run: 2, Failures: 0, Errors: 0, Time elapsed: 0.062 sec
     [exec]     [junit] Tests run: 18, Failures: 0, Errors: 0, Time elapsed: 0 sec
     [exec]     [junit] Tests run: 2, Failures: 0, Errors: 0, Time elapsed: 0.078 sec
     [exec]     [junit] Tests run: 32, Failures: 0, Errors: 0, Time elapsed: 0 sec
     [exec]     [junit] Tests run: 37, Failures: 0, Errors: 0, Time elapsed: 0 sec
     [exec]     [junit] Tests run: 2, Failures: 0, Errors: 0, Time elapsed: 0 sec
     [exec]     [junit] Tests run: 16, Failures: 0, Errors: 0, Time elapsed: 0.172 sec
     [exec]     [junit] Tests run: 1, Failures: 0, Errors: 0, Time elapsed: 0 sec
     [exec]     [junit] Tests run: 19, Failures: 0, Errors: 0, Time elapsed: 18.5 sec
     [exec]     [junit] Tests run: 3, Failures: 0, Errors: 0, Time elapsed: 0 sec
     [exec]     [junit] Tests run: 8, Failures: 0, Errors: 0, Time elapsed: 0.016 sec
     [exec]     [junit] Tests run: 2, Failures: 0, Errors: 0, Time elapsed: 0 sec
     [exec]     [junit] Tests run: 2, Failures: 0, Errors: 0, Time elapsed: 0.015 sec
     [exec]     [junit] Tests run: 4, Failures: 0, Errors: 0, Time elapsed: 0.016 sec
     [exec]     [junit] Tests run: 2, Failures: 0, Errors: 0, Time elapsed: 0 sec
     [exec]     [junit] Tests run: 2, Failures: 0, Errors: 0, Time elapsed: 0.016 sec
     [exec]     [junit] Tests run: 2, Failures: 0, Errors: 0, Time elapsed: 1 sec
     [exec]     [junit] Tests run: 4, Failures: 0, Errors: 0, Time elapsed: 0.015 sec
     [exec]     [junit] Tests run: 5, Failures: 0, Errors: 0, Time elapsed: 0.079 sec
     [exec]     [junit] Tests run: 3, Failures: 0, Errors: 0, Time elapsed: 0 sec
     [exec]     [junit] Tests run: 2, Failures: 0, Errors: 0, Time elapsed: 1 sec
     [exec]     [junit] Tests run: 3, Failures: 0, Errors: 0, Time elapsed: 0 sec
     [exec]     [junit] Tests run: 21, Failures: 0, Errors: 0, Time elapsed: 0 sec
     [exec]     [junit] Tests run: 8, Failures: 0, Errors: 0, Time elapsed: 0 sec
     [exec]     [junit] Tests run: 25, Failures: 0, Errors: 0, Time elapsed: 0.016 sec
     [exec]     [junit] Tests run: 6, Failures: 0, Errors: 0, Time elapsed: 0 sec
     [exec]     [junit] Tests run: 9, Failures: 0, Errors: 0, Time elapsed: 0.015 sec
     [exec]     [junit] Tests run: 14, Failures: 0, Errors: 0, Time elapsed: 0 sec
     [exec]     [junit] Tests run: 4, Failures: 0, Errors: 0, Time elapsed: 0.031 sec
     [exec]     [junit] Tests run: 2, Failures: 0, Errors: 0, Time elapsed: 0 sec
     [exec]     [junit] Tests run: 5, Failures: 0, Errors: 0, Time elapsed: 0 sec
     [exec]     [junit] Tests run: 2, Failures: 0, Errors: 0, Time elapsed: 0 sec
     [exec]     [junit] Tests run: 2, Failures: 0, Errors: 0, Time elapsed: 2.39 sec
     [exec]     [junit] Tests run: 4, Failures: 0, Errors: 0, Time elapsed: 0 sec
     [exec]     [junit] Loading: ../../../../support/src/test/resources/config/localhosttest.ini
     [exec]     [junit] Tests run: 18, Failures: 0, Errors: 0, Time elapsed: 0.047 sec
     [exec]     [junit] Tests run: 2, Failures: 0, Errors: 0, Time elapsed: 0 sec
     [exec]     [junit] Tests run: 12, Failures: 0, Errors: 0, Time elapsed: 0 sec
     [exec]     [junit] Tests run: 19, Failures: 0, Errors: 0, Time elapsed: 2.391 sec

     [exec]     [junit] Testing the threadsafety of getHostName.  This test could produce unpredictable results if getHostName is not threadsafe.
     [exec]     [junit] Started threads, joining...
     [exec]     [junit] Tests run: 16, Failures: 0, Errors: 0, Time elapsed: 19.703 sec
     [exec]     [junit] Tests run: 6, Failures: 0, Errors: 0, Time elapsed: 0.016 sec
     [exec]     [junit] Tests run: 2, Failures: 0, Errors: 0, Time elapsed: 0 sec
     [exec]     [junit] Tests run: 2, Failures: 0, Errors: 0, Time elapsed: 0 sec
     [exec]     [junit] Tests run: 9, Failures: 0, Errors: 0, Time elapsed: 0.532 sec
     [exec]     [junit] Tests run: 2, Failures: 0, Errors: 0, Time elapsed: 0 sec
     [exec]     [junit] Tests run: 3, Failures: 0, Errors: 0, Time elapsed: 0 sec
     [exec]     [junit] Tests run: 2, Failures: 0, Errors: 0, Time elapsed: 0 sec
     [exec]     [junit] Tests run: 17, Failures: 0, Errors: 0, Time elapsed: 0 sec
     [exec]     [junit] Tests run: 12, Failures: 0, Errors: 0, Time elapsed: 0 sec
     [exec]     [junit] Tests run: 4, Failures: 0, Errors: 0, Time elapsed: 0 sec
     [exec]     [junit] Tests run: 24, Failures: 0, Errors: 0, Time elapsed: 5.015 sec
     [exec]     [junit] Tests run: 2, Failures: 0, Errors: 0, Time elapsed: 0.016 sec
     [exec]     [junit] Tests run: 6, Failures: 0, Errors: 0, Time elapsed: 0 sec
     [exec]     [junit] Tests run: 43, Failures: 0, Errors: 0, Time elapsed: 0.063 sec
     [exec]     [junit] Tests run: 3, Failures: 0, Errors: 0, Time elapsed: 0 sec
     [exec]     [junit] Tests run: 1, Failures: 0, Errors: 0, Time elapsed: 0 sec
     [exec]     [junit] Tests run: 2, Failures: 0, Errors: 0, Time elapsed: 2.375 sec
     [exec]     [junit] Tests run: 2, Failures: 0, Errors: 0, Time elapsed: 0.015 sec
     [exec]     [junit] Tests run: 8, Failures: 0, Errors: 0, Time elapsed: 0.016 sec
     [exec]     [junit] Tests run: 6, Failures: 0, Errors: 0, Time elapsed: 0.016 sec
     [exec]     [junit] Tests run: 4, Failures: 0, Errors: 0, Time elapsed: 0 sec
     [exec]     [junit] Tests run: 14, Failures: 0, Errors: 0, Time elapsed: 0 sec
     [exec]     [junit] Tests run: 22, Failures: 0, Errors: 0, Time elapsed: 0.016 sec
     [exec]     [junit] Tests run: 74, Failures: 0, Errors: 0, Time elapsed: 0.031 sec
     [exec]     [junit] Tests run: 29, Failures: 0, Errors: 0, Time elapsed: 0.016 sec
     [exec]     [junit] Tests run: 5, Failures: 0, Errors: 0, Time elapsed: 0.032 sec
     [exec]     [junit] Tests run: 40, Failures: 0, Errors: 0, Time elapsed: 0.547 sec
     [exec]     [junit] Tests run: 5, Failures: 0, Errors: 0, Time elapsed: 0 sec
     [exec]     [junit] Tests run: 2, Failures: 0, Errors: 0, Time elapsed: 0.015 sec
     [exec]     [junit] Tests run: 5, Failures: 0, Errors: 0, Time elapsed: 0.031 sec
     [exec]     [junit] Tests run: 32, Failures: 0, Errors: 0, Time elapsed: 0.015 sec
     [exec]     [junit] Tests run: 5, Failures: 0, Errors: 0, Time elapsed: 0 sec
     [exec]     [junit] Tests run: 1, Failures: 0, Errors: 0, Time elapsed: 0 sec
     [exec]     [junit] Tests run: 3, Failures: 0, Errors: 0, Time elapsed: 0 sec
     [exec]     [junit] Tests run: 6, Failures: 0, Errors: 0, Time elapsed: 0.016 sec
     [exec]     [junit] Tests run: 1, Failures: 0, Errors: 0, Time elapsed: 0 sec
     [exec]     [junit] Tests run: 3, Failures: 0, Errors: 0, Time elapsed: 0.015 sec
     [exec]     [junit] Tests run: 29, Failures: 0, Errors: 0, Time elapsed: 0.328 sec
     [exec]     [junit] Tests run: 21, Failures: 0, Errors: 0, Time elapsed: 0.015 sec
     [exec]     [junit] Tests run: 17, Failures: 0, Errors: 0, Time elapsed: 0.047 sec
     [exec]     [junit] Tests run: 12, Failures: 0, Errors: 0, Time elapsed: 0.015 sec
     [exec]     [junit] Tests run: 27, Failures: 0, Errors: 0, Time elapsed: 0.14 sec
     [exec]     [junit] Tests run: 9, Failures: 0, Errors: 0, Time elapsed: 0.031 sec
     [exec]     [junit] Tests run: 17, Failures: 0, Errors: 0, Time elapsed: 0.047 sec
     [exec]     [junit] Tests run: 5, Failures: 0, Errors: 0, Time elapsed: 0 sec
     [exec]     [junit] Tests run: 6, Failures: 0, Errors: 0, Time elapsed: 0.016 sec
     [exec]     [junit] Tests run: 5, Failures: 0, Errors: 0, Time elapsed: 0 sec
     [exec]     [junit] Tests run: 5, Failures: 0, Errors: 0, Time elapsed: 0.016 sec
     [exec]     [junit] Tests run: 5, Failures: 0, Errors: 0, Time elapsed: 0 sec
     [exec]     [junit] Tests run: 4, Failures: 0, Errors: 0, Time elapsed: 0 sec
     [exec]     [junit] Tests run: 21, Failures: 0, Errors: 0, Time elapsed: 0.062 sec
     [exec]     [junit] Tests run: 12, Failures: 0, Errors: 0, Time elapsed: 0.016 sec
     [exec]     [junit] Tests run: 30, Failures: 0, Errors: 0, Time elapsed: 0 sec
     [exec]     [junit] Tests run: 1, Failures: 0, Errors: 0, Time elapsed: 0.015 sec
     [exec]     [junit] Tests run: 23, Failures: 0, Errors: 0, Time elapsed: 0.032 sec
     [exec]     [junit] Tests run: 5, Failures: 0, Errors: 0, Time elapsed: 0.015 sec
     [exec]     [junit] Tests run: 5, Failures: 0, Errors: 0, Time elapsed: 0.016 sec
     [exec]     [junit] Tests run: 3, Failures: 0, Errors: 0, Time elapsed: 0 sec
     [exec]     [junit] Tests run: 2, Failures: 0, Errors: 0, Time elapsed: 0 sec
     [exec]     [junit] Tests run: 8, Failures: 0, Errors: 0, Time elapsed: 0.016 sec
     [exec]     [junit] Tests run: 40, Failures: 0, Errors: 0, Time elapsed: 0.031 sec
     [exec]     [junit] Tests run: 14, Failures: 0, Errors: 0, Time elapsed: 0.093 sec
     [exec]     [junit] Tests run: 6, Failures: 0, Errors: 0, Time elapsed: 0 sec
     [exec]     [junit] Tests run: 3, Failures: 0, Errors: 0, Time elapsed: 0 sec
     [exec]     [junit] Tests run: 11, Failures: 0, Errors: 0, Time elapsed: 0 sec
     [exec]     [junit] Tests run: 3, Failures: 0, Errors: 0, Time elapsed: 0.015 sec
     [exec]     [junit] Tests run: 17, Failures: 0, Errors: 0, Time elapsed: 0.031 sec
     [exec]     [junit] Tests run: 23, Failures: 0, Errors: 0, Time elapsed: 0 sec
     [exec]     [junit] Tests run: 6, Failures: 0, Errors: 0, Time elapsed: 0 sec
     [exec]     [junit] Tests run: 9, Failures: 0, Errors: 0, Time elapsed: 0 sec
     [exec]     [junit] Tests run: 5, Failures: 0, Errors: 0, Time elapsed: 0 sec
     [exec]     [junit] Tests run: 4, Failures: 0, Errors: 0, Time elapsed: 3 sec
     [exec]     [junit] Tests run: 12, Failures: 0, Errors: 0, Time elapsed: 12.844 sec
     [exec]     [junit] Tests run: 2, Failures: 0, Errors: 0, Time elapsed: 0 sec
     [exec]     [junit] Tests run: 22, Failures: 0, Errors: 0, Time elapsed: 0.047 sec
     [exec]     [junit] Tests run: 19, Failures: 0, Errors: 0, Time elapsed: 0.016 sec
     [exec]     [junit] Tests run: 5, Failures: 0, Errors: 0, Time elapsed: 0 sec
     [exec]     [junit] Tests run: 5, Failures: 0, Errors: 0, Time elapsed: 0 sec
     [exec]     [junit] Tests run: 48, Failures: 0, Errors: 0, Time elapsed: 0.094 sec
     [exec]     [junit] Tests run: 14, Failures: 0, Errors: 0, Time elapsed: 0.266 sec
     [exec]     [junit] Tests run: 1, Failures: 0, Errors: 0, Time elapsed: 0 sec
     [exec]     [junit] Test suite -> expect a Not yet implemented output >>>
     [exec]     [junit] *** NOT YET IMPLEMENTED EXCEPTION ***
     [exec]     [junit] *** thrown from class  -> tests.impl.com.ibm.misc.util.NYITest
     [exec]     [junit] ***             method -> testNYI
     [exec]     [junit] *** defined in         -> the file "NYITest.java" on line #35
     [exec]     [junit] Test suite finished Not yet implemented output <<<

     [exec] touch-failures-file:

     [exec] touch-errors-file:

     [exec] test:

     [exec] compile.java:
     [exec]      [echo] Compiling MATH classes

     [exec] build.jar:

     [exec] build:

     [exec] compile.tests:
     [exec]      [echo] Compiling MATH tests
     [exec]     [javac] Compiling 24 source files to C:\continuum-1.0.2\apps\continuum\working-directory\6\classlib\modules\math\bin\test

     [exec] run.tests:
     [exec]     [junit] Running tests.api.java.math.BigIntegerTest
     [exec]     [junit] java version 1.5 (subset)
     [exec]     [junit] (c) Copyright 1991, 2006 The Apache Software Foundation or its licensors, as applicable.

     [exec]     [junit] Tests run: 89, Failures: 0, Errors: 0, Time elapsed: 0.234 sec
     [exec]     [junit] Tests run: 34, Failures: 0, Errors: 0, Time elapsed: 0.031 sec
     [exec]     [junit] Tests run: 47, Failures: 0, Errors: 0, Time elapsed: 0.015 sec
     [exec]     [junit] Tests run: 49, Failures: 0, Errors: 0, Time elapsed: 0.016 sec
     [exec]     [junit] Tests run: 24, Failures: 0, Errors: 0, Time elapsed: 0 sec
     [exec]     [junit] Tests run: 23, Failures: 0, Errors: 0, Time elapsed: 0.016 sec
     [exec]     [junit] Tests run: 21, Failures: 0, Errors: 0, Time elapsed: 0 sec
     [exec]     [junit] Tests run: 33, Failures: 0, Errors: 0, Time elapsed: 0 sec
     [exec]     [junit] Tests run: 46, Failures: 0, Errors: 0, Time elapsed: 0.016 sec
     [exec]     [junit] Tests run: 58, Failures: 0, Errors: 0, Time elapsed: 0.031 sec
     [exec]     [junit] Tests run: 32, Failures: 0, Errors: 0, Time elapsed: 0 sec
     [exec]     [junit] Tests run: 4, Failures: 0, Errors: 0, Time elapsed: 0 sec
     [exec]     [junit] Tests run: 15, Failures: 0, Errors: 0, Time elapsed: 0.016 sec
     [exec]     [junit] Tests run: 18, Failures: 0, Errors: 0, Time elapsed: 0.016 sec
     [exec]     [junit] Tests run: 9, Failures: 0, Errors: 0, Time elapsed: 0 sec
     [exec]     [junit] Tests run: 85, Failures: 0, Errors: 0, Time elapsed: 0 sec
     [exec]     [junit] Tests run: 19, Failures: 0, Errors: 0, Time elapsed: 0 sec
     [exec]     [junit] Tests run: 25, Failures: 0, Errors: 0, Time elapsed: 0.015 sec
     [exec]     [junit] Tests run: 11, Failures: 0, Errors: 0, Time elapsed: 0.015 sec
     [exec]     [junit] Tests run: 19, Failures: 0, Errors: 0, Time elapsed: 0 sec
     [exec]     [junit] Tests run: 35, Failures: 0, Errors: 0, Time elapsed: 0.016 sec
     [exec]     [junit] Tests run: 34, Failures: 0, Errors: 0, Time elapsed: 0.5 sec

     [exec] touch-failures-file:

     [exec] touch-errors-file:

     [exec] test:

     [exec] compile.java:
     [exec]      [echo] Compiling MISC classes

     [exec] build.jar:

     [exec] build:

     [exec] compile.tests:
     [exec]      [echo] Compiling MISC tests

     [exec] run.tests:

     [exec] touch-failures-file:

     [exec] touch-errors-file:

     [exec] test:

     [exec] compile.java:
     [exec]      [echo] Compiling NIO classes

     [exec] build.jar:

     [exec] build:

     [exec] copy.test.resources:
     [exec]     [mkdir] Created dir: C:\continuum-1.0.2\apps\continuum\working-directory\6\classlib\modules\nio\bin\test
     [exec]      [copy] Copying 3 files to C:\continuum-1.0.2\apps\continuum\working-directory\6\classlib\modules\nio\bin\test

     [exec] compile.tests:
     [exec]      [echo] Compiling NIO tests
     [exec]     [javac] Compiling 50 source files to C:\continuum-1.0.2\apps\continuum\working-directory\6\classlib\modules\nio\bin\test

     [exec] run.tests:
     [exec]     [junit] Running org.apache.harmony.tests.java.nio.channels.spi.SelectorProviderTest
     [exec]     [junit] (c) Copyright 1991, 2006 The Apache Software Foundation or its licensors, as applicable.
     [exec]     [junit] java version 1.5 (subset)

     [exec]     [junit] Tests run: 13, Failures: 0, Errors: 0, Time elapsed: 0.125 sec
     [exec]     [junit] Tests run: 2, Failures: 0, Errors: 0, Time elapsed: 0.219 sec
     [exec]     [junit] Tests run: 1, Failures: 0, Errors: 0, Time elapsed: 0 sec
     [exec]     [junit] Tests run: 2, Failures: 0, Errors: 0, Time elapsed: 0.016 sec
     [exec]     [junit] Tests run: 65, Failures: 0, Errors: 0, Time elapsed: 0.016 sec
     [exec]     [junit] Tests run: 2, Failures: 0, Errors: 0, Time elapsed: 0 sec
     [exec]     [junit] Tests run: 17, Failures: 0, Errors: 0, Time elapsed: 0.125 sec
     [exec]     [junit] Tests run: 66, Failures: 0, Errors: 0, Time elapsed: 0.172 sec
     [exec]     [junit] Tests run: 5, Failures: 0, Errors: 0, Time elapsed: 0.063 sec
     [exec]     [junit] Tests run: 66, Failures: 0, Errors: 0, Time elapsed: 0.016 sec
     [exec]     [junit] Tests run: 66, Failures: 0, Errors: 0, Time elapsed: 0.016 sec
     [exec]     [junit] Tests run: 66, Failures: 0, Errors: 0, Time elapsed: 0.016 sec
     [exec]     [junit] Tests run: 4, Failures: 0, Errors: 0, Time elapsed: 0.031 sec
     [exec]     [junit] Tests run: 66, Failures: 0, Errors: 0, Time elapsed: 0.032 sec
     [exec]     [junit] Tests run: 4, Failures: 0, Errors: 0, Time elapsed: 0.032 sec
     [exec]     [junit] Tests run: 4, Failures: 0, Errors: 0, Time elapsed: 0.016 sec
     [exec]     [junit] Tests run: 66, Failures: 0, Errors: 0, Time elapsed: 0.016 sec
     [exec]     [junit] Tests run: 66, Failures: 0, Errors: 0, Time elapsed: 0 sec
     [exec]     [junit] Tests run: 66, Failures: 0, Errors: 0, Time elapsed: 0.016 sec
     [exec]     [junit] Tests run: 4, Failures: 0, Errors: 0, Time elapsed: 0.031 sec
     [exec]     [junit] Tests run: 66, Failures: 0, Errors: 0, Time elapsed: 0.031 sec
     [exec]     [junit] Tests run: 66, Failures: 0, Errors: 0, Time elapsed: 0.016 sec
     [exec]     [junit] Tests run: 66, Failures: 0, Errors: 0, Time elapsed: 0.016 sec
     [exec]     [junit] Tests run: 66, Failures: 0, Errors: 0, Time elapsed: 0.016 sec
     [exec]     [junit] Tests run: 2, Failures: 0, Errors: 0, Time elapsed: 0.015 sec
     [exec]     [junit] Tests run: 18, Failures: 0, Errors: 0, Time elapsed: 0.078 sec
     [exec]     [junit] Tests run: 119, Failures: 0, Errors: 0, Time elapsed: 12.906 sec
     [exec]     [junit] Tests run: 6, Failures: 0, Errors: 0, Time elapsed: 0.062 sec
     [exec]     [junit] Tests run: 2, Failures: 0, Errors: 0, Time elapsed: 0.031 sec
     [exec]     [junit] Tests run: 3, Failures: 0, Errors: 0, Time elapsed: 0.062 sec
     [exec]     [junit] Tests run: 1, Failures: 0, Errors: 0, Time elapsed: 0.016 sec
     [exec]     [junit] Tests run: 16, Failures: 0, Errors: 0, Time elapsed: 0.313 sec
     [exec]     [junit] Tests run: 15, Failures: 0, Errors: 0, Time elapsed: 0.735 sec
     [exec]     [junit] Tests run: 16, Failures: 0, Errors: 0, Time elapsed: 0.562 sec
     [exec]     [junit] Tests run: 17, Failures: 0, Errors: 0, Time elapsed: 0.375 sec
     [exec]     [junit] Connection fail, testCFII_ConnectAfterFinish_Server_Block is not finished.
     [exec]     [junit] Finish connection failed, probably due to reset by peer error.
     [exec]     [junit] Finish connection failed, probably due to reset by peer error.
     [exec]     [junit] in thread1localhost/127.0.0.1:14007 - Connection refused
     [exec]     [junit] T1 not closed
     [exec]     [junit] in thread2Bad socket
     [exec]     [junit] T2 not closed
     [exec]     [junit] Read fail, testReadByteBuffer_NonBlocking_ReadWriteRealLargeData not finished.
     [exec]     [junit] Read fail in capacity64KB, testReadByteBuffer_NonBlocking_ReadWriteRealTooLargeData not finish.
     [exec]     [junit] Read fail in capacity64KB+1, testReadByteBuffer_NonBlocking_ReadWriteRealTooLargeData not finish.
     [exec]     [junit] Tests run: 80, Failures: 0, Errors: 0, Time elapsed: 15.125 sec
     [exec]     [junit] Tests run: 14, Failures: 0, Errors: 0, Time elapsed: 0.25 sec
     [exec]     [junit] Tests run: 3, Failures: 0, Errors: 0, Time elapsed: 0 sec
     [exec]     [junit] Tests run: 4, Failures: 0, Errors: 0, Time elapsed: 0.015 sec
     [exec]     [junit] Tests run: 2, Failures: 0, Errors: 0, Time elapsed: 0.016 sec
     [exec]     [junit] Tests run: 6, Failures: 0, Errors: 0, Time elapsed: 0.062 sec
     [exec]     [junit] Tests run: 2, Failures: 0, Errors: 0, Time elapsed: 0.016 sec

     [exec] touch-failures-file:

     [exec] touch-errors-file:

     [exec] test:

     [exec] compile.java:
     [exec]      [echo] Compiling NIO_CHAR classes

     [exec] build.jar:

     [exec] build:

     [exec] compile.tests:
     [exec]      [echo] Compiling NIO_CHAR tests
     [exec]     [javac] Compiling 42 source files to C:\continuum-1.0.2\apps\continuum\working-directory\6\classlib\modules\nio_char\bin\test
     [exec]     [javac] Note: Some input files use unchecked or unsafe operations.
     [exec]     [javac] Note: Recompile with -Xlint:unchecked for details.

     [exec] run.tests:
     [exec]     [junit] Running tests.api.java.nio.charset.spi.CharsetProviderTest
     [exec]     [junit] java version 1.5 (subset)

     [exec]     [junit] (c) Copyright 1991, 2006 The Apache Software Foundation or its licensors, as applicable.
     [exec]     [junit] Tests run: 4, Failures: 0, Errors: 0, Time elapsed: 0.141 sec
     [exec]     [junit] Tests run: 4, Failures: 0, Errors: 0, Time elapsed: 0.031 sec
     [exec]     [junit] Tests run: 6, Failures: 0, Errors: 0, Time elapsed: 0.469 sec
     [exec]     [junit] Cannot find unmappable byte array for US-ASCII
     [exec]     [junit] Tests run: 21, Failures: 0, Errors: 0, Time elapsed: 0.016 sec
     [exec]     [junit] Tests run: 8, Failures: 0, Errors: 0, Time elapsed: 0.016 sec
     [exec]     [junit] Tests run: 3, Failures: 0, Errors: 0, Time elapsed: 0.11 sec
     [exec]     [junit] Tests run: 21, Failures: 0, Errors: 0, Time elapsed: 0.016 sec
     [exec]     [junit] Tests run: 4, Failures: 0, Errors: 0, Time elapsed: 0.015 sec
     [exec]     [junit] Tests run: 11, Failures: 0, Errors: 0, Time elapsed: 0.016 sec
     [exec]     [junit] Tests run: 2, Failures: 0, Errors: 0, Time elapsed: 0 sec
     [exec]     [junit] Tests run: 21, Failures: 0, Errors: 0, Time elapsed: 0 sec
     [exec]     [junit] Cannot find unmappable byte array for gb18030
     [exec]     [junit] Cannot find unmappable byte array for ISO-8859-1
     [exec]     [junit] Cannot find malform byte array for ISO-8859-1
     [exec]     [junit] Tests run: 21, Failures: 0, Errors: 0, Time elapsed: 0 sec
     [exec]     [junit] Tests run: 8, Failures: 0, Errors: 0, Time elapsed: 0.015 sec
     [exec]     [junit] Tests run: 3, Failures: 0, Errors: 0, Time elapsed: 0.016 sec
     [exec]     [junit] Tests run: 3, Failures: 0, Errors: 0, Time elapsed: 0.015 sec
     [exec]     [junit] Tests run: 21, Failures: 0, Errors: 0, Time elapsed: 0.015 sec
     [exec]     [junit] Cannot find unmappable byte array for UTF-16BE
     [exec]     [junit] Cannot find malform byte array for UTF-16BE
     [exec]     [junit] Tests run: 8, Failures: 0, Errors: 0, Time elapsed: 0 sec
     [exec]     [junit] Tests run: 8, Failures: 0, Errors: 0, Time elapsed: 0.016 sec
     [exec]     [junit] Cannot find unmappable byte array for UTF-16LE
     [exec]     [junit] Cannot find malform byte array for UTF-16LE
     [exec]     [junit] Tests run: 21, Failures: 0, Errors: 0, Time elapsed: 0.015 sec
     [exec]     [junit] Tests run: 8, Failures: 0, Errors: 0, Time elapsed: 0 sec
     [exec]     [junit] Tests run: 8, Failures: 0, Errors: 0, Time elapsed: 0 sec
     [exec]     [junit] Tests run: 21, Failures: 0, Errors: 0, Time elapsed: 0 sec
     [exec]     [junit] Cannot find unmappable byte array for UTF-8
     [exec]     [junit] Tests run: 3, Failures: 0, Errors: 0, Time elapsed: 0.015 sec
     [exec]     [junit] Tests run: 3, Failures: 0, Errors: 0, Time elapsed: 0.016 sec
     [exec]     [junit] Tests run: 1, Failures: 0, Errors: 0, Time elapsed: 0.015 sec

     [exec] touch-failures-file:

     [exec] touch-errors-file:

     [exec] test:

     [exec] compile.java:
     [exec]      [echo] Compiling PREFS classes

     [exec] build.jar:

     [exec] build:

     [exec] copy.test.resources:
     [exec]      [copy] Copying 7 files to C:\continuum-1.0.2\apps\continuum\working-directory\6\classlib\modules\prefs\bin\test

     [exec] compile.tests:
     [exec]      [echo] Compiling PREFS tests
     [exec]     [javac] Compiling 15 source files to C:\continuum-1.0.2\apps\continuum\working-directory\6\classlib\modules\prefs\bin\test
     [exec]     [javac] Note: C:\continuum-1.0.2\apps\continuum\working-directory\6\classlib\modules\prefs\src\test\java\org\apache\harmony\prefs\tests\java\util\prefs\PreferencesTest.java uses or overrides a deprecated API.
     [exec]     [javac] Note: Recompile with -Xlint:deprecation for details.
     [exec]     [javac] Note: Some input files use unchecked or unsafe operations.
     [exec]     [javac] Note: Recompile with -Xlint:unchecked for details.

     [exec] run.tests:
     [exec]     [junit] Running org.apache.harmony.prefs.tests.java.util.prefs.PreferencesFactoryTest
     [exec]     [junit] java version 1.5 (subset)

     [exec]     [junit] (c) Copyright 1991, 2006 The Apache Software Foundation or its licensors, as applicable.
     [exec]     [junit] Tests run: 3, Failures: 0, Errors: 0, Time elapsed: 0.39 sec
     [exec]     [junit] Tests run: 4, Failures: 0, Errors: 0, Time elapsed: 0.032 sec
     [exec]     [junit] Tests run: 3, Failures: 0, Errors: 0, Time elapsed: 0.063 sec
     [exec]     [junit] Tests run: 2, Failures: 0, Errors: 0, Time elapsed: 0.016 sec
     [exec]     [junit] Tests run: 4, Failures: 0, Errors: 0, Time elapsed: 0.016 sec
     [exec]     [junit] Tests run: 1, Failures: 0, Errors: 0, Time elapsed: 0 sec
     [exec]     [junit] Tests run: 2, Failures: 0, Errors: 0, Time elapsed: 0.015 sec

     [exec] touch-failures-file:

     [exec] touch-errors-file:

     [exec] test:

     [exec] compile.java:
     [exec]      [echo] Compiling REGEX classes

     [exec] build.jar:

     [exec] build:

     [exec] compile.tests:
     [exec]      [echo] Compiling REGEX tests
     [exec]     [javac] Compiling 9 source files to C:\continuum-1.0.2\apps\continuum\working-directory\6\classlib\modules\regex\bin\test

     [exec] run.tests:
     [exec]     [junit] Running org.apache.harmony.tests.java.util.regex.SplitTest
     [exec]     [junit] java version 1.5 (subset)
     [exec]     [junit] (c) Copyright 1991, 2006 The Apache Software Foundation or its licensors, as applicable.

     [exec]     [junit] Tests run: 3, Failures: 0, Errors: 0, Time elapsed: 0.156 sec
     [exec]     [junit] Tests run: 37, Failures: 0, Errors: 0, Time elapsed: 0.141 sec
     [exec]     [junit] Tests run: 2, Failures: 0, Errors: 0, Time elapsed: 0.016 sec
     [exec]     [junit] Tests run: 18, Failures: 0, Errors: 0, Time elapsed: 0.563 sec
     [exec]     [junit] Tests run: 1, Failures: 0, Errors: 0, Time elapsed: 0 sec
     [exec]     [junit] Tests run: 2, Failures: 0, Errors: 0, Time elapsed: 0 sec
     [exec]     [junit] java.util.regex.PatternSyntaxException: unmatched ) near index: 1
     [exec]     [junit] b)a
     [exec]     [junit]  ^
     [exec]     [junit] java.util.regex.PatternSyntaxException: unmatched ) near index: 4
     [exec]     [junit] bcde)a
     [exec]     [junit]     ^
     [exec]     [junit] java.util.regex.PatternSyntaxException: unmatched ) near index: 5
     [exec]     [junit] bbg())a
     [exec]     [junit]      ^
     [exec]     [junit] java.util.regex.PatternSyntaxException: unmatched ) near index: 7
     [exec]     [junit] cdb(?i))a
     [exec]     [junit]        ^
     [exec]     [junit] Tests run: 46, Failures: 0, Errors: 0, Time elapsed: 0.032 sec
     [exec]     [junit] Tests run: 3, Failures: 0, Errors: 0, Time elapsed: 0 sec
     [exec]     [junit] Tests run: 3, Failures: 0, Errors: 0, Time elapsed: 0 sec

     [exec] touch-failures-file:

     [exec] touch-errors-file:

     [exec] test:

     [exec] test:

     [exec] compile.java:
     [exec]      [echo] Compiling SECURITY classes

     [exec] build.jar:

     [exec] build:

     [exec] compile.tests:
     [exec]      [echo] Compiling SECURITY test support files
     [exec]      [echo] Compiling SECURITY api tests
     [exec]     [javac] Compiling 183 source files to C:\continuum-1.0.2\apps\continuum\working-directory\6\classlib\modules\security\bin\test\api
     [exec]     [javac] Note: Some input files use or override a deprecated API.
     [exec]     [javac] Note: Recompile with -Xlint:deprecation for details.
     [exec]     [javac] Note: Some input files use unchecked or unsafe operations.
     [exec]     [javac] Note: Recompile with -Xlint:unchecked for details.
     [exec]      [echo] Compiling SECURITY api injected tests
     [exec]     [javac] Compiling 60 source files to C:\continuum-1.0.2\apps\continuum\working-directory\6\classlib\modules\security\bin\test\api.injected
     [exec]     [javac] Note: Some input files use or override a deprecated API.
     [exec]     [javac] Note: Recompile with -Xlint:deprecation for details.
     [exec]     [javac] Note: Some input files use unchecked or unsafe operations.
     [exec]     [javac] Note: Recompile with -Xlint:unchecked for details.
     [exec]      [echo] Compiling SECURITY impl injected tests
     [exec]     [javac] Compiling 13 source files to C:\continuum-1.0.2\apps\continuum\working-directory\6\classlib\modules\security\bin\test\impl.injected
     [exec]     [javac] Note: C:\continuum-1.0.2\apps\continuum\working-directory\6\classlib\modules\security\src\test\impl\java.injected\java\security\Security_ImplTest.java uses or overrides a deprecated API.
     [exec]     [javac] Note: Recompile with -Xlint:deprecation for details.
     [exec]     [javac] Note: Some input files use unchecked or unsafe operations.
     [exec]     [javac] Note: Recompile with -Xlint:unchecked for details.
     [exec]      [echo] Compiling SECURITY impl tests
     [exec]     [javac] Compiling 66 source files to C:\continuum-1.0.2\apps\continuum\working-directory\6\classlib\modules\security\bin\test\impl
     [exec]     [javac] Note: C:\continuum-1.0.2\apps\continuum\working-directory\6\classlib\modules\security\src\test\impl\java\org\apache\harmony\security\tests\SystemScopeTest.java uses or overrides a deprecated API.
     [exec]     [javac] Note: Recompile with -Xlint:deprecation for details.
     [exec]     [javac] Note: Some input files use unchecked or unsafe operations.
     [exec]     [javac] Note: Recompile with -Xlint:unchecked for details.

     [exec] run.tests.api:
     [exec]      [echo] Running SECURITY api tests
     [exec]     [junit] Running tests.api.java.security.PrincipalTest
     [exec]     [junit] java version 1.5 (subset)
     [exec]     [junit] (c) Copyright 1991, 2006 The Apache Software Foundation or its licensors, as applicable.

     [exec]     [junit] Tests run: 3, Failures: 0, Errors: 0, Time elapsed: 0.125 sec
     [exec]     [junit] Tests run: 3, Failures: 0, Errors: 0, Time elapsed: 0.031 sec
     [exec]     [junit] Tests run: 1, Failures: 0, Errors: 0, Time elapsed: 0.047 sec
     [exec]     [junit] Tests run: 12, Failures: 0, Errors: 0, Time elapsed: 0.641 sec
     [exec]     [junit] Tests run: 3, Failures: 0, Errors: 0, Time elapsed: 0.016 sec
     [exec]     [junit] Tests run: 9, Failures: 0, Errors: 0, Time elapsed: 2.156 sec
     [exec]     [junit] Tests run: 11, Failures: 0, Errors: 0, Time elapsed: 0.031 sec
     [exec]     [junit] Tests run: 4, Failures: 0, Errors: 0, Time elapsed: 0.015 sec
     [exec]     [junit] Tests run: 6, Failures: 0, Errors: 0, Time elapsed: 0 sec
     [exec]     [junit] Tests run: 7, Failures: 0, Errors: 0, Time elapsed: 0 sec
     [exec]     [junit] Tests run: 6, Failures: 0, Errors: 0, Time elapsed: 0.016 sec
     [exec]     [junit] Tests run: 6, Failures: 0, Errors: 0, Time elapsed: 0 sec
     [exec]     [junit] Tests run: 26, Failures: 0, Errors: 0, Time elapsed: 0.031 sec
     [exec]     [junit] Tests run: 2, Failures: 0, Errors: 0, Time elapsed: 0 sec
     [exec]     [junit] Tests run: 9, Failures: 0, Errors: 0, Time elapsed: 0.016 sec
     [exec]     [junit] Tests run: 6, Failures: 0, Errors: 0, Time elapsed: 0 sec
     [exec]     [junit] Tests run: 17, Failures: 0, Errors: 0, Time elapsed: 0.015 sec
     [exec]     [junit] Tests run: 6, Failures: 0, Errors: 0, Time elapsed: 0 sec
     [exec]     [junit] Tests run: 15, Failures: 0, Errors: 0, Time elapsed: 0.015 sec
     [exec]     [junit] Tests run: 2, Failures: 0, Errors: 0, Time elapsed: 0 sec
     [exec]     [junit] Tests run: 9, Failures: 0, Errors: 0, Time elapsed: 0 sec
     [exec]     [junit] Tests run: 2, Failures: 0, Errors: 0, Time elapsed: 0 sec
     [exec]     [junit] Tests run: 15, Failures: 0, Errors: 0, Time elapsed: 0.063 sec
     [exec]     [junit] Tests run: 11, Failures: 0, Errors: 0, Time elapsed: 0 sec
     [exec]     [junit] Tests run: 7, Failures: 0, Errors: 0, Time elapsed: 0 sec
     [exec]     [junit] Tests run: 2, Failures: 0, Errors: 0, Time elapsed: 0 sec
     [exec]     [junit] Tests run: 9, Failures: 0, Errors: 0, Time elapsed: 0 sec
     [exec]     [junit] Tests run: 2, Failures: 0, Errors: 0, Time elapsed: 0 sec
     [exec]     [junit] Tests run: 9, Failures: 0, Errors: 0, Time elapsed: 0.015 sec
     [exec]     [junit] Tests run: 2, Failures: 0, Errors: 0, Time elapsed: 0 sec
     [exec]     [junit] Tests run: 3, Failures: 0, Errors: 0, Time elapsed: 0 sec
     [exec]     [junit] Tests run: 2, Failures: 0, Errors: 0, Time elapsed: 0 sec
     [exec]     [junit] Tests run: 1, Failures: 0, Errors: 0, Time elapsed: 0 sec
     [exec]     [junit] Tests run: 8, Failures: 0, Errors: 0, Time elapsed: 0 sec
     [exec]     [junit] Tests run: 3, Failures: 0, Errors: 0, Time elapsed: 0 sec
     [exec]     [junit] Tests run: 3, Failures: 0, Errors: 0, Time elapsed: 0 sec
     [exec]     [junit] Tests run: 2, Failures: 0, Errors: 0, Time elapsed: 0 sec
     [exec]     [junit] Tests run: 9, Failures: 0, Errors: 0, Time elapsed: 0 sec
     [exec]     [junit] Tests run: 8, Failures: 0, Errors: 0, Time elapsed: 0 sec
     [exec]     [junit] Tests run: 2, Failures: 0, Errors: 0, Time elapsed: 0.015 sec
     [exec]     [junit] Tests run: 9, Failures: 0, Errors: 0, Time elapsed: 0.016 sec
     [exec]     [junit] Tests run: 13, Failures: 0, Errors: 0, Time elapsed: 2.843 sec
     [exec]     [junit] Tests run: 12, Failures: 0, Errors: 0, Time elapsed: 0.031 sec
     [exec]     [junit] Tests run: 2, Failures: 0, Errors: 0, Time elapsed: 12.782 sec
     [exec]     [junit] Tests run: 9, Failures: 0, Errors: 0, Time elapsed: 38.328 sec
     [exec]     [junit] Tests run: 1, Failures: 0, Errors: 0, Time elapsed: 0.016 sec
     [exec]     [junit] Tests run: 6, Failures: 0, Errors: 0, Time elapsed: 0.015 sec
     [exec]     [junit] Tests run: 1, Failures: 0, Errors: 0, Time elapsed: 0 sec
     [exec]     [junit] Tests run: 2, Failures: 0, Errors: 0, Time elapsed: 0 sec
     [exec]     [junit] Tests run: 9, Failures: 0, Errors: 0, Time elapsed: 0 sec
     [exec]     [junit] Tests run: 2, Failures: 0, Errors: 0, Time elapsed: 0 sec
     [exec]     [junit] Tests run: 4, Failures: 0, Errors: 0, Time elapsed: 0.031 sec
     [exec]     [junit] Tests run: 1, Failures: 0, Errors: 0, Time elapsed: 0 sec
     [exec]     [junit] Tests run: 10, Failures: 0, Errors: 0, Time elapsed: 0.015 sec
     [exec]     [junit] Tests run: 11, Failures: 0, Errors: 0, Time elapsed: 0.109 sec
     [exec]     [junit] Tests run: 2, Failures: 0, Errors: 0, Time elapsed: 0 sec
     [exec]     [junit] Tests run: 9, Failures: 0, Errors: 0, Time elapsed: 0 sec
     [exec]     [junit] Tests run: 2, Failures: 0, Errors: 0, Time elapsed: 0 sec
     [exec]     [junit] Tests run: 3, Failures: 0, Errors: 0, Time elapsed: 0 sec
     [exec]     [junit] Tests run: 5, Failures: 0, Errors: 0, Time elapsed: 0 sec
     [exec]     [junit] Tests run: 1, Failures: 0, Errors: 0, Time elapsed: 0.015 sec
     [exec]     [junit] Tests run: 3, Failures: 0, Errors: 0, Time elapsed: 0 sec
     [exec]     [junit] Tests run: 4, Failures: 0, Errors: 0, Time elapsed: 0.016 sec
     [exec]     [junit] Tests run: 3, Failures: 0, Errors: 0, Time elapsed: 0.015 sec
     [exec]     [junit] Tests run: 3, Failures: 0, Errors: 0, Time elapsed: 0.015 sec
     [exec]     [junit] Tests run: 3, Failures: 0, Errors: 0, Time elapsed: 0 sec
     [exec]     [junit] Tests run: 1, Failures: 0, Errors: 0, Time elapsed: 0 sec
     [exec]     [junit] Tests run: 2, Failures: 0, Errors: 0, Time elapsed: 0 sec
     [exec]     [junit] Tests run: 3, Failures: 0, Errors: 0, Time elapsed: 0 sec
     [exec]     [junit] Tests run: 13, Failures: 0, Errors: 0, Time elapsed: 0.015 sec
     [exec]     [junit] Tests run: 6, Failures: 0, Errors: 0, Time elapsed: 0 sec
     [exec]     [junit] Tests run: 2, Failures: 0, Errors: 0, Time elapsed: 0 sec
     [exec]     [junit] Tests run: 9, Failures: 0, Errors: 0, Time elapsed: 0.016 sec
     [exec]     [junit] Tests run: 3, Failures: 0, Errors: 0, Time elapsed: 0 sec
     [exec]     [junit] Tests run: 13, Failures: 0, Errors: 0, Time elapsed: 0 sec
     [exec]     [junit] Tests run: 1, Failures: 0, Errors: 0, Time elapsed: 0 sec
     [exec]     [junit] Tests run: 1, Failures: 0, Errors: 0, Time elapsed: 0.016 sec
     [exec]     [junit] Tests run: 8, Failures: 0, Errors: 0, Time elapsed: 0.031 sec
     [exec]     [junit] Tests run: 2, Failures: 0, Errors: 0, Time elapsed: 0 sec
     [exec]     [junit] Tests run: 1, Failures: 0, Errors: 0, Time elapsed: 0 sec
     [exec]     [junit] Tests run: 6, Failures: 0, Errors: 0, Time elapsed: 0.015 sec
     [exec]     [junit] Tests run: 16, Failures: 0, Errors: 0, Time elapsed: 0.031 sec
     [exec]     [junit] Tests run: 2, Failures: 0, Errors: 0, Time elapsed: 0 sec
     [exec]     [junit] Tests run: 9, Failures: 0, Errors: 0, Time elapsed: 0 sec
     [exec]     [junit] Tests run: 1, Failures: 0, Errors: 0, Time elapsed: 0.032 sec
     [exec]     [junit] Tests run: 5, Failures: 0, Errors: 0, Time elapsed: 2.188 sec
     [exec]     [junit] Tests run: 7, Failures: 0, Errors: 0, Time elapsed: 0.016 sec
     [exec]     [junit] Tests run: 5, Failures: 0, Errors: 0, Time elapsed: 0.016 sec
     [exec]     [junit] Tests run: 2, Failures: 0, Errors: 0, Time elapsed: 0 sec
     [exec]     [junit] Tests run: 2, Failures: 0, Errors: 0, Time elapsed: 0 sec
     [exec]     [junit] Tests run: 3, Failures: 0, Errors: 0, Time elapsed: 0 sec
     [exec]     [junit] Tests run: 1, Failures: 0, Errors: 0, Time elapsed: 0 sec
     [exec]     [junit] Tests run: 1, Failures: 0, Errors: 0, Time elapsed: 0 sec
     [exec]     [junit] Tests run: 1, Failures: 0, Errors: 0, Time elapsed: 0 sec
     [exec]     [junit] Tests run: 1, Failures: 0, Errors: 0, Time elapsed: 0.016 sec
     [exec]     [junit] Tests run: 1, Failures: 0, Errors: 0, Time elapsed: 0 sec
     [exec]     [junit] Tests run: 1, Failures: 0, Errors: 0, Time elapsed: 0 sec
     [exec]     [junit] Tests run: 9, Failures: 0, Errors: 0, Time elapsed: 0 sec
     [exec]     [junit] Tests run: 4, Failures: 0, Errors: 0, Time elapsed: 0 sec
     [exec]     [junit] Tests run: 12, Failures: 0, Errors: 0, Time elapsed: 0 sec
     [exec]     [junit] Tests run: 3, Failures: 0, Errors: 0, Time elapsed: 0 sec
     [exec]     [junit] Tests run: 9, Failures: 0, Errors: 0, Time elapsed: 0 sec
     [exec]     [junit] Tests run: 1, Failures: 0, Errors: 0, Time elapsed: 0 sec
     [exec]     [junit] Tests run: 12, Failures: 0, Errors: 0, Time elapsed: 0 sec
     [exec]     [junit] Tests run: 12, Failures: 0, Errors: 0, Time elapsed: 0.015 sec
     [exec]     [junit] Tests run: 3, Failures: 0, Errors: 0, Time elapsed: 0 sec
     [exec]     [junit] Tests run: 1, Failures: 0, Errors: 0, Time elapsed: 0.016 sec
     [exec]     [junit] Tests run: 14, Failures: 0, Errors: 0, Time elapsed: 0.015 sec
     [exec]     [junit] Tests run: 1, Failures: 0, Errors: 0, Time elapsed: 0 sec
     [exec]     [junit] Tests run: 12, Failures: 0, Errors: 0, Time elapsed: 0 sec
     [exec]     [junit] Tests run: 9, Failures: 0, Errors: 0, Time elapsed: 0 sec
     [exec]     [junit] Tests run: 1, Failures: 0, Errors: 0, Time elapsed: 0.015 sec
     [exec]     [junit] Tests run: 1, Failures: 0, Errors: 0, Time elapsed: 0 sec
     [exec]     [junit] Tests run: 9, Failures: 0, Errors: 0, Time elapsed: 0 sec
     [exec]     [junit] Tests run: 2, Failures: 0, Errors: 0, Time elapsed: 0 sec
     [exec]     [junit] Tests run: 9, Failures: 0, Errors: 0, Time elapsed: 0 sec
     [exec]     [junit] Tests run: 3, Failures: 0, Errors: 0, Time elapsed: 0 sec
     [exec]     [junit] Tests run: 17, Failures: 0, Errors: 0, Time elapsed: 0.031 sec
     [exec]     [junit] Tests run: 6, Failures: 0, Errors: 0, Time elapsed: 0.016 sec
     [exec]     [junit] Tests run: 5, Failures: 0, Errors: 0, Time elapsed: 0.062 sec
     [exec]     [junit] Tests run: 7, Failures: 0, Errors: 0, Time elapsed: 0.093 sec
     [exec]     [junit] Tests run: 3, Failures: 0, Errors: 0, Time elapsed: 0.016 sec
     [exec]     [junit] Tests run: 3, Failures: 0, Errors: 0, Time elapsed: 0 sec
     [exec]     [junit] Tests run: 9, Failures: 0, Errors: 0, Time elapsed: 0.016 sec
     [exec]     [junit] Tests run: 12, Failures: 0, Errors: 0, Time elapsed: 0 sec
     [exec]     [junit] Tests run: 13, Failures: 0, Errors: 0, Time elapsed: 0.015 sec
     [exec]     [junit] Tests run: 12, Failures: 0, Errors: 0, Time elapsed: 0 sec
     [exec]     [junit] Tests run: 7, Failures: 0, Errors: 0, Time elapsed: 0.015 sec
     [exec]     [junit] Tests run: 7, Failures: 0, Errors: 0, Time elapsed: 0.015 sec
     [exec]     [junit] Tests run: 5, Failures: 0, Errors: 0, Time elapsed: 0 sec
     [exec]     [junit] Tests run: 11, Failures: 0, Errors: 0, Time elapsed: 0.015 sec
     [exec]     [junit] Tests run: 59, Failures: 0, Errors: 0, Time elapsed: 0.031 sec
     [exec]     [junit] Tests run: 10, Failures: 0, Errors: 0, Time elapsed: 0 sec
     [exec]     [junit] Tests run: 12, Failures: 0, Errors: 0, Time elapsed: 0.016 sec
     [exec]     [junit] Tests run: 1, Failures: 0, Errors: 0, Time elapsed: 0.016 sec
     [exec]     [junit] Tests run: 1, Failures: 0, Errors: 0, Time elapsed: 0 sec
     [exec]     [junit] Tests run: 3, Failures: 0, Errors: 0, Time elapsed: 0.016 sec
     [exec]     [junit] Tests run: 4, Failures: 0, Errors: 0, Time elapsed: 0 sec
     [exec]     [junit] Tests run: 5, Failures: 0, Errors: 0, Time elapsed: 0 sec
     [exec]     [junit] Tests run: 1, Failures: 0, Errors: 0, Time elapsed: 0 sec
     [exec]     [junit] Tests run: 1, Failures: 0, Errors: 0, Time elapsed: 0 sec
     [exec]     [junit] Tests run: 1, Failures: 0, Errors: 0, Time elapsed: 0 sec
     [exec]     [junit] Tests run: 1, Failures: 0, Errors: 0, Time elapsed: 0.016 sec
     [exec]     [junit] Tests run: 1, Failures: 0, Errors: 0, Time elapsed: 0.015 sec
     [exec]     [junit] Tests run: 1, Failures: 0, Errors: 0, Time elapsed: 0.016 sec
     [exec]     [junit] Tests run: 1, Failures: 0, Errors: 0, Time elapsed: 0.016 sec
     [exec]     [junit] Tests run: 1, Failures: 0, Errors: 0, Time elapsed: 0 sec
     [exec]     [junit] Tests run: 1, Failures: 0, Errors: 0, Time elapsed: 0 sec
     [exec]     [junit] Tests run: 4, Failures: 0, Errors: 0, Time elapsed: 0.015 sec
     [exec]     [junit] Tests run: 5, Failures: 0, Errors: 0, Time elapsed: 0.016 sec
     [exec]     [junit] Tests run: 5, Failures: 0, Errors: 0, Time elapsed: 0 sec
     [exec]     [junit] Tests run: 23, Failures: 0, Errors: 0, Time elapsed: 0 sec
     [exec]     [junit] Tests run: 13, Failures: 0, Errors: 0, Time elapsed: 0 sec
     [exec]     [junit] Tests run: 3, Failures: 0, Errors: 0, Time elapsed: 0 sec
     [exec]     [junit] Tests run: 10, Failures: 0, Errors: 0, Time elapsed: 0.016 sec
     [exec]     [junit] Tests run: 18, Failures: 0, Errors: 0, Time elapsed: 0.015 sec
     [exec]     [junit] Tests run: 1, Failures: 0, Errors: 0, Time elapsed: 5.047 sec
     [exec]     [junit] Tests run: 3, Failures: 0, Errors: 0, Time elapsed: 0 sec
     [exec]     [junit] Tests run: 9, Failures: 0, Errors: 0, Time elapsed: 0.016 sec
     [exec]     [junit] Tests run: 3, Failures: 0, Errors: 0, Time elapsed: 0 sec
     [exec]     [junit] Tests run: 4, Failures: 0, Errors: 0, Time elapsed: 0 sec
     [exec]     [junit] Tests run: 5, Failures: 0, Errors: 0, Time elapsed: 0 sec
     [exec]     [junit] Tests run: 19, Failures: 0, Errors: 0, Time elapsed: 0 sec
     [exec]     [junit] Tests run: 5, Failures: 0, Errors: 0, Time elapsed: 0 sec
     [exec]     [junit] Tests run: 24, Failures: 0, Errors: 0, Time elapsed: 0 sec
     [exec]     [junit] Tests run: 8, Failures: 0, Errors: 0, Time elapsed: 0.016 sec
     [exec]     [junit] Tests run: 11, Failures: 0, Errors: 0, Time elapsed: 0 sec
     [exec]     [junit] Tests run: 3, Failures: 0, Errors: 0, Time elapsed: 0 sec
     [exec]     [junit] Tests run: 4, Failures: 0, Errors: 0, Time elapsed: 0 sec
     [exec]     [junit] Tests run: 5, Failures: 0, Errors: 0, Time elapsed: 0 sec
     [exec]     [junit] Tests run: 3, Failures: 0, Errors: 0, Time elapsed: 0 sec
     [exec]     [junit] Tests run: 3, Failures: 0, Errors: 0, Time elapsed: 0 sec
     [exec]     [junit] Tests run: 3, Failures: 0, Errors: 0, Time elapsed: 0 sec
     [exec]     [junit] Tests run: 3, Failures: 0, Errors: 0, Time elapsed: 0 sec
     [exec]     [junit] Tests run: 3, Failures: 0, Errors: 0, Time elapsed: 0 sec
     [exec]     [junit] Tests run: 2, Failures: 0, Errors: 0, Time elapsed: 0 sec
     [exec]     [junit] Tests run: 13, Failures: 0, Errors: 0, Time elapsed: 0 sec
     [exec]     [junit] Tests run: 2, Failures: 0, Errors: 0, Time elapsed: 0.016 sec
     [exec]     [junit] Tests run: 1, Failures: 0, Errors: 0, Time elapsed: 0 sec
     [exec]     [junit] Tests run: 1, Failures: 0, Errors: 0, Time elapsed: 0 sec
     [exec]      [echo] Running SECURITY api.injected tests
     [exec]     [junit] Running javax.security.cert.serialization.CertificateParsingExceptionTest
     [exec]     [junit] java version 1.5 (subset)

     [exec]     [junit] (c) Copyright 1991, 2006 The Apache Software Foundation or its licensors, as applicable.
     [exec]     [junit] Tests run: 1, Failures: 0, Errors: 0, Time elapsed: 0.343 sec
     [exec]     [junit] Tests run: 4, Failures: 0, Errors: 0, Time elapsed: 0.016 sec
     [exec]     [junit] Tests run: 4, Failures: 0, Errors: 0, Time elapsed: 0.016 sec
     [exec]     [junit] Tests run: 23, Failures: 0, Errors: 0, Time elapsed: 0.031 sec
     [exec]     [junit] Tests run: 3, Failures: 0, Errors: 0, Time elapsed: 0.016 sec
     [exec]     [junit] Tests run: 5, Failures: 0, Errors: 0, Time elapsed: 0.015 sec
     [exec]     [junit] Tests run: 5, Failures: 0, Errors: 0, Time elapsed: 0 sec
     [exec]     [junit] Tests run: 11, Failures: 0, Errors: 0, Time elapsed: 0.015 sec
     [exec]     [junit] Tests run: 16, Failures: 0, Errors: 0, Time elapsed: 0.015 sec
     [exec]     [junit] Tests run: 3, Failures: 0, Errors: 0, Time elapsed: 0 sec
     [exec]     [junit] Tests run: 2, Failures: 0, Errors: 0, Time elapsed: 0.156 sec
     [exec]     [junit] Tests run: 2, Failures: 0, Errors: 0, Time elapsed: 0.093 sec
     [exec]     [junit] testSerialization03: java.io.NotSerializableException: Could not resolve cert path: java.security.cert.CertificateException: java.security.NoSuchAlgorithmException: CertificateFactory MyEncoding implementation not found
     [exec]     [junit] testSerialization04: java.lang.NullPointerException
     [exec]     [junit] Tests run: 4, Failures: 0, Errors: 0, Time elapsed: 0.062 sec
     [exec]     [junit] Tests run: 2, Failures: 0, Errors: 0, Time elapsed: 0.062 sec
     [exec]     [junit] Tests run: 2, Failures: 0, Errors: 0, Time elapsed: 0.046 sec
     [exec]     [junit] Tests run: 2, Failures: 0, Errors: 0, Time elapsed: 0.047 sec
     [exec]     [junit] Tests run: 2, Failures: 0, Errors: 0, Time elapsed: 0.062 sec
     [exec]     [junit] Tests run: 2, Failures: 0, Errors: 0, Time elapsed: 0.031 sec
     [exec]     [junit] Tests run: 2, Failures: 0, Errors: 0, Time elapsed: 0.046 sec
     [exec]     [junit] Tests run: 2, Failures: 0, Errors: 0, Time elapsed: 0.078 sec
     [exec]     [junit] testSerialization03: java.io.NotSerializableException: Could not resolve certificate: java.security.cert.CertificateException: java.security.NoSuchAlgorithmException: CertificateFactory DUMMY implementation not found
     [exec]     [junit] testSerialization04: java.lang.NullPointerException
     [exec]     [junit] Tests run: 4, Failures: 0, Errors: 0, Time elapsed: 0.015 sec
     [exec]     [junit] Tests run: 2, Failures: 0, Errors: 0, Time elapsed: 0.109 sec
     [exec]     [junit] Tests run: 2, Failures: 0, Errors: 0, Time elapsed: 0.047 sec
     [exec]     [junit] Tests run: 2, Failures: 0, Errors: 0, Time elapsed: 0 sec
     [exec]     [junit] Tests run: 2, Failures: 0, Errors: 0, Time elapsed: 0.016 sec
     [exec]     [junit] Tests run: 2, Failures: 0, Errors: 0, Time elapsed: 0 sec
     [exec]     [junit] Tests run: 2, Failures: 0, Errors: 0, Time elapsed: 0.047 sec
     [exec]     [junit] Tests run: 2, Failures: 0, Errors: 0, Time elapsed: 0.046 sec
     [exec]     [junit] Tests run: 2, Failures: 0, Errors: 0, Time elapsed: 0.109 sec
     [exec]     [junit] Tests run: 2, Failures: 0, Errors: 0, Time elapsed: 0.093 sec
     [exec]     [junit] Tests run: 3, Failures: 0, Errors: 0, Time elapsed: 0.016 sec
     [exec]     [junit] Tests run: 2, Failures: 0, Errors: 0, Time elapsed: 0.078 sec
     [exec]     [junit] Tests run: 2, Failures: 0, Errors: 0, Time elapsed: 0.078 sec
     [exec]     [junit] Tests run: 2, Failures: 0, Errors: 0, Time elapsed: 0.047 sec
     [exec]     [junit] Tests run: 2, Failures: 0, Errors: 0, Time elapsed: 0.078 sec
     [exec]     [junit] Tests run: 2, Failures: 0, Errors: 0, Time elapsed: 0.172 sec
     [exec]     [junit] Tests run: 2, Failures: 0, Errors: 0, Time elapsed: 0.109 sec
     [exec]     [junit] Tests run: 2, Failures: 0, Errors: 0, Time elapsed: 0.094 sec
     [exec]     [junit] Tests run: 2, Failures: 0, Errors: 0, Time elapsed: 0.031 sec
     [exec]     [junit] Tests run: 2, Failures: 0, Errors: 0, Time elapsed: 0.015 sec
     [exec]     [junit] Tests run: 2, Failures: 0, Errors: 0, Time elapsed: 0.016 sec
     [exec]     [junit] Tests run: 2, Failures: 0, Errors: 0, Time elapsed: 0.031 sec
     [exec]     [junit] Tests run: 2, Failures: 0, Errors: 0, Time elapsed: 0.047 sec
     [exec]     [junit] Tests run: 2, Failures: 0, Errors: 0, Time elapsed: 0.062 sec
     [exec]     [junit] Tests run: 2, Failures: 0, Errors: 0, Time elapsed: 0.016 sec
     [exec]     [junit] Tests run: 2, Failures: 0, Errors: 0, Time elapsed: 0.078 sec
     [exec]     [junit] Tests run: 2, Failures: 0, Errors: 0, Time elapsed: 0.234 sec
     [exec]     [junit] Tests run: 2, Failures: 0, Errors: 0, Time elapsed: 0 sec
     [exec]     [junit] Tests run: 2, Failures: 0, Errors: 0, Time elapsed: 0.031 sec
     [exec]     [junit] Tests run: 2, Failures: 0, Errors: 0, Time elapsed: 0.047 sec
     [exec]     [junit] Tests run: 2, Failures: 0, Errors: 0, Time elapsed: 0.016 sec
     [exec]     [junit] Tests run: 2, Failures: 0, Errors: 0, Time elapsed: 0.015 sec
     [exec]     [junit] Tests run: 2, Failures: 0, Errors: 0, Time elapsed: 0.047 sec
     [exec]     [junit] Tests run: 2, Failures: 0, Errors: 0, Time elapsed: 0.032 sec
     [exec]     [junit] Tests run: 2, Failures: 0, Errors: 0, Time elapsed: 0.031 sec
     [exec]     [junit] Tests run: 2, Failures: 0, Errors: 0, Time elapsed: 0.031 sec
     [exec]     [junit] Tests run: 2, Failures: 0, Errors: 0, Time elapsed: 0.031 sec
     [exec]     [junit] Tests run: 2, Failures: 0, Errors: 0, Time elapsed: 0.015 sec
     [exec]     [junit] Tests run: 2, Failures: 0, Errors: 0, Time elapsed: 0.016 sec

     [exec] touch-failures-file:

     [exec] touch-errors-file:

     [exec] run.tests.impl:
     [exec]      [echo] Running SECURITY impl tests
     [exec]     [junit] Running org.apache.harmony.security.tests.x509.PrivateKeyUsagePeriodTest
     [exec]     [junit] (c) Copyright 1991, 2006 The Apache Software Foundation or its licensors, as applicable.
     [exec]     [junit] java version 1.5 (subset)

     [exec]     [junit] Tests run: 3, Failures: 0, Errors: 0, Time elapsed: 0.125 sec
     [exec]     [junit] Tests run: 9, Failures: 0, Errors: 0, Time elapsed: 0.031 sec
     [exec]     [junit] Tests run: 4, Failures: 0, Errors: 0, Time elapsed: 0.031 sec
     [exec]     [junit] Tests run: 2, Failures: 0, Errors: 0, Time elapsed: 0.032 sec
     [exec]     [junit] Tests run: 2, Failures: 0, Errors: 0, Time elapsed: 0.063 sec
     [exec]     [junit] Tests run: 5, Failures: 0, Errors: 0, Time elapsed: 0 sec
     [exec]     [junit] Tests run: 2, Failures: 0, Errors: 0, Time elapsed: 0 sec
     [exec]     [junit] Tests run: 6, Failures: 0, Errors: 0, Time elapsed: 0.031 sec
     [exec]     [junit] Tests run: 3, Failures: 0, Errors: 0, Time elapsed: 0.204 sec
     [exec]     [junit] Tests run: 4, Failures: 0, Errors: 0, Time elapsed: 0.687 sec
     [exec]     [junit] Tests run: 2, Failures: 0, Errors: 0, Time elapsed: 0.016 sec
     [exec]     [junit] Tests run: 1, Failures: 0, Errors: 0, Time elapsed: 0 sec
     [exec]     [junit] Tests run: 3, Failures: 0, Errors: 0, Time elapsed: 0.015 sec
     [exec]     [junit] Tests run: 3, Failures: 0, Errors: 0, Time elapsed: 0 sec
     [exec]     [junit] Tests run: 3, Failures: 0, Errors: 0, Time elapsed: 0 sec
     [exec]     [junit] Tests run: 3, Failures: 0, Errors: 0, Time elapsed: 0.016 sec
     [exec]     [junit] Tests run: 5, Failures: 0, Errors: 0, Time elapsed: 0.015 sec
     [exec]     [junit] Tests run: 1, Failures: 0, Errors: 0, Time elapsed: 0 sec
     [exec]     [junit] Tests run: 1, Failures: 0, Errors: 0, Time elapsed: 0.141 sec
     [exec]     [junit] Tests run: 4, Failures: 0, Errors: 0, Time elapsed: 0.015 sec
     [exec]     [junit] Tests run: 6, Failures: 0, Errors: 0, Time elapsed: 0.031 sec
     [exec]     [junit] Tests run: 12, Failures: 0, Errors: 0, Time elapsed: 0 sec
     [exec]     [junit] Tests run: 2, Failures: 0, Errors: 0, Time elapsed: 0.015 sec
     [exec]     [junit] Tests run: 1, Failures: 0, Errors: 0, Time elapsed: 0.016 sec
     [exec]     [junit] Tests run: 1, Failures: 0, Errors: 0, Time elapsed: 0 sec
     [exec]     [junit] Tests run: 7, Failures: 0, Errors: 0, Time elapsed: 0.032 sec
     [exec]     [junit] Tests run: 3, Failures: 0, Errors: 0, Time elapsed: 0.391 sec
     [exec]     [junit] Tests run: 17, Failures: 0, Errors: 0, Time elapsed: 1.469 sec
     [exec]     [junit] Tests run: 3, Failures: 0, Errors: 0, Time elapsed: 0 sec
     [exec]     [junit] Tests run: 1, Failures: 0, Errors: 0, Time elapsed: 0.015 sec
     [exec]     [junit] Tests run: 2, Failures: 0, Errors: 0, Time elapsed: 0 sec
     [exec]     [junit] Tests run: 6, Failures: 0, Errors: 0, Time elapsed: 0 sec
     [exec]     [junit] Tests run: 1, Failures: 0, Errors: 0, Time elapsed: 0 sec
     [exec]     [junit] Tests run: 1, Failures: 0, Errors: 0, Time elapsed: 0 sec
     [exec]     [junit] Tests run: 2, Failures: 0, Errors: 0, Time elapsed: 0.016 sec
     [exec]     [junit] Tests run: 1, Failures: 0, Errors: 0, Time elapsed: 0 sec
     [exec]     [junit] Tests run: 9, Failures: 0, Errors: 0, Time elapsed: 0.016 sec
     [exec]     [junit] Tests run: 1, Failures: 0, Errors: 0, Time elapsed: 0 sec
     [exec]     [junit] Tests run: 3, Failures: 0, Errors: 0, Time elapsed: 0.016 sec
     [exec]     [junit] Tests run: 3, Failures: 0, Errors: 0, Time elapsed: 0.219 sec
     [exec]     [junit] Tests run: 9, Failures: 0, Errors: 0, Time elapsed: 0.046 sec
     [exec]     [junit] Tests run: 8, Failures: 0, Errors: 0, Time elapsed: 0.016 sec
     [exec]     [junit] Tests run: 15, Failures: 0, Errors: 0, Time elapsed: 0.047 sec
     [exec]     [junit] Tests run: 1, Failures: 0, Errors: 0, Time elapsed: 0.015 sec
     [exec]     [junit] Tests run: 7, Failures: 0, Errors: 0, Time elapsed: 0.016 sec
     [exec]     [junit] Tests run: 4, Failures: 0, Errors: 0, Time elapsed: 0 sec
     [exec]     [junit] Tests run: 5, Failures: 0, Errors: 0, Time elapsed: 0 sec
     [exec]     [junit] Tests run: 1, Failures: 0, Errors: 0, Time elapsed: 0 sec
     [exec]     [junit] Tests run: 1, Failures: 0, Errors: 0, Time elapsed: 0 sec
     [exec]     [junit] Tests run: 1, Failures: 0, Errors: 0, Time elapsed: 0 sec

     [exec]     [junit] USING: class org.apache.harmony.security.provider.cert.X509CRLImpl
     [exec]     [junit] getNonCriticalExtensionOIDs: [2.5.29.35, 2.5.29.20]
     [exec]     [junit] getCriticalExtensionOIDs: []
     [exec]     [junit] hasUnsupportedCriticalExtension: false
     [exec]     [junit] Tests run: 25, Failures: 0, Errors: 0, Time elapsed: 0.11 sec
     [exec]     [junit] Tests run: 8, Failures: 0, Errors: 0, Time elapsed: 2.469 sec
     [exec]     [junit] Tests run: 35, Failures: 0, Errors: 0, Time elapsed: 0.093 sec
     [exec]     [junit] Tests run: 33, Failures: 0, Errors: 0, Time elapsed: 0.125 sec
     [exec]     [junit] Tests run: 7, Failures: 0, Errors: 0, Time elapsed: 0.016 sec
     [exec]     [junit] Tests run: 2, Failures: 0, Errors: 0, Time elapsed: 0.016 sec
     [exec]     [junit] >> rcerts:[X509CRLEntryImpl: org.apache.harmony.security.x509.TBSCertList$RevokedCertificate@1ca81ca8, X509CRLEntryImpl: org.apache.harmony.security.x509.TBSCertList$RevokedCertificate@1b1c1b1c, X509CRLEntryImpl: org.apache.harmony.security.x509.TBSCertList$RevokedCertificate@18d018d0]
     [exec]     [junit] }>> X509CRLEntryImpl: org.apache.harmony.security.x509.TBSCertList$RevokedCertificate@1ca81ca8
     [exec]     [junit] }>> O=Cert Organization
     [exec]     [junit] }>> O=Cert Organization
     [exec]     [junit] }>> null
     [exec]     [junit] >> null
     [exec]     [junit] Tests run: 5, Failures: 0, Errors: 0, Time elapsed: 0 sec
     [exec]     [junit] Tests run: 1, Failures: 0, Errors: 0, Time elapsed: 0 sec
     [exec]     [junit] Tests run: 5, Failures: 0, Errors: 0, Time elapsed: 0 sec
     [exec]     [junit] Tests run: 1, Failures: 0, Errors: 0, Time elapsed: 0.016 sec
     [exec]     [junit] Tests run: 10, Failures: 0, Errors: 0, Time elapsed: 0.015 sec
     [exec]     [junit] Tests run: 2, Failures: 0, Errors: 0, Time elapsed: 0.016 sec
     [exec]     [junit] Tests run: 1, Failures: 0, Errors: 0, Time elapsed: 0.016 sec

     [exec]     [junit] ORAddress:
     [exec]     [junit] 0x30 0x02 0x30 0x00 

     [exec]     [junit] GeneralName:
     [exec]     [junit] 0xa3 0x02 0x30 0x00 

     [exec]     [junit] GeneralNames:
     [exec]     [junit] 0x30 0x04 0xa3 0x02 0x30 0x00 

     [exec]     [junit] Tests run: 1, Failures: 0, Errors: 0, Time elapsed: 0 sec
     [exec]     [junit] Tests run: 2, Failures: 0, Errors: 0, Time elapsed: 3.891 sec
     [exec]     [junit] Tests run: 1, Failures: 0, Errors: 0, Time elapsed: 0 sec
     [exec]      [echo] Running SECURITY impl injected tests
     [exec]     [junit] Running org.apache.harmony.security.DefaultPolicyScannerTest
     [exec]     [junit] java version 1.5 (subset)

     [exec]     [junit] (c) Copyright 1991, 2006 The Apache Software Foundation or its licensors, as applicable.
     [exec]     [junit] Tests run: 4, Failures: 0, Errors: 0, Time elapsed: 0.14 sec
     [exec]     [junit] Tests run: 5, Failures: 0, Errors: 0, Time elapsed: 0.047 sec
     [exec]     [junit] Tests run: 1, Failures: 0, Errors: 0, Time elapsed: 0.031 sec
     [exec]     [junit] Tests run: 4, Failures: 0, Errors: 0, Time elapsed: 0.11 sec
     [exec]     [junit] Tests run: 5, Failures: 0, Errors: 0, Time elapsed: 0.016 sec
     [exec]     [junit] Tests run: 2, Failures: 0, Errors: 0, Time elapsed: 0 sec
     [exec]     [junit] Tests run: 6, Failures: 0, Errors: 0, Time elapsed: 0.032 sec
     [exec]     [junit] Tests run: 6, Failures: 0, Errors: 0, Time elapsed: 0.016 sec
     [exec]     [junit] Tests run: 3, Failures: 0, Errors: 0, Time elapsed: 0.015 sec
     [exec]     [junit] Tests run: 16, Failures: 0, Errors: 0, Time elapsed: 0.063 sec
     [exec]     [junit] Tests run: 57, Failures: 0, Errors: 0, Time elapsed: 0.437 sec
     [exec]     [junit] Tests run: 7, Failures: 0, Errors: 0, Time elapsed: 0.016 sec
     [exec]     [junit] Tests run: 20, Failures: 0, Errors: 0, Time elapsed: 0.016 sec

     [exec] touch-failures-file:

     [exec] touch-errors-file:

     [exec] run.tests:

     [exec] test:

     [exec] compile.java:
     [exec]      [echo] Compiling SQL classes

     [exec] build.jar:

     [exec] build:

     [exec] compile.tests:
     [exec]      [echo] Compiling SQL tests
     [exec]     [javac] Compiling 72 source files to C:\continuum-1.0.2\apps\continuum\working-directory\6\classlib\modules\sql\bin\test
     [exec]     [javac] Note: Some input files use or override a deprecated API.
     [exec]     [javac] Note: Recompile with -Xlint:deprecation for details.
     [exec]     [javac] Note: Some input files use unchecked or unsafe operations.
     [exec]     [javac] Note: Recompile with -Xlint:unchecked for details.

     [exec] run.tests:
     [exec]     [junit] Running org.apache.harmony.sql.tests.javax.transaction.xa.XidTest
     [exec]     [junit] java version 1.5 (subset)
     [exec]     [junit] (c) Copyright 1991, 2006 The Apache Software Foundation or its licensors, as applicable.

     [exec]     [junit] Tests run: 6, Failures: 0, Errors: 0, Time elapsed: 0.125 sec
     [exec]     [junit] Tests run: 1, Failures: 0, Errors: 0, Time elapsed: 0.031 sec
     [exec]     [junit] Tests run: 6, Failures: 0, Errors: 0, Time elapsed: 0.031 sec
     [exec]     [junit] Tests run: 1, Failures: 0, Errors: 0, Time elapsed: 0.015 sec
     [exec]     [junit] Tests run: 11, Failures: 0, Errors: 0, Time elapsed: 0.25 sec
     [exec]     [junit] Testclassloader loaded class org.apache.harmony.sql.tests.java.sql.TestHelper_DriverManager
     [exec]     [junit] Tests run: 14, Failures: 0, Errors: 0, Time elapsed: 0.063 sec
     [exec]     [junit] Tests run: 3, Failures: 0, Errors: 0, Time elapsed: 0 sec
     [exec]     [junit] Tests run: 1, Failures: 0, Errors: 0, Time elapsed: 0.016 sec
     [exec]     [junit] Tests run: 1, Failures: 0, Errors: 0, Time elapsed: 0 sec
     [exec]     [junit] Tests run: 1, Failures: 0, Errors: 0, Time elapsed: 0.016 sec
     [exec]     [junit] Tests run: 9, Failures: 0, Errors: 0, Time elapsed: 0 sec
     [exec]     [junit] Tests run: 2, Failures: 0, Errors: 0, Time elapsed: 0 sec
     [exec]     [junit] Tests run: 6, Failures: 0, Errors: 0, Time elapsed: 0 sec
     [exec]     [junit] Tests run: 1, Failures: 0, Errors: 0, Time elapsed: 0 sec
     [exec]     [junit] Tests run: 12, Failures: 0, Errors: 0, Time elapsed: 0.016 sec
     [exec]     [junit] Tests run: 21, Failures: 0, Errors: 0, Time elapsed: 0.016 sec
     [exec]     [junit] Tests run: 1, Failures: 0, Errors: 0, Time elapsed: 0.015 sec
     [exec]     [junit] Tests run: 1, Failures: 0, Errors: 0, Time elapsed: 0.016 sec
     [exec]     [junit] Tests run: 3, Failures: 0, Errors: 0, Time elapsed: 0 sec
     [exec]     [junit] Tests run: 1, Failures: 0, Errors: 0, Time elapsed: 0 sec
     [exec]     [junit] Tests run: 1, Failures: 0, Errors: 0, Time elapsed: 0 sec
     [exec]     [junit] Tests run: 1, Failures: 0, Errors: 0, Time elapsed: 0 sec
     [exec]     [junit] Tests run: 1, Failures: 0, Errors: 0, Time elapsed: 0 sec
     [exec]     [junit] Tests run: 1, Failures: 0, Errors: 0, Time elapsed: 0 sec
     [exec]     [junit] Tests run: 1, Failures: 0, Errors: 0, Time elapsed: 0 sec
     [exec]     [junit] Tests run: 1, Failures: 0, Errors: 0, Time elapsed: 0 sec
     [exec]     [junit] Tests run: 1, Failures: 0, Errors: 0, Time elapsed: 0 sec
     [exec]     [junit] Tests run: 1, Failures: 0, Errors: 0, Time elapsed: 0 sec
     [exec]     [junit] Tests run: 1, Failures: 0, Errors: 0, Time elapsed: 0 sec
     [exec]     [junit] Tests run: 1, Failures: 0, Errors: 0, Time elapsed: 0 sec
     [exec]     [junit] Tests run: 1, Failures: 0, Errors: 0, Time elapsed: 0 sec
     [exec]     [junit] Tests run: 2, Failures: 0, Errors: 0, Time elapsed: 0.016 sec
     [exec]     [junit] Tests run: 2, Failures: 0, Errors: 0, Time elapsed: 0 sec
     [exec]     [junit] Tests run: 2, Failures: 0, Errors: 0, Time elapsed: 0 sec
     [exec]     [junit] Tests run: 5, Failures: 0, Errors: 0, Time elapsed: 0 sec
     [exec]     [junit] Tests run: 1, Failures: 0, Errors: 0, Time elapsed: 0 sec
     [exec]     [junit] Tests run: 1, Failures: 0, Errors: 0, Time elapsed: 0 sec

     [exec] touch-failures-file:

     [exec] touch-errors-file:

     [exec] test:

     [exec] compile.java:
     [exec]      [echo] Compiling SWING classes

     [exec] build.jar:

     [exec] build:

     [exec] compile.tests:
     [exec]      [echo] Compiling SWING tests

     [exec] run.tests:

     [exec] touch-failures-file:

     [exec] touch-errors-file:

     [exec] test:

     [exec] compile.java:
     [exec]      [echo] Compiling TEXT classes

     [exec] build.jar:

     [exec] build:

     [exec] copy.test.resources:
     [exec]      [copy] Copying 2 files to C:\continuum-1.0.2\apps\continuum\working-directory\6\classlib\modules\text\bin\test

     [exec] compile.tests:
     [exec]      [echo] Compiling TEXT tests
     [exec]     [javac] Compiling 26 source files to C:\continuum-1.0.2\apps\continuum\working-directory\6\classlib\modules\text\bin\test

     [exec] run.tests:
     [exec]     [junit] Running org.apache.harmony.text.tests.java.text.StringCharacterIteratorTest
     [exec]     [junit] (c) Copyright 1991, 2006 The Apache Software Foundation or its licensors, as applicable.
     [exec]     [junit] java version 1.5 (subset)

     [exec]     [junit] Tests run: 3, Failures: 0, Errors: 0, Time elapsed: 0.14 sec
     [exec]     [junit] Tests run: 10, Failures: 0, Errors: 0, Time elapsed: 0.031 sec
     [exec]     [junit] Tests run: 2, Failures: 0, Errors: 0, Time elapsed: 0.015 sec
     [exec]     [junit] Tests run: 23, Failures: 0, Errors: 0, Time elapsed: 0.063 sec
     [exec]     [junit] Tests run: 26, Failures: 0, Errors: 0, Time elapsed: 0.172 sec
     [exec]     [junit] Tests run: 18, Failures: 0, Errors: 0, Time elapsed: 0.172 sec
     [exec]     [junit] Tests run: 10, Failures: 0, Errors: 0, Time elapsed: 0.094 sec
     [exec]     [junit] Tests run: 6, Failures: 0, Errors: 0, Time elapsed: 0.078 sec
     [exec]     [junit] Tests run: 21, Failures: 0, Errors: 0, Time elapsed: 0.016 sec
     [exec]     [junit] Tests run: 16, Failures: 0, Errors: 0, Time elapsed: 0.812 sec
     [exec]     [junit] Tests run: 30, Failures: 0, Errors: 0, Time elapsed: 0.032 sec
     [exec]     [junit] Tests run: 12, Failures: 0, Errors: 0, Time elapsed: 0 sec
     [exec]     [junit] Tests run: 2, Failures: 0, Errors: 0, Time elapsed: 0 sec
     [exec]     [junit] Tests run: 2, Failures: 0, Errors: 0, Time elapsed: 0 sec
     [exec]     [junit] Tests run: 6, Failures: 0, Errors: 0, Time elapsed: 0.016 sec
     [exec]     [junit] Tests run: 2, Failures: 0, Errors: 0, Time elapsed: 0 sec
     [exec]     [junit] Tests run: 8, Failures: 0, Errors: 0, Time elapsed: 0.016 sec
     [exec]     [junit] Tests run: 16, Failures: 0, Errors: 0, Time elapsed: 0.875 sec
     [exec]     [junit] Tests run: 19, Failures: 0, Errors: 0, Time elapsed: 0.094 sec
     [exec]     [junit] Tests run: 22, Failures: 0, Errors: 0, Time elapsed: 0 sec

     [exec] touch-failures-file:

     [exec] touch-errors-file:

     [exec] test:

     [exec] compile.java:
     [exec]      [echo] Compiling TOOLS classes

     [exec] build.jar:

     [exec] build:

     [exec] compile.tests:
     [exec]      [echo] Compiling Tools tests
     [exec]     [javac] Compiling 1 source file to C:\continuum-1.0.2\apps\continuum\working-directory\6\classlib\modules\tools\bin\test

     [exec] run.tests:
     [exec]     [junit] Running org.apache.harmony.tests.tools.javac.MainTest
     [exec]     [junit] java version 1.5 (subset)

     [exec]     [junit] (c) Copyright 1991, 2006 The Apache Software Foundation or its licensors, as applicable.
     [exec]     [junit] Tests run: 1, Failures: 0, Errors: 0, Time elapsed: 0.109 sec

     [exec] touch-failures-file:

     [exec] touch-errors-file:

     [exec] test:

     [exec] compile.java:
     [exec]      [echo] Compiling X-NET classes

     [exec] build.jar:

     [exec] build:

     [exec] compile.tests:
     [exec]      [echo] Compiling X-NET tests
     [exec]     [javac] Compiling 32 source files to C:\continuum-1.0.2\apps\continuum\working-directory\6\classlib\modules\x-net\bin\test
     [exec]     [javac] Note: C:\continuum-1.0.2\apps\continuum\working-directory\6\classlib\modules\x-net\src\test\java\javax\net\ssl\KeyStoreBuilderParametersTest.java uses unchecked or unsafe operations.
     [exec]     [javac] Note: Recompile with -Xlint:unchecked for details.

     [exec] run.tests:
     [exec]     [junit] Running javax.net.ssl.serialization.SSLProtocolExceptionTest
     [exec]     [junit] (c) Copyright 1991, 2006 The Apache Software Foundation or its licensors, as applicable.
     [exec]     [junit] java version 1.5 (subset)

     [exec]     [junit] Tests run: 2, Failures: 0, Errors: 0, Time elapsed: 0.203 sec
     [exec]     [junit] Tests run: 2, Failures: 0, Errors: 0, Time elapsed: 4.187 sec
     [exec]     [junit] Tests run: 1, Failures: 0, Errors: 0, Time elapsed: 0.032 sec
     [exec]     [junit] Tests run: 5, Failures: 0, Errors: 0, Time elapsed: 0.031 sec
     [exec]     [junit] Tests run: 7, Failures: 0, Errors: 0, Time elapsed: 0.016 sec
     [exec]     [junit] Tests run: 5, Failures: 0, Errors: 0, Time elapsed: 0.141 sec
     [exec]     [junit] Tests run: 10, Failures: 0, Errors: 0, Time elapsed: 0 sec
     [exec]     [junit] Tests run: 3, Failures: 0, Errors: 0, Time elapsed: 0 sec
     [exec]     [junit] Tests run: 1, Failures: 0, Errors: 0, Time elapsed: 0 sec
     [exec]     [junit] Tests run: 13, Failures: 0, Errors: 0, Time elapsed: 0.016 sec
     [exec]     [junit] Tests run: 8, Failures: 0, Errors: 0, Time elapsed: 0 sec
     [exec]     [junit] Tests run: 2, Failures: 0, Errors: 0, Time elapsed: 0 sec
     [exec]     [junit] Tests run: 2, Failures: 0, Errors: 0, Time elapsed: 0 sec
     [exec]     [junit] Tests run: 2, Failures: 0, Errors: 0, Time elapsed: 0.015 sec
     [exec]     [junit] Tests run: 2, Failures: 0, Errors: 0, Time elapsed: 0 sec
     [exec]     [junit] Tests run: 2, Failures: 0, Errors: 0, Time elapsed: 0.015 sec
     [exec]     [junit] Tests run: 1, Failures: 0, Errors: 0, Time elapsed: 0 sec
     [exec]     [junit] Tests run: 4, Failures: 0, Errors: 0, Time elapsed: 0.031 sec
     [exec]     [junit] Tests run: 1, Failures: 0, Errors: 0, Time elapsed: 0 sec
     [exec]     [junit] Tests run: 1, Failures: 0, Errors: 0, Time elapsed: 0 sec
     [exec]     [junit] Tests run: 5, Failures: 0, Errors: 0, Time elapsed: 0.109 sec
     [exec]     [junit] Tests run: 2, Failures: 0, Errors: 0, Time elapsed: 0.016 sec
     [exec]     [junit] Tests run: 2, Failures: 0, Errors: 0, Time elapsed: 0.125 sec
     [exec]     [junit] Tests run: 2, Failures: 0, Errors: 0, Time elapsed: 0.047 sec
     [exec]     [junit] Tests run: 2, Failures: 0, Errors: 0, Time elapsed: 0.047 sec
     [exec]     [junit] Tests run: 2, Failures: 0, Errors: 0, Time elapsed: 0.031 sec
     [exec]     [junit] Tests run: 2, Failures: 0, Errors: 0, Time elapsed: 0.031 sec

     [exec] touch-failures-file:

     [exec] touch-errors-file:

     [exec] test:

     [exec] compile.java:
     [exec]      [echo] Compiling RMI classes

     [exec] build.jar:

     [exec] build:

     [exec] compile.tests:
     [exec]      [echo] Compiling RMI api tests
     [exec]     [javac] Compiling 6 source files to C:\continuum-1.0.2\apps\continuum\working-directory\6\classlib\modules\rmi\bin\test\api
     [exec]     [javac] Note: Some input files use unchecked or unsafe operations.
     [exec]     [javac] Note: Recompile with -Xlint:unchecked for details.

     [exec] run.tests.api:
     [exec]      [echo] Running RMI api tests
     [exec]     [junit] Running org.apache.harmony.rmi.RegistryTest
     [exec]     [junit] java version 1.5 (subset)
     [exec]     [junit] (c) Copyright 1991, 2006 The Apache Software Foundation or its licensors, as applicable.

     [exec]     [junit] Tests run: 2, Failures: 0, Errors: 0, Time elapsed: 0.171 sec
     [exec]     [junit] Registry on CUSTOM port (5555) created.
     [exec]     [junit] Test complete.
     [exec]     [junit] Registry on DEFAULT port (1099) created.
     [exec]     [junit] Test objects exported.
     [exec]     [junit] Testing valid Naming.bind names...
     [exec]     [junit] Done:
     [exec]     [junit]     //localhost:1099/RemoteObject1
     [exec]     [junit]     //localhost:1099/RemoteObject2
     [exec]     [junit]     //localhost:1099/RemoteObject3
     [exec]     [junit]     //localhost:1099/RemoteObject4
     [exec]     [junit]     //localhost:1099/RemoteObject5
     [exec]     [junit]     //localhost:1099/RemoteObject6
     [exec]     [junit]     //localhost:1099/RemoteObject7
     [exec]     [junit]     //localhost:1099/RemoteObject8
     [exec]     [junit] Checking bind complete.
     [exec]     [junit] Testing valid Naming.rebind names...
     [exec]     [junit] Done:
     [exec]     [junit]     //localhost:1099/RemoteObject1
     [exec]     [junit]     //localhost:1099/RemoteObject2
     [exec]     [junit]     //localhost:1099/RemoteObject3
     [exec]     [junit]     //localhost:1099/RemoteObject4
     [exec]     [junit]     //localhost:1099/RemoteObject5
     [exec]     [junit]     //localhost:1099/RemoteObject6
     [exec]     [junit]     //localhost:1099/RemoteObject7
     [exec]     [junit]     //localhost:1099/RemoteObject8
     [exec]     [junit] Checking rebind complete.
     [exec]     [junit] Testing valid Naming.lookup names...
     [exec]     [junit] Proxy[interf:[org.apache.harmony.rmi.test.MyRemoteInterface1, java.rmi.Remote], RemoteObjectInvocationHandler[UnicastRef[endpoint:[[169.254.25.129:4034]](remote), ObjID[65536, UID[19ae19ae:10c0f9acca1:-7ff8]]]]]
     [exec]     [junit] Proxy[interf:[org.apache.harmony.rmi.test.MyRemoteInterface1, java.rmi.Remote], RemoteObjectInvocationHandler[UnicastRef[endpoint:[[169.254.25.129:4035]](remote), ObjID[65537, UID[19ae19ae:10c0f9acca1:-7ff7]]]]]
     [exec]     [junit] Proxy[interf:[org.apache.harmony.rmi.test.MyRemoteInterface1, java.rmi.Remote], RemoteObjectInvocationHandler[UnicastRef[endpoint:[[169.254.25.129:4036]](remote), ObjID[65538, UID[19ae19ae:10c0f9acca1:-7ff6]]]]]
     [exec]     [junit] Proxy[interf:[org.apache.harmony.rmi.test.MyRemoteInterface1, java.rmi.Remote], RemoteObjectInvocationHandler[UnicastRef[endpoint:[[169.254.25.129:4037]](remote), ObjID[65539, UID[19ae19ae:10c0f9acca1:-7ff5]]]]]
     [exec]     [junit] Proxy[interf:[org.apache.harmony.rmi.test.MyRemoteInterface1, java.rmi.Remote], RemoteObjectInvocationHandler[UnicastRef[endpoint:[[169.254.25.129:4038]](remote), ObjID[65540, UID[19ae19ae:10c0f9acca1:-7ff4]]]]]
     [exec]     [junit] Proxy[interf:[org.apache.harmony.rmi.test.MyRemoteInterface1, java.rmi.Remote], RemoteObjectInvocationHandler[UnicastRef[endpoint:[[169.254.25.129:4039]](remote), ObjID[65541, UID[19ae19ae:10c0f9acca1:-7ff3]]]]]
     [exec]     [junit] Proxy[interf:[org.apache.harmony.rmi.test.MyRemoteInterface1, java.rmi.Remote], RemoteObjectInvocationHandler[UnicastRef[endpoint:[[169.254.25.129:4040]](remote), ObjID[65542, UID[19ae19ae:10c0f9acca1:-7ff2]]]]]
     [exec]     [junit] Proxy[interf:[org.apache.harmony.rmi.test.MyRemoteInterface1, java.rmi.Remote], RemoteObjectInvocationHandler[UnicastRef[endpoint:[[169.254.25.129:4041]](remote), ObjID[65543, UID[19ae19ae:10c0f9acca1:-7ff1]]]]]
     [exec]     [junit] Done:
     [exec]     [junit]     //hy1:1099/RemoteObject1
     [exec]     [junit]     //hy1:1099/RemoteObject2
     [exec]     [junit]     //hy1:1099/RemoteObject3
     [exec]     [junit]     //hy1:1099/RemoteObject4
     [exec]     [junit]     //hy1:1099/RemoteObject5
     [exec]     [junit]     //hy1:1099/RemoteObject6
     [exec]     [junit]     //hy1:1099/RemoteObject7
     [exec]     [junit]     //hy1:1099/RemoteObject8
     [exec]     [junit] Checking lookup complete.
     [exec]     [junit] Testing valid Naming.unbind names...
     [exec]     [junit] Done:
     [exec]     [junit] Checking unbind complete.
     [exec]     [junit] Registry on CUSTOM port (7777) created.
     [exec]     [junit] Testing valid Naming.bind names...
     [exec]     [junit] Done:
     [exec]     [junit]     //localhost:7777/RemoteObject1
     [exec]     [junit]     //localhost:7777/RemoteObject2
     [exec]     [junit]     //localhost:7777/RemoteObject3
     [exec]     [junit]     //localhost:7777/RemoteObject4
     [exec]     [junit]     //localhost:7777/RemoteObject5
     [exec]     [junit] Checking bind complete.
     [exec]     [junit] Testing valid Naming.rebind names...
     [exec]     [junit] Done:
     [exec]     [junit]     //127.0.0.1:7777/RemoteObject1
     [exec]     [junit]     //127.0.0.1:7777/RemoteObject2
     [exec]     [junit]     //127.0.0.1:7777/RemoteObject3
     [exec]     [junit]     //127.0.0.1:7777/RemoteObject4
     [exec]     [junit]     //127.0.0.1:7777/RemoteObject5
     [exec]     [junit] Checking rebind complete.
     [exec]     [junit] Testing valid Naming.lookup names...
     [exec]     [junit] Proxy[interf:[org.apache.harmony.rmi.test.MyRemoteInterface1, java.rmi.Remote], RemoteObjectInvocationHandler[UnicastRef[endpoint:[[169.254.25.129:4034]](remote), ObjID[65536, UID[19ae19ae:10c0f9acca1:-7ff8]]]]]
     [exec]     [junit] Proxy[interf:[org.apache.harmony.rmi.test.MyRemoteInterface1, java.rmi.Remote], RemoteObjectInvocationHandler[UnicastRef[endpoint:[[169.254.25.129:4035]](remote), ObjID[65537, UID[19ae19ae:10c0f9acca1:-7ff7]]]]]
     [exec]     [junit] Proxy[interf:[org.apache.harmony.rmi.test.MyRemoteInterface1, java.rmi.Remote], RemoteObjectInvocationHandler[UnicastRef[endpoint:[[169.254.25.129:4036]](remote), ObjID[65538, UID[19ae19ae:10c0f9acca1:-7ff6]]]]]
     [exec]     [junit] Proxy[interf:[org.apache.harmony.rmi.test.MyRemoteInterface1, java.rmi.Remote], RemoteObjectInvocationHandler[UnicastRef[endpoint:[[169.254.25.129:4037]](remote), ObjID[65539, UID[19ae19ae:10c0f9acca1:-7ff5]]]]]
     [exec]     [junit] Proxy[interf:[org.apache.harmony.rmi.test.MyRemoteInterface1, java.rmi.Remote], RemoteObjectInvocationHandler[UnicastRef[endpoint:[[169.254.25.129:4038]](remote), ObjID[65540, UID[19ae19ae:10c0f9acca1:-7ff4]]]]]
     [exec]     [junit] Done:
     [exec]     [junit]     //localhost:7777/RemoteObject1
     [exec]     [junit]     //localhost:7777/RemoteObject2
     [exec]     [junit]     //localhost:7777/RemoteObject3
     [exec]     [junit]     //localhost:7777/RemoteObject4
     [exec]     [junit]     //localhost:7777/RemoteObject5
     [exec]     [junit] Checking lookup complete.
     [exec]     [junit] Testing valid Naming.unbind names...
     [exec]     [junit] Done:
     [exec]     [junit] Checking unbind complete.
     [exec]     [junit] Unexporting objects
     [exec]     [junit] Unexporting MyRemoteObject1[UnicastServerRef[endpoint:[[169.254.25.129:4034]](local), ObjID[65536, UID[19ae19ae:10c0f9acca1:-7ff8]]]] ...
     [exec]     [junit] Done.

     [exec]     [junit] Unexporting MyRemoteObject1[UnicastServerRef[endpoint:[[169.254.25.129:4035]](local), ObjID[65537, UID[19ae19ae:10c0f9acca1:-7ff7]]]] ...
     [exec]     [junit] Done.

     [exec]     [junit] Unexporting MyRemoteObject1[UnicastServerRef[endpoint:[[169.254.25.129:4036]](local), ObjID[65538, UID[19ae19ae:10c0f9acca1:-7ff6]]]] ...
     [exec]     [junit] Done.

     [exec]     [junit] Unexporting MyRemoteObject1[UnicastServerRef[endpoint:[[169.254.25.129:4037]](local), ObjID[65539, UID[19ae19ae:10c0f9acca1:-7ff5]]]] ...
     [exec]     [junit] Done.

     [exec]     [junit] Unexporting MyRemoteObject1[UnicastServerRef[endpoint:[[169.254.25.129:4038]](local), ObjID[65540, UID[19ae19ae:10c0f9acca1:-7ff4]]]] ...
     [exec]     [junit] Done.

     [exec]     [junit] Unexporting MyRemoteObject1[UnicastServerRef[endpoint:[[169.254.25.129:4039]](local), ObjID[65541, UID[19ae19ae:10c0f9acca1:-7ff3]]]] ...
     [exec]     [junit] Done.

     [exec]     [junit] Unexporting MyRemoteObject1[UnicastServerRef[endpoint:[[169.254.25.129:4040]](local), ObjID[65542, UID[19ae19ae:10c0f9acca1:-7ff2]]]] ...
     [exec]     [junit] Done.

     [exec]     [junit] Unexporting MyRemoteObject1[UnicastServerRef[endpoint:[[169.254.25.129:4041]](local), ObjID[65543, UID[19ae19ae:10c0f9acca1:-7ff1]]]] ...
     [exec]     [junit] Done.
     [exec]     [junit] Test complete.

     [exec]     [junit] Tests run: 2, Failures: 0, Errors: 0, Time elapsed: 2.641 sec

     [exec] touch-failures-file:

     [exec] touch-errors-file:

     [exec] run.tests:

     [exec] test:

     [exec] call-modules-one:

     [exec] gen-report:
     [exec] [junitreport] Transform time: 22828ms
     [exec]      [echo] The test report is in C:\continuum-1.0.2\apps\continuum\working-directory\6\classlib\build\test_report\html\index.html

     [exec] check-test-result:

     [exec] test-all:

     [exec] BUILD SUCCESSFUL
     [exec] Total time: 7 minutes 15 seconds
     [echo] Tests.failed is set to ${tests.failed}

check-class-load-lists:

japi:

publish:
    [mkdir] Created dir: C:\publish\20060626-1002
     [copy] Copying 2 files to C:\publish\20060626-1002
    [mkdir] Created dir: C:\publish\20060626-1002\test
     [copy] Copying 1250 files to C:\publish\20060626-1002\test

publish-class-load-lists:
   [delete] Deleting 2 files from C:\continuum-1.0.2\apps\continuum\working-directory\6\classlib

publish-japi:

update-index:

test-result:

default:

BUILD SUCCESSFUL
Total time: 9 minutes 16 seconds

****************************************************************************




Mime
View raw message