harmony-commits mailing list archives

Site index · List index
Message view « Date » · « Thread »
Top « Date » · « Thread »
From Apache Harmony Build <nom...@hursley.ibm.com>
Subject [continuum] BUILD FAILURE: Classlib/win.ia32 Build/Test
Date Sun, 18 Jun 2006 20:03:21 GMT
Online report : http://ibmonly.hursley.ibm.com/continuum/win.ia32/servlet/continuum/target/ProjectBuild.vm/view/ProjectBuild/id/6/buildId/1254
Build statistics:
  State: Failed
  Previous State: Failed
  Started at: Sun, 18 Jun 2006 21:02:31 +0100
  Finished at: Sun, 18 Jun 2006 21:03:17 +0100
  Total time: 46s
  Build Trigger: Schedule
  Exit code: 1
  Building machine hostname: hy1
  Operating system : Windows XP(Service Pack 2)
  Java version : 1.5.0_06(Sun Microsystems Inc.)

Changes
                            classlib\modules\swing\META-INF\MANIFEST.MF
            classlib\modules\accessibility\META-INF\MANIFEST.MF
            classlib\modules\misc\META-INF\MANIFEST.MF
            classlib\modules\awt\META-INF\MANIFEST.MF
        
****************************************************************************
Output:
****************************************************************************
Buildfile: build.xml

build:
   [delete] Deleting directory C:\continuum-1.0.2\apps\continuum\working-directory\6\classlib\deploy
     [echo] Classlib revision is 415189
     [echo] Post process: ${is.post.process.host}
     [echo] JAPI: ${is.japi.ftp.host}
     [echo] Checking dependency downloads
     [exec] Buildfile: depends.xml

     [exec] download:
     [exec]      [echo] Fetching depends/jars/xalan-j_2.7.0/xalan.jar
     [exec]       [get] Getting: http://www.ibiblio.org/maven/xalan/jars/xalan-2.7.0.jar
     [exec]       [get] To: C:\continuum-1.0.2\apps\continuum\working-directory\6\classlib\depends\jars\xalan-j_2.7.0\xalan.jar
     [exec]       [get] local file date : Tue Nov 22 18:27:50 GMT 2005
     [exec]       [get] Not modified - so not downloaded

     [exec] remove-file-if-bad:
     [exec]      [echo] Checksum verified (true)
     [exec]      [echo] Fetching depends/jars/xerces_2.8.0/resolver.jar
     [exec]       [get] Getting: http://www.ibiblio.org/maven/xml-resolver/jars/xml-resolver-1.1.jar
     [exec]       [get] To: C:\continuum-1.0.2\apps\continuum\working-directory\6\classlib\depends\jars\xerces_2.8.0\resolver.jar
     [exec]       [get] local file date : Tue Nov 22 18:28:39 GMT 2005
     [exec]       [get] Not modified - so not downloaded

     [exec] remove-file-if-bad:
     [exec]      [echo] Checksum verified (true)
     [exec]      [echo] Fetching depends/jars/xerces_2.8.0/xercesImpl.jar
     [exec]       [get] Getting: http://www.ibiblio.org/maven/xerces/jars/xercesImpl-2.8.0.jar
     [exec]       [get] To: C:\continuum-1.0.2\apps\continuum\working-directory\6\classlib\depends\jars\xerces_2.8.0\xercesImpl.jar
     [exec]       [get] local file date : Mon Apr 10 21:32:05 BST 2006
     [exec]       [get] Not modified - so not downloaded

     [exec] remove-file-if-bad:
     [exec]      [echo] Checksum verified (true)
     [exec]      [echo] Fetching depends/jars/xerces_2.8.0/xml-apis.jar
     [exec]       [get] Getting: http://www.ibiblio.org/maven/xml-apis/jars/xml-apis-1.3.03.jar
     [exec]       [get] To: C:\continuum-1.0.2\apps\continuum\working-directory\6\classlib\depends\jars\xerces_2.8.0\xml-apis.jar
     [exec]       [get] local file date : Mon Apr 10 21:32:07 BST 2006
     [exec]       [get] Not modified - so not downloaded

     [exec] remove-file-if-bad:
     [exec]      [echo] Checksum verified (true)
     [exec]      [echo] Fetching depends/jars/junit_3.8.2/junit.jar
     [exec]       [get] Getting: http://www.ibiblio.org/maven2/junit/junit/3.8.2/junit-3.8.2.jar
     [exec]       [get] To: C:\continuum-1.0.2\apps\continuum\working-directory\6\classlib\depends\jars\junit_3.8.2\junit.jar
     [exec]       [get] local file date : Fri Mar 03 23:22:26 GMT 2006
     [exec]       [get] Not modified - so not downloaded

     [exec] remove-file-if-bad:
     [exec]      [echo] Checksum verified (true)
     [exec]      [echo] Fetching depends/jars/bcprov-jdk14-133/signed.bcprov.jar
     [exec]       [get] Getting: http://www.bouncycastle.org/download/bcprov-jdk14-133.jar
     [exec]       [get] To: C:\continuum-1.0.2\apps\continuum\working-directory\6\classlib\depends\jars\bcprov-jdk14-133\signed.bcprov.jar
     [exec]       [get] local file date : Wed May 03 23:41:28 BST 2006
     [exec]       [get] ....................................................
     [exec]       [get] ....................................................
     [exec]       [get] ....................................................
     [exec]       [get] .....
     [exec]       [get] last modified = Wed May 03 23:41:28 BST 2006

     [exec] remove-file-if-bad:
     [exec]      [echo] Checksum verified (true)
     [exec]      [echo] Fetching depends/jars/icu4j_3.4.4/icu4j_3_4_4.jar
     [exec]       [get] Getting: http://www.ibiblio.org/maven2/com/ibm/icu/icu4j/3.4.4/icu4j-3.4.4.jar
     [exec]       [get] To: C:\continuum-1.0.2\apps\continuum\working-directory\6\classlib\depends\jars\icu4j_3.4.4\icu4j_3_4_4.jar
     [exec]       [get] local file date : Fri May 26 11:48:04 BST 2006
     [exec]       [get] Not modified - so not downloaded

     [exec] remove-file-if-bad:
     [exec]      [echo] Checksum verified (true)
     [exec]      [echo] Fetching depends/jars/mx4j_3.0.1/mx4j.jar
     [exec]       [get] Getting: http://www.ibiblio.org/maven/mx4j/jars/mx4j-3.0.1.jar
     [exec]       [get] To: C:\continuum-1.0.2\apps\continuum\working-directory\6\classlib\depends\jars\mx4j_3.0.1\mx4j.jar
     [exec]       [get] local file date : Mon Aug 01 10:44:57 BST 2005
     [exec]       [get] Not modified - so not downloaded

     [exec] remove-file-if-bad:
     [exec]      [echo] Checksum verified (true)
     [exec]      [echo] Fetching depends/jars/mx4j_3.0.1/mx4j-remote.jar
     [exec]       [get] Getting: http://www.ibiblio.org/maven/mx4j/jars/mx4j-remote-3.0.1.jar
     [exec]       [get] To: C:\continuum-1.0.2\apps\continuum\working-directory\6\classlib\depends\jars\mx4j_3.0.1\mx4j-remote.jar
     [exec]       [get] local file date : Mon Aug 01 10:44:58 BST 2005
     [exec]       [get] Not modified - so not downloaded

     [exec] remove-file-if-bad:
     [exec]      [echo] Checksum verified (true)
     [exec]      [echo] Fetching depends/jars/ecj_3.2RC5/ecj_3.2RC5.jar
     [exec]       [get] Getting: http://download.eclipse.org/eclipse/downloads/drops/S-3.2RC5-200605191206/ecj.jar
     [exec]       [get] To: C:\continuum-1.0.2\apps\continuum\working-directory\6\classlib\depends\jars\ecj_3.2RC5\ecj_3.2RC5.jar
     [exec]       [get] local file date : Sat May 20 14:20:27 BST 2006
     [exec]       [get] Not modified - so not downloaded

     [exec] remove-file-if-bad:
     [exec]      [echo] Checksum verified (true)

     [exec] download-win:
     [exec]      [echo] Fetching depends/libs/win.IA32/msvcr71.dll
     [exec]       [get] Getting: http://www.dlldump.com/cgi-bin/testwrap/downloadcounts.cgi?rt=count&path=dllfiles/M/MSVCR71.dll
     [exec]       [get] To: C:\continuum-1.0.2\apps\continuum\working-directory\6\classlib\depends\libs\win.IA32\msvcr71.dll
     [exec]       [get] local file date : Wed Nov 03 00:53:55 GMT 2004
     [exec]       [get] Not modified - so not downloaded

     [exec] remove-file-if-bad:
     [exec]      [echo] Checksum verified (true)

     [exec] BUILD SUCCESSFUL
     [exec] Total time: 26 seconds
     [echo] Building with reference jdk/javac
     [exec] Buildfile: build.xml

     [exec] clean:

     [exec] clean-bin:

     [exec] clean:

     [exec] clean:

     [exec] clean:
     [exec]    [delete] C:\continuum-1.0.2\apps\continuum\working-directory\6\classlib\modules\applet\bin\test
not found.

     [exec] clean:

     [exec] clean.native.includes:
     [exec]    [delete] C:\continuum-1.0.2\apps\continuum\working-directory\6\classlib\deploy\include
not found.

     [exec] clean:

     [exec] clean:
     [exec]    [delete] C:\continuum-1.0.2\apps\continuum\working-directory\6\classlib\modules\awt\bin\test
not found.

     [exec] clean:

     [exec] clean:

     [exec] clean:

     [exec] clean:

     [exec] clean:

     [exec] clean:
     [exec]    [delete] Deleting 2 files from C:\continuum-1.0.2\apps\continuum\working-directory\6\classlib\build

     [exec] clean.native.includes:
     [exec]    [delete] C:\continuum-1.0.2\apps\continuum\working-directory\6\classlib\deploy\include
not found.
     [exec]    [delete] C:\continuum-1.0.2\apps\continuum\working-directory\6\classlib\deploy\jdk\include
not found.

     [exec] clean:

     [exec] clean:

     [exec] clean:
     [exec]    [delete] C:\continuum-1.0.2\apps\continuum\working-directory\6\classlib\modules\nio\bin\test
not found.

     [exec] clean:

     [exec] clean:

     [exec] clean:

     [exec] clean:

     [exec] clean:

     [exec] clean:

     [exec] clean:

     [exec] clean:

     [exec] clean:

     [exec] clean:
     [exec]    [delete] Deleting 64 files from C:\continuum-1.0.2\apps\continuum\working-directory\6\classlib\build
     [exec]    [delete] Deleted 32 directories from C:\continuum-1.0.2\apps\continuum\working-directory\6\classlib\build

     [exec] clean-layout:
     [exec]    [delete] C:\continuum-1.0.2\apps\continuum\working-directory\6\classlib\deploy\jdk
not found.

     [exec] clean:

     [exec] init:

     [exec] windows-properties:

     [exec] linux-properties:

     [exec] properties:

     [exec] make-clean:

     [exec] init:

     [exec] windows-properties:

     [exec] linux-properties:

     [exec] properties:

     [exec] copy-makefile-includes:
     [exec]     [mkdir] Created dir: C:\continuum-1.0.2\apps\continuum\working-directory\6\classlib\deploy\build
     [exec]      [copy] Copying 4 files to C:\continuum-1.0.2\apps\continuum\working-directory\6\classlib\deploy\build

     [exec]      [exec] Microsoft (R) Program Maintenance Utility Version 7.10.3077
     [exec]      [exec] Copyright (C) Microsoft Corporation.  All rights reserved.

     [exec]      [exec] 	cd auth
     [exec]      [exec] 	nmake /NOLOGO clean
     [exec]      [exec] 	del ..\..\shared\auth\auth_copyright.obj authwin32.obj *.res *.pdb
 C:\continuum-1.0.2\apps\continuum\working-directory\6\classlib\deploy\lib\hyauth.lib C:\continuum-1.0.2\apps\continuum\working-directory\6\classlib\deploy\lib\hyauth.exp
 ..\hyauth.dll ..\hyauth.pdb ..\hyauth.map    >nul 2>&1
     [exec]      [exec] 	cd ..
     [exec]      [exec] 	cd archive
     [exec]      [exec] 	nmake /NOLOGO clean
     [exec]      [exec] 	del ..\..\shared\archive\archive_copyright.obj ..\..\shared\archive\jclcrc32.obj
 ..\..\shared\archive\zip.obj ..\..\shared\archive\adler32.obj ..\..\shared\archive\inflater.obj
 ..\..\shared\archive\jarfile.obj ..\..\shared\archive\deflater.obj  ..\..\shared\archive\archiveglob.obj
*.res *.pdb  C:\continuum-1.0.2\apps\continuum\working-directory\6\classlib\deploy\lib\hyarchive.lib
C:\continuum-1.0.2\apps\continuum\working-directory\6\classlib\deploy\lib\hyarchive.exp  ..\hyarchive.dll
..\hyarchive.pdb ..\hyarchive.map    >nul 2>&1
     [exec]      [exec] 	cd ..
     [exec]      [exec] 	cd launcher
     [exec]      [exec] 	nmake /NOLOGO clean
     [exec]      [exec] 	nmake /NOLOGO -f makefile.javae clean
     [exec]      [exec] 	del ..\..\shared\launcher\launcher_copyright.obj ..\..\shared\launcher\cmain.obj
 ..\..\shared\launcher\main.obj ..\..\shared\launcher\strbuf.obj ..\..\shared\launcher\libhlp.obj
*.res *.pdb         ..\java.exe ..\java.pdb >nul 2>&1
     [exec]      [exec] 	nmake /NOLOGO -f makefile.javaw clean
     [exec]      [exec] 	del ..\..\shared\launcher\launcher_copyright.obj ..\..\shared\launcher\main.obj
 winmain.obj ..\..\shared\launcher\strbuf.obj ..\..\shared\launcher\libhlp.obj *.res *.pdb
        ..\javaw.exe ..\javaw.pdb >nul 2>&1
     [exec]      [exec] 	cd ..
     [exec]      [exec] 	cd common
     [exec]      [exec] 	nmake /NOLOGO clean
     [exec]      [exec] 	del ..\..\shared\common\libglob.obj ..\..\shared\common\iohelp.obj
 locklbl.obj lock386.obj  ..\..\shared\common\utf8decode.obj ..\..\shared\common\utf8encode.obj
*.res *.pdb  C:\continuum-1.0.2\apps\continuum\working-directory\6\classlib\deploy\lib\hycommon.lib
C:\continuum-1.0.2\apps\continuum\working-directory\6\classlib\deploy\lib\hycommon.exp   
    >nul 2>&1
     [exec]      [exec] 	cd ..
     [exec]      [exec] 	cd luni
     [exec]      [exec] 	nmake /NOLOGO clean
     [exec]      [exec] 	del ..\..\shared\luni\luni_copyright.obj ..\..\shared\luni\file.obj
procimpl.obj  ..\..\shared\luni\oos.obj  ..\..\shared\luni\nethelp.obj ..\..\shared\luni\floatbits.obj
 ..\..\shared\luni\ois.obj helpers.obj ..\..\shared\luni\math.obj  ..\..\shared\luni\luniglob.obj
..\..\shared\luni\proxy.obj ..\..\shared\luni\netif.obj  ..\..\shared\luni\cbigint.obj ..\..\shared\luni\dblparse.obj
..\..\shared\luni\fltparse.obj  ..\..\shared\luni\process.obj ..\..\shared\luni\bigint.obj
..\..\shared\luni\osc.obj  ..\..\shared\luni\socket.obj ..\..\shared\luni\inetadds.obj  ..\..\shared\luni\filedesc.obj
..\..\shared\luni\timezone.obj  OSFileSystemWin32.obj  ..\..\shared\luni\OSFileSystem.obj
OSMemoryWin32.obj OSMemory.obj  ..\..\shared\luni\OSNetworkSystem.obj OSNetworkSystemWin32.obj
*.res *.pdb  C:\continuum-1.0.2\apps\continuum\working-directory\6\classlib\deploy\lib\hyluni.lib
C:\continuum-1.0.2\apps\continuum\working-directory\6\classlib\deploy\lib\hyluni.exp  ..\hyluni.dll
..\hyluni.pdb ..\hyluni.map    >nul 2>&1
     [exec]      [exec] 	cd ..
     [exec]      [exec] 	cd text
     [exec]      [exec] 	nmake /NOLOGO clean
     [exec]      [exec] 	del text_copyright.obj ..\..\shared\text\BidiWrapper.obj *.res *.pdb
 C:\continuum-1.0.2\apps\continuum\working-directory\6\classlib\deploy\lib\hytext.lib C:\continuum-1.0.2\apps\continuum\working-directory\6\classlib\deploy\lib\hytext.exp
 ..\hytext.dll ..\hytext.pdb ..\hytext.map    >nul 2>&1
     [exec]      [exec] 	cd ..
     [exec]      [exec] 	cd vmi
     [exec]      [exec] 	nmake /NOLOGO clean
     [exec]      [exec] 	del ..\..\shared\vmi\vmi_copyright.obj ..\..\shared\vmi\vmi.obj *.res
*.pdb  C:\continuum-1.0.2\apps\continuum\working-directory\6\classlib\deploy\lib\vmi.lib C:\continuum-1.0.2\apps\continuum\working-directory\6\classlib\deploy\lib\vmi.exp
       >nul 2>&1
     [exec]      [exec] 	cd ..
     [exec]      [exec] 	cd fdlibm
     [exec]      [exec] 	nmake /NOLOGO clean
     [exec]      [exec] 	del *.obj dist\*.obj
     [exec]      [exec] The system cannot find the file specified.
     [exec]      [exec] 	del C:\continuum-1.0.2\apps\continuum\working-directory\6\classlib\deploy\lib\hyfdlibm.lib
     [exec]      [exec] The system cannot find the file specified.
     [exec]      [exec] 	del C:\continuum-1.0.2\apps\continuum\working-directory\6\classlib\deploy\lib\hyfdlibm.pdb
     [exec]      [exec] The system cannot find the file specified.
     [exec]      [exec] 	cd ..
     [exec]      [exec] 	cd sig
     [exec]      [exec] 	nmake /NOLOGO clean
     [exec]      [exec] 	del ..\..\shared\sig\hysig_copyright.obj hysigwin.obj *.res *.pdb
 C:\continuum-1.0.2\apps\continuum\working-directory\6\classlib\deploy\lib\hysig.lib C:\continuum-1.0.2\apps\continuum\working-directory\6\classlib\deploy\lib\hysig.exp
 ..\hysig.dll ..\hysig.pdb ..\hysig.map    >nul 2>&1
     [exec]      [exec] 	cd ..
     [exec]      [exec] 	cd pool
     [exec]      [exec] 	nmake /NOLOGO clean
     [exec]      [exec] 	del ..\..\shared\pool\pool.obj ..\..\shared\pool\pool_cap.obj *.res
*.pdb  C:\continuum-1.0.2\apps\continuum\working-directory\6\classlib\deploy\lib\hypool.lib
C:\continuum-1.0.2\apps\continuum\working-directory\6\classlib\deploy\lib\hypool.exp     
  >nul 2>&1
     [exec]      [exec] 	cd ..
     [exec]      [exec] 	cd port
     [exec]      [exec] 	nmake /NOLOGO clean
     [exec]      [exec] 	del ..\..\shared\port\port_copyright.obj hycpu.obj ..\..\shared\port\hyerror.obj
 hyerrorhelpers.obj ..\..\shared\port\hyexit.obj hyfile.obj hyfiletext.obj  ..\..\shared\port\hygp.obj
hyipcmutex.obj hymem.obj hymmap.obj  ..\..\shared\port\hynls.obj hynlshelpers.obj hyosdump.obj
..\..\shared\port\hyport.obj  ..\..\shared\port\hyportcontrol.obj hyportptb.obj hyshmem.obj
hyshsem.obj  hysignal.obj hysl.obj hysock.obj ..\..\shared\port\hystr.obj  ..\..\shared\port\hystrftime.obj
..\..\shared\port\hystsl.obj hysysinfo.obj hytime.obj  ..\..\shared\port\hytlshelpers.obj
hytty.obj hyvmem.obj *.res *.pdb  C:\continuum-1.0.2\apps\continuum\working-directory\6\classlib\deploy\lib\hyprt.lib
C:\continuum-1.0.2\apps\continuum\working-directory\6\classlib\deploy\lib\hyprt.exp  ..\hyprt.dll
..\hyprt.pdb ..\hyprt.map    >nul 2>&1
     [exec]      [exec] 	cd ..
     [exec]      [exec] 	cd thread
     [exec]      [exec] 	nmake /NOLOGO clean
     [exec]      [exec] 	del ..\..\shared\thread\thread_copyright.obj thrhelp.obj thrspinlock.obj
hythread.obj  ..\..\shared\thread\hythreadinspect.obj ..\..\shared\thread\rwmutex.obj thrdsup.obj
 ..\..\shared\thread\thrprof.obj *.res *.pdb  C:\continuum-1.0.2\apps\continuum\working-directory\6\classlib\deploy\lib\hythr.lib
C:\continuum-1.0.2\apps\continuum\working-directory\6\classlib\deploy\lib\hythr.exp  ..\hythr.dll
..\hythr.pdb ..\hythr.map    >nul 2>&1
     [exec]      [exec] 	cd ..
     [exec]      [exec] 	cd zip
     [exec]      [exec] 	nmake /NOLOGO clean
     [exec]      [exec] 	del ..\..\shared\zip\zcpool.obj ..\..\shared\zip\zipalloc.obj  ..\..\shared\zip\zipcache.obj
..\..\shared\zip\zipsup.obj *.res *.pdb  C:\continuum-1.0.2\apps\continuum\working-directory\6\classlib\deploy\lib\hyzip.lib
C:\continuum-1.0.2\apps\continuum\working-directory\6\classlib\deploy\lib\hyzip.exp      
 >nul 2>&1
     [exec]      [exec] 	cd ..
     [exec]      [exec] 	cd zlib
     [exec]      [exec] 	nmake /NOLOGO clean
     [exec]      [exec] 	del ..\..\shared\zlib\zlib_copyright.obj dist\adler32.obj dist\compress.obj
 dist\crc32.obj dist\deflate.obj dist\gzio.obj dist\infback.obj  dist\inffast.obj dist\inflate.obj
dist\inftrees.obj dist\trees.obj  dist\uncompr.obj dist\zutil.obj *.res *.pdb  C:\continuum-1.0.2\apps\continuum\working-directory\6\classlib\deploy\lib\hyzlib.lib
C:\continuum-1.0.2\apps\continuum\working-directory\6\classlib\deploy\lib\hyzlib.exp  ..\hyzlib.dll
..\hyzlib.pdb ..\hyzlib.map    >nul 2>&1
     [exec]      [exec] 	cd ..
     [exec]      [exec] 	cd prefs
     [exec]      [exec] 	nmake /NOLOGO clean
     [exec]      [exec] 	del prefs_copyright.obj PreferencesImpl.obj *.res *.pdb  C:\continuum-1.0.2\apps\continuum\working-directory\6\classlib\deploy\lib\hyprefs.lib
C:\continuum-1.0.2\apps\continuum\working-directory\6\classlib\deploy\lib\hyprefs.exp  ..\hyprefs.dll
..\hyprefs.pdb ..\hyprefs.map    >nul 2>&1
     [exec]      [exec] 	cd ..
     [exec]      [exec] 	cd vmls
     [exec]      [exec] 	nmake /NOLOGO clean
     [exec]      [exec] 	del ..\..\shared\vmls\vmls.obj *.res *.pdb  C:\continuum-1.0.2\apps\continuum\working-directory\6\classlib\deploy\lib\hyvmls.lib
C:\continuum-1.0.2\apps\continuum\working-directory\6\classlib\deploy\lib\hyvmls.exp     
  >nul 2>&1
     [exec]      [exec] 	cd ..

     [exec] clean-makefile-includes:
     [exec]    [delete] Deleting directory C:\continuum-1.0.2\apps\continuum\working-directory\6\classlib\deploy\build

     [exec] clean-includes:

     [exec] clean.native.includes:
     [exec]    [delete] C:\continuum-1.0.2\apps\continuum\working-directory\6\classlib\deploy\include
not found.

     [exec] clean.native.includes:
     [exec]    [delete] C:\continuum-1.0.2\apps\continuum\working-directory\6\classlib\deploy\include
not found.
     [exec]    [delete] C:\continuum-1.0.2\apps\continuum\working-directory\6\classlib\deploy\jdk\include
not found.

     [exec] clean-overlay-oss:

     [exec] clean-layout:
     [exec]    [delete] C:\continuum-1.0.2\apps\continuum\working-directory\6\classlib\deploy\jdk
not found.

     [exec] clean:

     [exec] build:
     [exec]      [echo] 
     [exec]      [echo] ========================================
     [exec]      [echo] Building Java component archives...
     [exec]      [echo] ========================================

     [exec] copy-resources:
     [exec]     [mkdir] Created dir: C:\continuum-1.0.2\apps\continuum\working-directory\6\classlib\build
     [exec]      [copy] Copying 2 files to C:\continuum-1.0.2\apps\continuum\working-directory\6\classlib\build

     [exec] prepare-depends:

     [exec] check:
     [exec]      [echo] Checking for depends/jars/xalan-j_2.7.0/xalan.jar
     [exec]      [echo] Checking for depends/jars/xerces_2.8.0/resolver.jar
     [exec]      [echo] Checking for depends/jars/xerces_2.8.0/xercesImpl.jar
     [exec]      [echo] Checking for depends/jars/xerces_2.8.0/xml-apis.jar
     [exec]      [echo] Checking for depends/jars/junit_3.8.2/junit.jar
     [exec]      [echo] Checking for depends/jars/bcprov-jdk14-133/signed.bcprov.jar
     [exec]      [echo] Checking for depends/jars/icu4j_3.4.4/icu4j_3_4_4.jar
     [exec]      [echo] Checking for depends/jars/mx4j_3.0.1/mx4j.jar
     [exec]      [echo] Checking for depends/jars/mx4j_3.0.1/mx4j-remote.jar

     [exec] create-unsigned-bcprov-jar:

     [exec] check-win:
     [exec]      [echo] Checking for depends/libs/win.IA32/msvcr71.dll

     [exec] compile:
     [exec]     [javac] Compiling 2892 source files to C:\continuum-1.0.2\apps\continuum\working-directory\6\classlib\build


     [exec]     [javac] The system is out of resources.
     [exec]     [javac] Consult the following stack trace for details.
     [exec]     [javac] java.lang.OutOfMemoryError: Java heap space

     [exec] BUILD FAILED
     [exec] C:\continuum-1.0.2\apps\continuum\working-directory\6\classlib\make\build.xml:46:
The following error occurred while executing this line:
     [exec] C:\continuum-1.0.2\apps\continuum\working-directory\6\classlib\make\build-java.xml:83:
Compile failed; see the compiler error output for details.

     [exec] Total time: 13 seconds

copy-depends:
     [echo] Copying VME to C:\continuum-1.0.2\apps\continuum\working-directory\6/classlib/deploy/jdk/jre
     [copy] Copying 44 files to C:\continuum-1.0.2\apps\continuum\working-directory\6\classlib\deploy\jdk\jre\bin\default

run-tests:
     [exec] Buildfile: build-test.xml

     [exec] clean:

     [exec] copy-test-resources:
     [exec]     [mkdir] Created dir: C:\continuum-1.0.2\apps\continuum\working-directory\6\classlib\build\tests
     [exec]      [copy] Copying 64 files to C:\continuum-1.0.2\apps\continuum\working-directory\6\classlib\build\tests

     [exec] check-support-jars:

     [exec] check:
     [exec]      [echo] Checking for depends/jars/xalan-j_2.7.0/xalan.jar
     [exec]      [echo] Checking for depends/jars/xerces_2.8.0/resolver.jar
     [exec]      [echo] Checking for depends/jars/xerces_2.8.0/xercesImpl.jar
     [exec]      [echo] Checking for depends/jars/xerces_2.8.0/xml-apis.jar
     [exec]      [echo] Checking for depends/jars/junit_3.8.2/junit.jar
     [exec]      [echo] Checking for depends/jars/bcprov-jdk14-133/signed.bcprov.jar
     [exec]      [echo] Checking for depends/jars/icu4j_3.4.4/icu4j_3_4_4.jar
     [exec]      [echo] Checking for depends/jars/mx4j_3.0.1/mx4j.jar
     [exec]      [echo] Checking for depends/jars/mx4j_3.0.1/mx4j-remote.jar

     [exec] create-unsigned-bcprov-jar:

     [exec] check-win:
     [exec]      [echo] Checking for depends/libs/win.IA32/msvcr71.dll

     [exec] compile-support:
     [exec]     [javac] Compiling 53 source files to C:\continuum-1.0.2\apps\continuum\working-directory\6\classlib\build\tests

     [exec] BUILD FAILED
     [exec] C:\continuum-1.0.2\apps\continuum\working-directory\6\classlib\make\build-test.xml:211:
C:\continuum-1.0.2\apps\continuum\working-directory\6\classlib\deploy\jdk\jre\lib\boot not
found.

     [exec] Total time: 1 second
     [echo] Tests.failed is set to ${tests.failed}

check-class-load-lists:

japi:

publish:
    [mkdir] Created dir: C:\publish\20060618-2102
    [mkdir] Created dir: C:\publish\20060618-2102\test

BUILD FAILED
C:\continuum-1.0.2\apps\continuum\working-directory\6\build.xml:341: C:\continuum-1.0.2\apps\continuum\working-directory\6\classlib\build\test_report\html
not found.

Total time: 45 seconds

****************************************************************************




Mime
View raw message