harmony-commits mailing list archives

Site index · List index
Message view « Date » · « Thread »
Top « Date » · « Thread »
From Apache Harmony Build <nom...@hursley.ibm.com>
Subject [continuum] BUILD FAILURE: Classlib/win.ia32 Build/Test
Date Sun, 25 Jun 2006 12:04:19 GMT
Online report : http://ibmonly.hursley.ibm.com/continuum/win.ia32/servlet/continuum/target/ProjectBuild.vm/view/ProjectBuild/id/6/buildId/1411
Build statistics:
  State: Failed
  Previous State: Failed
  Started at: Sun, 25 Jun 2006 13:04:08 +0100
  Finished at: Sun, 25 Jun 2006 13:04:17 +0100
  Total time: 8s
  Build Trigger: Schedule
  Exit code: 1
  Building machine hostname: hy1
  Operating system : Windows XP(Service Pack 2)
  Java version : 1.5.0_06(Sun Microsystems Inc.)

Changes
                            classlib\modules\security\src\main\java\common\java\security\Provider.java
            classlib\modules\security\src\main\java\common\org\apache\harmony\security\utils\TwoKeyHashMap.java
            classlib\modules\luni\src\main\java\java\lang\Void.java
            classlib\modules\luni\src\main\java\java\lang\Override.java
            classlib\modules\luni\src\main\java\java\lang\Boolean.java
            classlib\modules\luni\src\main\java\java\lang\SuppressWarnings.java
            classlib\modules\luni\src\main\java\java\lang\Short.java
            classlib\modules\luni\src\main\java\java\lang\Long.java
            classlib\modules\luni\src\main\java\java\lang\Byte.java
            classlib\modules\luni\src\main\java\java\lang\Float.java
            classlib\modules\luni\src\main\java\java\lang\Double.java
            classlib\modules\luni\src\main\java\java\lang\Deprecated.java
            classlib\modules\luni\src\main\java\java\lang\Enum.java
            classlib\modules\luni\src\main\java\java\lang\ThreadLocal.java
            classlib\modules\luni\src\main\java\java\lang\Integer.java
            classlib\modules\luni\src\main\java\java\lang\Character.java
            classlib\native-src\win.IA32\launcher\makefile.javae
            classlib\native-src\win.IA32\launcher\makefile.javaw
        
****************************************************************************
Output:
****************************************************************************
Buildfile: build.xml

build:
   [delete] Deleting directory C:\continuum-1.0.2\apps\continuum\working-directory\6\classlib\deploy
     [echo] Classlib revision is 417013
     [echo] Post process: ${is.post.process.host}
     [echo] JAPI: ${is.japi.ftp.host}
     [echo] Building with reference jdk/javac
     [exec] Buildfile: build.xml

     [exec] clean:

     [exec] clean-bin:

     [exec] call-modules-all:

     [exec] clean:

     [exec] clean:

     [exec] clean:

     [exec] clean:

     [exec] clean.native.includes:
     [exec]    [delete] C:\continuum-1.0.2\apps\continuum\working-directory\6\classlib\deploy\include
not found.

     [exec] clean:

     [exec] clean:

     [exec] clean:

     [exec] clean:

     [exec] clean:

     [exec] clean:

     [exec] clean:

     [exec] clean:

     [exec] clean.native.includes:
     [exec]    [delete] C:\continuum-1.0.2\apps\continuum\working-directory\6\classlib\deploy\include
not found.
     [exec]    [delete] C:\continuum-1.0.2\apps\continuum\working-directory\6\classlib\deploy\jdk\include
not found.

     [exec] clean:

     [exec] clean:

     [exec] clean:
     [exec]    [delete] C:\continuum-1.0.2\apps\continuum\working-directory\6\classlib\modules\nio\bin\test
not found.

     [exec] clean:

     [exec] clean:

     [exec] clean:

     [exec] clean:

     [exec] clean:

     [exec] clean:

     [exec] clean:

     [exec] clean:

     [exec] clean:

     [exec] clean:

     [exec] clean:

     [exec] call-modules-one:
     [exec]    [delete] Deleting 64 files from C:\continuum-1.0.2\apps\continuum\working-directory\6\classlib\build
     [exec]    [delete] Deleted 24 directories from C:\continuum-1.0.2\apps\continuum\working-directory\6\classlib\build

     [exec] clean-layout:
     [exec]    [delete] C:\continuum-1.0.2\apps\continuum\working-directory\6\classlib\deploy\jdk
not found.

     [exec] clean:

     [exec] init:

     [exec] windows-properties:

     [exec] linux-properties:

     [exec] properties:

     [exec] make-clean:

     [exec] init:

     [exec] windows-properties:

     [exec] linux-properties:

     [exec] properties:

     [exec] copy-makefile-includes:
     [exec]     [mkdir] Created dir: C:\continuum-1.0.2\apps\continuum\working-directory\6\classlib\deploy\build\make
     [exec]      [copy] Copying 4 files to C:\continuum-1.0.2\apps\continuum\working-directory\6\classlib\deploy\build\make

     [exec]      [exec] Microsoft (R) Program Maintenance Utility Version 7.10.3077
     [exec]      [exec] Copyright (C) Microsoft Corporation.  All rights reserved.

     [exec]      [exec] 	cd auth
     [exec]      [exec] 	nmake /NOLOGO clean
     [exec]      [exec] 	del ..\..\shared\auth\auth_copyright.obj authwin32.obj *.res *.pdb
 C:\continuum-1.0.2\apps\continuum\working-directory\6\classlib\deploy\lib\hyauth.lib C:\continuum-1.0.2\apps\continuum\working-directory\6\classlib\deploy\lib\hyauth.exp
 ..\hyauth.dll ..\hyauth.pdb ..\hyauth.map    >nul 2>&1
     [exec]      [exec] 	cd ..
     [exec]      [exec] 	cd archive
     [exec]      [exec] 	nmake /NOLOGO clean
     [exec]      [exec] 	del ..\..\shared\archive\archive_copyright.obj ..\..\shared\archive\jclcrc32.obj
 ..\..\shared\archive\zip.obj ..\..\shared\archive\adler32.obj ..\..\shared\archive\inflater.obj
 ..\..\shared\archive\jarfile.obj ..\..\shared\archive\deflater.obj  ..\..\shared\archive\archiveglob.obj
*.res *.pdb  C:\continuum-1.0.2\apps\continuum\working-directory\6\classlib\deploy\lib\hyarchive.lib
C:\continuum-1.0.2\apps\continuum\working-directory\6\classlib\deploy\lib\hyarchive.exp  ..\hyarchive.dll
..\hyarchive.pdb ..\hyarchive.map    >nul 2>&1
     [exec]      [exec] 	cd ..
     [exec]      [exec] 	cd launcher
     [exec]      [exec] 	nmake /NOLOGO clean
     [exec]      [exec] 	nmake /NOLOGO -f makefile.javae clean
     [exec]      [exec] makefile.javae(32) : fatal error U1052: file 'C:\continuum-1.0.2\apps\continuum\working-directory\6\classlib\deploy\build\rules.mak'
not found
     [exec]      [exec] Stop.
     [exec]      [exec] NMAKE : fatal error U1077: '"C:\Program Files\Microsoft Visual Studio
.NET 2003\VC7\BIN\nmake.exe"' : return code '0x2'
     [exec]      [exec] Stop.
     [exec]      [exec] NMAKE : fatal error U1077: '"C:\Program Files\Microsoft Visual Studio
.NET 2003\VC7\BIN\nmake.exe"' : return code '0x2'
     [exec]      [exec] Stop.

     [exec] BUILD FAILED
     [exec] C:\continuum-1.0.2\apps\continuum\working-directory\6\classlib\build.xml:126:
The following error occurred while executing this line:
     [exec] C:\continuum-1.0.2\apps\continuum\working-directory\6\classlib\native-src\build.xml:136:
exec returned: 2

     [exec] Total time: 3 seconds

copy-depends:
     [echo] Copying VME to C:\continuum-1.0.2\apps\continuum\working-directory\6/classlib/deploy/jdk/jre
     [copy] Copying 44 files to C:\continuum-1.0.2\apps\continuum\working-directory\6\classlib\deploy\jdk\jre\bin\default

run-tests:
     [exec] Buildfile: build.xml

     [exec] test:
     [exec]      [echo] 
     [exec]      [echo] ========================================
     [exec]      [echo] Testing class libraries...
     [exec]      [echo] ========================================

     [exec] clean:

     [exec] copy-test-resources:
     [exec]     [mkdir] Created dir: C:\continuum-1.0.2\apps\continuum\working-directory\6\classlib\build\tests
     [exec]      [copy] Copying 64 files to C:\continuum-1.0.2\apps\continuum\working-directory\6\classlib\build\tests

     [exec] check-support-jars:

     [exec] check:
     [exec]      [echo] Checking for depends/jars/xalan-j_2.7.0/xalan.jar
     [exec]      [echo] Checking for depends/jars/xerces_2.8.0/resolver.jar
     [exec]      [echo] Checking for depends/jars/xerces_2.8.0/xercesImpl.jar
     [exec]      [echo] Checking for depends/jars/xerces_2.8.0/xml-apis.jar
     [exec]      [echo] Checking for depends/jars/junit_3.8.2/junit.jar
     [exec]      [echo] Checking for depends/jars/bcprov-jdk14-133/signed.bcprov.jar
     [exec]      [echo] Checking for depends/jars/icu4j_3.4.4/icu4j_3_4_4.jar
     [exec]      [echo] Checking for depends/jars/mx4j_3.0.1/mx4j.jar
     [exec]      [echo] Checking for depends/jars/mx4j_3.0.1/mx4j-remote.jar
     [exec]      [echo] Checking for depends/jars/ecj_3.2RC5/ecj_3.2RC5.jar

     [exec] create-unsigned-bcprov-jar:

     [exec] check-win:
     [exec]      [echo] Checking for depends/libs/win.IA32/msvcr71.dll

     [exec] compile-support:
     [exec]     [javac] Compiling 53 source files to C:\continuum-1.0.2\apps\continuum\working-directory\6\classlib\build\tests

     [exec] BUILD FAILED
     [exec] C:\continuum-1.0.2\apps\continuum\working-directory\6\classlib\build.xml:105:
The following error occurred while executing this line:
     [exec] C:\continuum-1.0.2\apps\continuum\working-directory\6\classlib\make\build-test.xml:70:
C:\continuum-1.0.2\apps\continuum\working-directory\6\classlib\deploy\jdk\jre\lib\boot not
found.

     [exec] Total time: 1 second
     [echo] Tests.failed is set to ${tests.failed}

check-class-load-lists:

japi:

publish:
    [mkdir] Created dir: C:\publish\20060625-1304
    [mkdir] Created dir: C:\publish\20060625-1304\test

BUILD FAILED
C:\continuum-1.0.2\apps\continuum\working-directory\6\build.xml:342: C:\continuum-1.0.2\apps\continuum\working-directory\6\classlib\build\test_report\html
not found.

Total time: 8 seconds

****************************************************************************




Mime
View raw message