harmony-commits mailing list archives

Site index · List index
Message view « Date » · « Thread »
Top « Date » · « Thread »
From Apache Harmony Build <nom...@hursley.ibm.com>
Subject [continuum] BUILD FAILURE: Classlib/win.ia32 Build/Test
Date Fri, 26 May 2006 09:01:23 GMT
Online report : http://ibmonly.hursley.ibm.com/continuum/win.ia32/servlet/continuum/target/ProjectBuild.vm/view/ProjectBuild/id/6/buildId/1129
Build statistics:
  State: Failed
  Previous State: Failed
  Started at: Fri, 26 May 2006 10:01:02 +0100
  Finished at: Fri, 26 May 2006 10:01:21 +0100
  Total time: 18s
  Build Trigger: Schedule
  Exit code: 1
  Building machine hostname: hy1
  Operating system : Windows XP(Service Pack 2)
  Java version : 1.5.0_06(Sun Microsystems Inc.)

Changes
                            classlib\modules\text\src\test\java\org\apache\harmony\text\tests\java\text\SimpleDateFormatTest.java
            classlib\modules\text\src\main\java\java\text\SimpleDateFormat.java
        
****************************************************************************
Output:
****************************************************************************
Buildfile: build.xml

build:
   [delete] Deleting directory C:\continuum-1.0.2\apps\continuum\working-directory\6\classlib\deploy
     [echo] Classlib revision is 409595
     [echo] Post process: ${is.post.process.host}
     [echo] JAPI: ${is.japi.ftp.host}
     [echo] Building with reference jdk/javac
     [exec] Buildfile: build.xml

     [exec] clean:

     [exec] clean-bin:
     [exec]    [delete] Deleting 65 files from C:\continuum-1.0.2\apps\continuum\working-directory\6\classlib\build
     [exec]    [delete] Deleted 25 directories from C:\continuum-1.0.2\apps\continuum\working-directory\6\classlib\build

     [exec] clean:

     [exec] clean:

     [exec] clean:

     [exec] clean:

     [exec] clean:

     [exec] clean:

     [exec] clean:

     [exec] clean:

     [exec] clean:

     [exec] clean:

     [exec] clean:

     [exec] clean:

     [exec] clean:

     [exec] clean:

     [exec] clean:

     [exec] clean:

     [exec] clean:

     [exec] clean:

     [exec] clean:

     [exec] clean:

     [exec] clean:

     [exec] clean:

     [exec] clean-layout:
     [exec]    [delete] C:\continuum-1.0.2\apps\continuum\working-directory\6\classlib\deploy
not found.

     [exec] clean:

     [exec] init:

     [exec] windows-properties:

     [exec] linux-properties:

     [exec] properties:

     [exec] clean-overlay-oss:

     [exec] make-clean:

     [exec]      [exec] Microsoft (R) Program Maintenance Utility Version 7.10.3077
     [exec]      [exec] Copyright (C) Microsoft Corporation.  All rights reserved.

     [exec]      [exec] 	cd auth
     [exec]      [exec] 	nmake /NOLOGO clean
     [exec]      [exec] 	del ..\..\shared\auth\auth_copyright.obj authwin32.obj *.res *.pdb
 ..\lib\hyauth.lib ..\lib\hyauth.exp ..\lib\hyauth.map  ..\hyauth.dll  >nul 2>&1
     [exec]      [exec] 	cd ..
     [exec]      [exec] 	cd archive
     [exec]      [exec] 	nmake /NOLOGO clean
     [exec]      [exec] 	del ..\..\shared\archive\archive_copyright.obj ..\..\shared\archive\jclcrc32.obj
 ..\..\shared\archive\zip.obj ..\..\shared\archive\adler32.obj ..\..\shared\archive\inflater.obj
 ..\..\shared\archive\jarfile.obj ..\..\shared\archive\deflater.obj  ..\..\shared\archive\archiveglob.obj
*.res *.pdb  ..\lib\hyarchive.lib ..\lib\hyarchive.exp ..\lib\hyarchive.map  ..\hyarchive.dll
 >nul 2>&1
     [exec]      [exec] 	cd ..
     [exec]      [exec] 	cd launcher
     [exec]      [exec] 	nmake /NOLOGO clean
     [exec]      [exec] 	nmake /NOLOGO -f makefile.javae clean
     [exec]      [exec] 	del ..\..\shared\launcher\launcher_copyright.obj ..\..\shared\launcher\cmain.obj
 ..\..\shared\launcher\main.obj ..\..\shared\launcher\strbuf.obj ..\..\shared\launcher\libhlp.obj
*.res *.pdb       ..\java.exe >nul 2>&1
     [exec]      [exec] 	nmake /NOLOGO -f makefile.javaw clean
     [exec]      [exec] 	del ..\..\shared\launcher\launcher_copyright.obj ..\..\shared\launcher\main.obj
 winmain.obj ..\..\shared\launcher\strbuf.obj ..\..\shared\launcher\libhlp.obj *.res *.pdb
      ..\javaw.exe >nul 2>&1
     [exec]      [exec] 	cd ..
     [exec]      [exec] 	cd common
     [exec]      [exec] 	nmake /NOLOGO clean
     [exec]      [exec] 	del ..\..\shared\common\libglob.obj ..\..\shared\common\iohelp.obj
 locklbl.obj lock386.obj  ..\..\shared\common\utf8decode.obj ..\..\shared\common\utf8encode.obj
*.res *.pdb  ..\lib\hycommon.lib ..\lib\hycommon.exp ..\lib\hycommon.map    >nul 2>&1
     [exec]      [exec] 	cd ..
     [exec]      [exec] 	cd luni
     [exec]      [exec] 	nmake /NOLOGO clean
     [exec]      [exec] 	del ..\..\shared\luni\luni_copyright.obj ..\..\shared\luni\file.obj
procimpl.obj  ..\..\shared\luni\oos.obj  ..\..\shared\luni\nethelp.obj ..\..\shared\luni\floatbits.obj
 ..\..\shared\luni\ois.obj helpers.obj ..\..\shared\luni\math.obj  ..\..\shared\luni\luniglob.obj
..\..\shared\luni\proxy.obj ..\..\shared\luni\netif.obj  ..\..\shared\luni\cbigint.obj ..\..\shared\luni\dblparse.obj
..\..\shared\luni\fltparse.obj  ..\..\shared\luni\process.obj ..\..\shared\luni\bigint.obj
..\..\shared\luni\osc.obj  ..\..\shared\luni\socket.obj ..\..\shared\luni\inetadds.obj  ..\..\shared\luni\filedesc.obj
..\..\shared\luni\timezone.obj  OSFileSystemWin32.obj  ..\..\shared\luni\OSFileSystem.obj
OSMemoryWin32.obj OSMemory.obj  ..\..\shared\luni\OSNetworkSystem.obj OSNetworkSystemWin32.obj
*.res *.pdb  ..\lib\hyluni.lib ..\lib\hyluni.exp ..\lib\hyluni.map  ..\hyluni.dll  >nul
2>&1
     [exec]      [exec] 	cd ..
     [exec]      [exec] 	cd text
     [exec]      [exec] 	nmake /NOLOGO clean
     [exec]      [exec] 	del text_copyright.obj ..\..\shared\text\BidiWrapper.obj *.res *.pdb
 ..\lib\hytext.lib ..\lib\hytext.exp ..\lib\hytext.map  ..\hytext.dll  >nul 2>&1
     [exec]      [exec] 	cd ..
     [exec]      [exec] 	cd vmi
     [exec]      [exec] 	nmake /NOLOGO clean
     [exec]      [exec] 	del ..\..\shared\vmi\vmi_copyright.obj ..\..\shared\vmi\vmi.obj *.res
*.pdb  ..\lib\vmi.lib ..\lib\vmi.exp ..\lib\vmi.map    >nul 2>&1
     [exec]      [exec] 	cd ..
     [exec]      [exec] 	cd fdlibm
     [exec]      [exec] 	nmake /NOLOGO clean
     [exec]      [exec] 	del *.obj dist\*.obj
     [exec]      [exec] The system cannot find the file specified.
     [exec]      [exec] 	del ..\lib\..\lib\hyfdlibm.lib
     [exec]      [exec] Could Not Find C:\continuum-1.0.2\apps\continuum\working-directory\6\classlib\native-src\win.IA32\lib\hyfdlibm.lib
     [exec]      [exec] 	del ..\lib\hyfdlibm.pdb
     [exec]      [exec] Could Not Find C:\continuum-1.0.2\apps\continuum\working-directory\6\classlib\native-src\win.IA32\lib\hyfdlibm.pdb
     [exec]      [exec] 	cd ..
     [exec]      [exec] 	cd sig
     [exec]      [exec] 	nmake /NOLOGO clean
     [exec]      [exec] 	del ..\..\shared\sig\hysig_copyright.obj hysigwin.obj *.res *.pdb
 ..\lib\hysig.lib ..\lib\hysig.exp ..\lib\hysig.map  ..\hysig.dll  >nul 2>&1
     [exec]      [exec] 	cd ..
     [exec]      [exec] 	cd pool
     [exec]      [exec] 	nmake /NOLOGO clean
     [exec]      [exec] 	del ..\..\shared\pool\pool.obj ..\..\shared\pool\pool_cap.obj *.res
*.pdb  ..\lib\hypool.lib ..\lib\hypool.exp ..\lib\hypool.map    >nul 2>&1
     [exec]      [exec] 	cd ..
     [exec]      [exec] 	cd port
     [exec]      [exec] 	nmake /NOLOGO clean
     [exec]      [exec] 	del ..\..\shared\port\port_copyright.obj hycpu.obj ..\..\shared\port\hyerror.obj
 hyerrorhelpers.obj ..\..\shared\port\hyexit.obj hyfile.obj hyfiletext.obj  ..\..\shared\port\hygp.obj
hyipcmutex.obj hymem.obj hymmap.obj  ..\..\shared\port\hynls.obj hynlshelpers.obj hyosdump.obj
..\..\shared\port\hyport.obj  ..\..\shared\port\hyportcontrol.obj hyportptb.obj hyshmem.obj
hyshsem.obj  hysignal.obj hysl.obj hysock.obj ..\..\shared\port\hystr.obj  ..\..\shared\port\hystrftime.obj
..\..\shared\port\hystsl.obj hysysinfo.obj hytime.obj  ..\..\shared\port\hytlshelpers.obj
hytty.obj hyvmem.obj *.res *.pdb  ..\lib\hyprt.lib ..\lib\hyprt.exp ..\lib\hyprt.map  ..\hyprt.dll
 >nul 2>&1
     [exec]      [exec] 	cd ..
     [exec]      [exec] 	cd thread
     [exec]      [exec] 	nmake /NOLOGO clean
     [exec]      [exec] 	del ..\..\shared\thread\thread_copyright.obj thrhelp.obj thrspinlock.obj
hythread.obj  ..\..\shared\thread\hythreadinspect.obj ..\..\shared\thread\rwmutex.obj thrdsup.obj
 ..\..\shared\thread\thrprof.obj *.res *.pdb  ..\lib\hythr.lib ..\lib\hythr.exp ..\lib\hythr.map
 ..\hythr.dll  >nul 2>&1
     [exec]      [exec] 	cd ..
     [exec]      [exec] 	cd zip
     [exec]      [exec] 	nmake /NOLOGO clean
     [exec]      [exec] 	del ..\..\shared\zip\zcpool.obj ..\..\shared\zip\zipalloc.obj  ..\..\shared\zip\zipcache.obj
..\..\shared\zip\zipsup.obj *.res *.pdb  ..\lib\hyzip.lib ..\lib\hyzip.exp ..\lib\hyzip.map
   >nul 2>&1
     [exec]      [exec] 	cd ..
     [exec]      [exec] 	cd zlib
     [exec]      [exec] 	nmake /NOLOGO clean
     [exec]      [exec] 	del ..\..\shared\zlib\zlib_copyright.obj dist\adler32.obj dist\compress.obj
 dist\crc32.obj dist\deflate.obj dist\gzio.obj dist\infback.obj  dist\inffast.obj dist\inflate.obj
dist\inftrees.obj dist\trees.obj  dist\uncompr.obj dist\zutil.obj *.res *.pdb  ..\lib\hyzlib.lib
..\lib\hyzlib.exp ..\lib\hyzlib.map  ..\hyzlib.dll  >nul 2>&1
     [exec]      [exec] 	cd ..
     [exec]      [exec] 	cd prefs
     [exec]      [exec] 	nmake /NOLOGO clean
     [exec]      [exec] 	del prefs_copyright.obj PreferencesImpl.obj *.res *.pdb  ..\lib\hyprefs.lib
..\lib\hyprefs.exp ..\lib\hyprefs.map  ..\hyprefs.dll  >nul 2>&1
     [exec]      [exec] 	cd ..
     [exec]      [exec] 	cd vmls
     [exec]      [exec] 	nmake /NOLOGO clean
     [exec]      [exec] 	del ..\..\shared\vmls\vmls.obj *.res *.pdb  ..\lib\hyvmls.lib ..\lib\hyvmls.exp
..\lib\hyvmls.map    >nul 2>&1
     [exec]      [exec] 	cd ..

     [exec] clean-layout:
     [exec]    [delete] C:\continuum-1.0.2\apps\continuum\working-directory\6\classlib\deploy
not found.

     [exec] clean:

     [exec] build:
     [exec]      [echo] 
     [exec]      [echo] ========================================
     [exec]      [echo] Building Java component archives...
     [exec]      [echo] ========================================

     [exec] copy-resources:
     [exec]     [mkdir] Created dir: C:\continuum-1.0.2\apps\continuum\working-directory\6\classlib\build
     [exec]      [copy] Copying 2 files to C:\continuum-1.0.2\apps\continuum\working-directory\6\classlib\build

     [exec] prepare-depends:

     [exec] check:
     [exec]      [echo] Checking for depends/jars/xalan-j_2.6.0/xalan.jar
     [exec]      [echo] Checking for depends/jars/xerces_2.6.2/resolver.jar
     [exec]      [echo] Checking for depends/jars/xerces_2.6.2/xercesImpl.jar
     [exec]      [echo] Checking for depends/jars/xerces_2.6.2/xml-apis.jar
     [exec]      [echo] Checking for depends/jars/junit_3.8.1/junit.jar
     [exec]      [echo] Checking for depends/jars/bcprov-jdk14-133/signed.bcprov.jar

     [exec] BUILD FAILED
     [exec] C:\continuum-1.0.2\apps\continuum\working-directory\6\classlib\make\build.xml:39:
The following error occurred while executing this line:
     [exec] C:\continuum-1.0.2\apps\continuum\working-directory\6\classlib\make\build-java.xml:203:
The following error occurred while executing this line:
     [exec] C:\continuum-1.0.2\apps\continuum\working-directory\6\classlib\make\depends.xml:43:
The following error occurred while executing this line:
     [exec] C:\continuum-1.0.2\apps\continuum\working-directory\6\classlib\make\depends.xml:148:
...

     [exec] Missing dependency.  The jar from:

     [exec]   http://www.bouncycastle.org/download/bcprov-jdk14-133.jar

     [exec] should be downloaded to:

     [exec]   depends/jars/bcprov-jdk14-133/signed.bcprov.jar

     [exec] Run "ant -f make/depends.xml download" to automatically fetch
     [exec] dependencies.  Note: Some of Harmony's dependencies are licensed under
     [exec] terms other than the ASLv2.

     [exec] Total time: 13 seconds

copy-depends:
     [echo] Copying VME to C:\continuum-1.0.2\apps\continuum\working-directory\6/classlib/deploy
     [copy] Copying 44 files to C:\continuum-1.0.2\apps\continuum\working-directory\6\classlib\deploy\jre\bin\default

run-tests:
     [exec] Buildfile: build-test.xml

     [exec] clean:

     [exec] copy-test-resources:
     [exec]     [mkdir] Created dir: C:\continuum-1.0.2\apps\continuum\working-directory\6\classlib\build\tests
     [exec]      [copy] Copying 63 files to C:\continuum-1.0.2\apps\continuum\working-directory\6\classlib\build\tests

     [exec] check-support-jars:

     [exec] check:
     [exec]      [echo] Checking for depends/jars/xalan-j_2.6.0/xalan.jar
     [exec]      [echo] Checking for depends/jars/xerces_2.6.2/resolver.jar
     [exec]      [echo] Checking for depends/jars/xerces_2.6.2/xercesImpl.jar
     [exec]      [echo] Checking for depends/jars/xerces_2.6.2/xml-apis.jar
     [exec]      [echo] Checking for depends/jars/junit_3.8.1/junit.jar
     [exec]      [echo] Checking for depends/jars/bcprov-jdk14-133/signed.bcprov.jar

     [exec] BUILD FAILED
     [exec] C:\continuum-1.0.2\apps\continuum\working-directory\6\classlib\make\build-test.xml:255:
The following error occurred while executing this line:
     [exec] C:\continuum-1.0.2\apps\continuum\working-directory\6\classlib\make\depends.xml:43:
The following error occurred while executing this line:
     [exec] C:\continuum-1.0.2\apps\continuum\working-directory\6\classlib\make\depends.xml:148:
...

     [exec] Missing dependency.  The jar from:

     [exec]   http://www.bouncycastle.org/download/bcprov-jdk14-133.jar

     [exec] should be downloaded to:

     [exec]   depends/jars/bcprov-jdk14-133/signed.bcprov.jar

     [exec] Run "ant -f make/depends.xml download" to automatically fetch
     [exec] dependencies.  Note: Some of Harmony's dependencies are licensed under
     [exec] terms other than the ASLv2.

     [exec] Total time: 1 second
     [echo] Tests.failed is set to ${tests.failed}

check-class-load-lists:

japi:

publish:
    [mkdir] Created dir: C:\publish\20060526-1001
    [mkdir] Created dir: C:\publish\20060526-1001\test

BUILD FAILED
C:\continuum-1.0.2\apps\continuum\working-directory\6\build.xml:325: C:\continuum-1.0.2\apps\continuum\working-directory\6\classlib\build\test_report\html
not found.

Total time: 17 seconds

****************************************************************************




Mime
View raw message