harmony-commits mailing list archives

Site index · List index
Message view « Date » · « Thread »
Top « Date » · « Thread »
From Apache Harmony Build <nom...@hursley.ibm.com>
Subject [continuum] BUILD FAILURE: Classlib/win.ia32 Build/Test
Date Tue, 16 May 2006 14:05:23 GMT
Online report : http://ibmonly.hursley.ibm.com/continuum/win.ia32/servlet/continuum/target/ProjectBuild.vm/view/ProjectBuild/id/6/buildId/954
Build statistics:
  State: Failed
  Previous State: Ok
  Started at: Tue, 16 May 2006 15:04:04 +0100
  Finished at: Tue, 16 May 2006 15:05:14 +0100
  Total time: 1m 9s
  Build Trigger: Schedule
  Exit code: 1
  Building machine hostname: hy1
  Operating system : Windows XP
  Java version : 1.5.0(IBM Corporation)

Changes
                            classlib\modules\rmi2\doc\license
            classlib\modules\rmi2\doc\testing\Testing RMI Version 1.0.pdf
            classlib\modules\rmi2\doc\testing\rmi dependencies.pdf
            classlib\modules\rmi2\doc\testing\Testing of Java Packages.pdf
            classlib\modules\rmi2\doc\testing\rmi http tunneling\configuration.pdf
            classlib\modules\rmi2\doc\testing\rmi http tunneling\index.pdf
            classlib\modules\rmi2\doc\testing\rmi http tunneling\scripts.pdf
            classlib\modules\rmi2\doc\testing\rmi http tunneling\Results - SUN\testdirectsocketconnectionusinghttp.pdf
            classlib\modules\rmi2\doc\testing\rmi http tunneling\Results - SUN\testusingproxyandwebserverwithcgi.pdf
            classlib\modules\rmi2\doc\testing\rmi http tunneling\Results - SUN\testdirectsocketconnection.pdf
            classlib\modules\rmi2\doc\testing\rmi http tunneling\bashscripts.zip
            classlib\modules\rmi2\doc\testing\rmi http tunneling\configuration\setting2\machine1\shorewall.zip
            classlib\modules\rmi2\doc\testing\rmi http tunneling\configuration\setting2\machine1\squid.zip
            classlib\modules\rmi2\doc\testing\rmi http tunneling\configuration\setting3\machine1\shorewall.zip
            classlib\modules\rmi2\doc\testing\rmi http tunneling\configuration\setting3\machine1\squid.zip
            classlib\modules\rmi2\doc\testing\rmi http tunneling\configuration\setting3\machine3\shorewall.zip
            classlib\modules\rmi2\doc\testing\rmi http tunneling\configuration\setting1\machine1\shorewall.zip
            classlib\modules\rmi2\doc\testing\rmi http tunneling\configuration\setting1\machine1\squid.zip
            classlib\modules\rmi2\doc\testing\rmi http tunneling\Results - ITC\testdirectsocketconnectionusinghttp.pdf
            classlib\modules\rmi2\doc\testing\rmi http tunneling\Results - ITC\testusingproxyandwebserverwithcgi.pdf
            classlib\modules\rmi2\doc\testing\rmi http tunneling\Results - ITC\testdirectsocketconnection.pdf
            classlib\modules\rmi2\rmi-1.4.2\doc\license
            classlib\modules\rmi2\rmi-1.4.2\src\java\rmi\dgc\VMID.java
            classlib\modules\rmi2\rmi-1.4.2\src\java\rmi\dgc\Lease.java
            classlib\modules\rmi2\rmi-1.4.2\src\java\rmi\dgc\DGC.java
            classlib\modules\rmi2\rmi-1.4.2\src\java\rmi\activation\Activatable.java
            classlib\modules\rmi2\rmi-1.4.2\src\java\rmi\activation\ActivationDesc.java
            classlib\modules\rmi2\rmi-1.4.2\src\java\rmi\activation\ActivationException.java
            classlib\modules\rmi2\rmi-1.4.2\src\java\rmi\activation\ActivationInstantiator.java
            classlib\modules\rmi2\rmi-1.4.2\src\java\rmi\activation\ActivateFailedException.java
            classlib\modules\rmi2\rmi-1.4.2\src\java\rmi\activation\UnknownObjectException.java
            classlib\modules\rmi2\rmi-1.4.2\src\java\rmi\activation\ActivationSystem.java
            classlib\modules\rmi2\rmi-1.4.2\src\java\rmi\activation\ActivationMonitor.java
            classlib\modules\rmi2\rmi-1.4.2\src\java\rmi\activation\ActivationGroupID.java
            classlib\modules\rmi2\rmi-1.4.2\src\java\rmi\activation\ActivationGroup_Stub.java
            classlib\modules\rmi2\rmi-1.4.2\src\java\rmi\activation\UnknownGroupException.java
            classlib\modules\rmi2\rmi-1.4.2\src\java\rmi\activation\Activator.java
            classlib\modules\rmi2\rmi-1.4.2\src\java\rmi\activation\ActivationGroupDesc.java
            classlib\modules\rmi2\rmi-1.4.2\src\java\rmi\activation\ActivationGroup.java
            classlib\modules\rmi2\rmi-1.4.2\src\java\rmi\activation\ActivationID.java
            classlib\modules\rmi2\rmi-1.4.2\src\java\rmi\server\LogStream.java
            classlib\modules\rmi2\rmi-1.4.2\src\java\rmi\AlreadyBoundException.java
            classlib\modules\rmi2\rmi-1.4.2\src\java\rmi\registry\LocateRegistry.java
            classlib\modules\rmi2\rmi-1.4.2\src\java\rmi\registry\RegistryHandler.java
            classlib\modules\rmi2\rmi-1.4.2\src\java\rmi\registry\Registry.java
            classlib\modules\rmi2\rmi-1.4.2\src\java\rmi\ServerRuntimeException.java
            classlib\modules\rmi2\rmi-1.4.2\src\java\rmi\Remote.java
            classlib\modules\rmi2\rmi-1.4.2\src\java\rmi\RMISecurityException.java
            classlib\modules\rmi2\rmi-1.4.2\src\ar\org\fitc\test\rmi\integration\fase2\test\ReportIPTestCase.java
            classlib\modules\rmi2\rmi-1.4.2\src\ar\org\fitc\test\rmi\integration\fase2\test\PropertysTestCase.java
            classlib\modules\rmi2\rmi-1.4.2\src\ar\org\fitc\test\rmi\integration\fase2\test\PortableTestCase.java
            classlib\modules\rmi2\rmi-1.4.2\src\ar\org\fitc\test\rmi\integration\fase2\test\ComunicationPerformanceTestCase.java
            classlib\modules\rmi2\rmi-1.4.2\src\ar\org\fitc\test\rmi\integration\fase2\test\PropagableTestCase.java
            classlib\modules\rmi2\rmi-1.4.2\src\ar\org\fitc\test\rmi\integration\fase2\test\ITCTestCase.java
            classlib\modules\rmi2\rmi-1.4.2\src\ar\org\fitc\test\rmi\integration\fase2\test\RemoteRegistryTestCase.java
            classlib\modules\rmi2\rmi-1.4.2\src\ar\org\fitc\test\rmi\integration\fase2\test\TestITCRemoteUnicast.java
            classlib\modules\rmi2\rmi-1.4.2\src\ar\org\fitc\test\rmi\integration\fase2\test\RMISocketFactoryTestCase.java
            classlib\modules\rmi2\rmi-1.4.2\src\ar\org\fitc\test\rmi\integration\fase2\test\OverheadComunicationPerformanceTestCase.java
            classlib\modules\rmi2\rmi-1.4.2\src\ar\org\fitc\test\rmi\integration\fase2\test\BigReturnComunicationPerformanceTestCase.java
            classlib\modules\rmi2\rmi-1.4.2\src\ar\org\fitc\test\rmi\integration\fase2\test\DGCTestCase.java
            classlib\modules\rmi2\rmi-1.4.2\src\ar\org\fitc\test\rmi\integration\fase2\test\SocketFactoryDCGTestCase.java
            classlib\modules\rmi2\rmi-1.4.2\src\ar\org\fitc\test\rmi\integration\fase2\test\ExportationPerformanceTestCase.java
            classlib\modules\rmi2\rmi-1.4.2\src\ar\org\fitc\test\rmi\integration\fase2\test\ExecutorTestCase.java
            classlib\modules\rmi2\rmi-1.4.2\src\ar\org\fitc\test\rmi\integration\fase2\test\TestITCRemote.java
            classlib\modules\rmi2\rmi-1.4.2\src\ar\org\fitc\test\rmi\integration\fase2\test\PerformanceTestCase.java
            classlib\modules\rmi2\rmi-1.4.2\src\ar\org\fitc\test\rmi\integration\fase2\socketfactory\GZipClientSocketFactory.jav
            classlib\modules\rmi2\rmi-1.4.2\src\ar\org\fitc\test\rmi\integration\fase2\socketfactory\RemoteCipherImpl.java
            classlib\modules\rmi2\rmi-1.4.2\src\ar\org\fitc\test\rmi\integration\fase2\socketfactory\GZipServerSocket.java
            classlib\modules\rmi2\rmi-1.4.2\src\ar\org\fitc\test\rmi\integration\fase2\socketfactory\CipherServerSocket.java
            classlib\modules\rmi2\rmi-1.4.2\src\ar\org\fitc\test\rmi\integration\fase2\socketfactory\DelayServerSocket.java
            classlib\modules\rmi2\rmi-1.4.2\src\ar\org\fitc\test\rmi\integration\fase2\interfaces\ITCRemote.java
            classlib\modules\rmi2\rmi-1.4.2\src\ar\org\fitc\test\rmi\integration\fase2\interfaces\LogRemote.java
            classlib\modules\rmi2\rmi-1.4.2\src\ar\org\fitc\test\rmi\integration\fase2\main\StartUp.java
            classlib\modules\rmi2\rmi-1.4.2\src\ar\org\fitc\test\rmi\integration\fase2\TimeWaitBigReturn.java
            classlib\modules\rmi2\rmi-1.4.2\src\ar\org\fitc\test\rmi\integration\fase2\GCRemote.java
            classlib\modules\rmi2\rmi-1.4.2\src\ar\org\fitc\test\rmi\integration\fase2\AutoBindITCRemoteUnicast.java
            classlib\modules\rmi2\rmi-1.4.2\src\ar\org\fitc\test\rmi\integration\fase2\MoveRemoteObject.java
            classlib\modules\rmi2\rmi-1.4.2\src\ar\org\fitc\test\rmi\integration\fase2\remoteexport\ExportServiceExecutor.java
            classlib\modules\rmi2\rmi-1.4.2\src\ar\org\fitc\test\rmi\integration\fase2\remoteexport\PortableUnicastRemoteObject.java
            classlib\modules\rmi2\rmi-1.4.2\src\ar\org\fitc\test\rmi\integration\fase2\remoteexport\ExecutorGetClientHost.java
            classlib\modules\rmi2\rmi-1.4.2\src\ar\org\fitc\test\rmi\integration\fase2\executor\tests.java
            classlib\modules\rmi2\rmi-1.4.2\src\ar\org\fitc\test\rmi\integration\fase2\executor\ReportIPException.java
            classlib\modules\rmi2\rmi-1.4.2\src\ar\org\fitc\test\rmi\integration\fase2\executor\ReportIP.java
            classlib\modules\rmi2\rmi-1.4.2\src\ar\org\fitc\test\rmi\integration\fase2\executor\ServerExecutor.java
            classlib\modules\rmi2\rmi-1.4.2\src\ar\org\fitc\test\rmi\integration\fase2\executor\AbstractServerExecutor.java
            classlib\modules\rmi2\rmi-1.4.2\src\ar\org\fitc\test\rmi\integration\fase2\executor\RemoteExecutor.java
            classlib\modules\rmi2\rmi-1.4.2\src\ar\org\fitc\test\rmi\integration\fase2\executor\PropagableExecutor.java
            classlib\modules\rmi2\rmi-1.4.2\src\ar\org\fitc\test\rmi\integration\fase2\executor\ReportIPServer.java
            classlib\modules\rmi2\rmi-1.4.2\src\ar\org\fitc\test\rmi\integration\fase2\executor\RemoteExecutorImpl.java
            classlib\modules\rmi2\rmi-1.4.2\src\ar\org\fitc\test\rmi\integration\fase2\executor\ClientExecutor.java
            classlib\modules\rmi2\rmi-1.4.2\src\ar\org\fitc\test\rmi\integration\fase2\executor\PropagableExecutorImpl.java
            classlib\modules\rmi2\rmi-1.4.2\src\ar\org\fitc\test\rmi\integration\fase2\LogRemoteImpl.java
            classlib\modules\rmi2\rmi-1.4.2\src\ar\org\fitc\test\rmi\integration\fase2\AbstractITCRemote.java
            classlib\modules\rmi2\rmi-1.4.2\src\ar\org\fitc\test\rmi\integration\fase2\ITCRemoteUnicast.java
            classlib\modules\rmi2\rmi-1.4.2\src\ar\org\fitc\test\rmi\integration\fase2\TimeWait.java
            classlib\modules\rmi2\rmi-1.4.2\src\ar\org\fitc\test\rmi\integration\fase2\Net.java
            classlib\modules\rmi2\rmi-1.4.2\src\ar\org\fitc\test\rmi\integration\fase2\PropagableTestRemote.java
            classlib\modules\rmi2\rmi-1.4.2\src\ar\org\fitc\test\rmi\tunneling\integration\ProtocolTest.java
            classlib\modules\rmi2\rmi-1.4.2\src\ar\org\fitc\test\rmi\tunneling\integration\RemoteCalculatorClient.java
            classlib\modules\rmi2\rmi-1.4.2\src\ar\org\fitc\test\rmi\tunneling\integration\CalculatorBI.java
            classlib\modules\rmi2\rmi-1.4.2\src\ar\org\fitc\test\rmi\tunneling\integration\RemoteCalculator.java
            classlib\modules\rmi2\rmi-1.4.2\src\ar\org\fitc\test\rmi\tunneling\integration\RemoteCalculatorServerBI.java
            classlib\modules\rmi2\rmi-1.4.2\src\ar\org\fitc\test\rmi\tunneling\integration\RemoteCipherImpl.java
            classlib\modules\rmi2\rmi-1.4.2\src\ar\org\fitc\test\rmi\tunneling\integration\CipherServerSocket.java
            classlib\modules\rmi2\rmi-1.4.2\src\ar\org\fitc\test\rmi\tunneling\integration\RemoteCalculatorClientBI.java
            classlib\modules\rmi2\rmi-1.4.2\src\ar\org\fitc\test\rmi\tunneling\integration\RemoteCalculatorBI.java
            classlib\modules\rmi2\rmi-1.4.2\src\ar\org\fitc\test\rmi\tunneling\integration\CipherSocket.java
            classlib\modules\rmi2\rmi-1.4.2\src\ar\org\fitc\test\rmi\tunneling\integration\CipherRMISocketFactory.java
            classlib\modules\rmi2\rmi-1.4.2\src\ar\org\fitc\test\rmi\tunneling\integration\ProtocolTestByte.java
            classlib\modules\rmi2\rmi-1.4.2\src\ar\org\fitc\test\rmi\tunneling\integration\RemoteCipher.java
            classlib\modules\rmi2\rmi-1.4.2\src\ar\org\fitc\test\rmi\tunneling\integration\RemoteHashServer.java
            classlib\modules\rmi2\rmi-1.4.2\src\ar\org\fitc\test\rmi\tunneling\integration\ProtocolTestServer.java
            classlib\modules\rmi2\rmi-1.4.2\src\ar\org\fitc\test\rmi\tunneling\integration\Calculator.java
            classlib\modules\rmi2\rmi-1.4.2\src\ar\org\fitc\test\rmi\tunneling\integration\RemoteMap.java
            classlib\modules\rmi2\rmi-1.4.2\src\ar\org\fitc\test\rmi\tunneling\integration\RemoteMapAdapter.java
            classlib\modules\rmi2\rmi-1.4.2\src\ar\org\fitc\test\rmi\tunneling\integration\RemoteCalculatorServer.java
            classlib\modules\rmi2\rmi-1.4.2\src\ar\org\fitc\test\rmi\tunneling\integration\RemoteHashClient.java
            classlib\modules\rmi2\rmi-1.4.2\src\ar\org\fitc\test\rmi\tunneling\testrunner\FallbackTest.java
            classlib\modules\rmi2\rmi-1.4.2\src\ar\org\fitc\test\rmi\tunneling\testrunner\RemoteCalculatorClientITCDirect.java
            classlib\modules\rmi2\rmi-1.4.2\src\ar\org\fitc\test\rmi\tunneling\testrunner\RemoteCalculatorClientSunDirect.java
            classlib\modules\rmi2\rmi-1.4.2\src\ar\org\fitc\test\rmi\tunneling\testrunner\RemoteCalculatorClientSunHttpDirect.java
            classlib\modules\rmi2\rmi-1.4.2\src\ar\org\fitc\test\rmi\tunneling\testrunner\RemoteCalculatorClientSunHttpCgi.java
            classlib\modules\rmi2\rmi-1.4.2\src\ar\org\fitc\test\rmi\tunneling\testrunner\Util.java
            classlib\modules\rmi2\rmi-1.4.2\src\ar\org\fitc\rmi\utils\PropertiesReader.java
            classlib\modules\rmi2\rmi-1.4.2\src\ar\org\fitc\rmi\utils\ReversibleHashSet.java
            classlib\modules\rmi2\rmi-1.4.2\src\ar\org\fitc\rmi\utils\PrintStreamHandler.java
            classlib\modules\rmi2\rmi-1.4.2\src\ar\org\fitc\rmi\utils\MethodHashGenerator.java
            classlib\modules\rmi2\rmi-1.4.2\src\ar\org\fitc\rmi\utils\Pair.java
            classlib\modules\rmi2\rmi-1.4.2\src\ar\org\fitc\rmi\utils\RemoteUtils.java
            classlib\modules\rmi2\rmi-1.4.2\src\ar\org\fitc\rmi\runtime\RMIDefaultClassLoaderSpi.java
            classlib\modules\rmi2\rmi-1.4.2\src\ar\org\fitc\rmi\runtime\RemoteReferenceManager.java
            classlib\modules\rmi2\rmi-1.4.2\src\ar\org\fitc\rmi\server\UnicastServerRefImpl.java
            classlib\modules\rmi2\rmi-1.4.2\src\ar\org\fitc\rmi\server\UnicastServerRef2Impl.java
            classlib\modules\rmi2\rmi-1.4.2\src\ar\org\fitc\rmi\registry\RegistryImpl_Stub.java
            classlib\modules\rmi2\rmi-1.4.2\src\ar\org\fitc\rmi\registry\RegistryImpl.java
            classlib\modules\rmi2\rmi-1.4.2\src\ar\org\fitc\rmi\transport\http\HttpServerInputStream.java
            classlib\modules\rmi2\rmi-1.4.2\src\ar\org\fitc\rmi\transport\http\HttpServerOutputStream.java
            classlib\modules\rmi2\rmi-1.4.2\src\ar\org\fitc\rmi\transport\http\HttpSocketServerSide.java
            classlib\modules\rmi2\rmi-1.4.2\src\ar\org\fitc\rmi\transport\http\HttpClientInputStream.java
            classlib\modules\rmi2\rmi-1.4.2\src\ar\org\fitc\rmi\transport\http\HttpClientOutputStream.java
            classlib\modules\rmi2\rmi-1.4.2\src\ar\org\fitc\rmi\transport\http\HttpHeaders.java
            classlib\modules\rmi2\rmi-1.4.2\src\ar\org\fitc\rmi\transport\http\HttpInputStream.java
            classlib\modules\rmi2\rmi-1.4.2\src\ar\org\fitc\rmi\transport\http\HttpOutputStream.java
            classlib\modules\rmi2\rmi-1.4.2\src\ar\org\fitc\rmi\transport\http\HttpSocketClientSide.java
            classlib\modules\rmi2\rmi-1.4.2\src\ar\org\fitc\rmi\transport\jrmp\ReturnType.java
            classlib\modules\rmi2\rmi-1.4.2\src\ar\org\fitc\rmi\transport\jrmp\MessageResponse.java
            classlib\modules\rmi2\rmi-1.4.2\src\ar\org\fitc\rmi\transport\jrmp\ProtocolType.java
            classlib\modules\rmi2\rmi-1.4.2\src\ar\org\fitc\rmi\transport\jrmp\Message.java
            classlib\modules\rmi2\rmi-1.4.2\src\ar\org\fitc\rmi\transport\jrmp\ReturnMessage.java
            classlib\modules\rmi2\rmi-1.4.2\src\ar\org\fitc\rmi\transport\jrmp\MessageType.java
            classlib\modules\rmi2\rmi-1.4.2\src\ar\org\fitc\rmi\transport\jrmp\ServerProtocolHandler.java
            classlib\modules\rmi2\rmi-1.4.2\src\ar\org\fitc\rmi\transport\jrmp\HeaderResponse.java
            classlib\modules\rmi2\rmi-1.4.2\src\ar\org\fitc\rmi\transport\jrmp\Header.java
            classlib\modules\rmi2\rmi-1.4.2\src\ar\org\fitc\rmi\transport\jrmp\ProtocolHeader.java
            classlib\modules\rmi2\rmi-1.4.2\src\ar\org\fitc\rmi\transport\jrmp\ClientProtocolHandler.java
            classlib\modules\rmi2\rmi-1.4.2\src\ar\org\fitc\rmi\transport\RMIDefaultSocketFactory.java
            classlib\modules\rmi2\rmi-1.4.2\src\ar\org\fitc\rmi\transport\EndpointID.java
            classlib\modules\rmi2\rmi-1.4.2\src\ar\org\fitc\rmi\dgc\server\DGCDataTable.java
            classlib\modules\rmi2\rmi-1.4.2\src\ar\org\fitc\rmi\dgc\server\DGCImpl.java
            classlib\modules\rmi2\rmi-1.4.2\src\ar\org\fitc\rmi\dgc\server\DGCData.java
            classlib\modules\rmi2\rmi-1.4.2\src\ar\org\fitc\rmi\dgc\DGCScheduledGC.java
            classlib\modules\rmi2\rmi-1.4.2\src\ar\org\fitc\rmi\dgc\client\DirtyRetryTask.java
            classlib\modules\rmi2\rmi-1.4.2\src\ar\org\fitc\rmi\dgc\client\DGCQueuePoll.java
            classlib\modules\rmi2\rmi-1.4.2\src\ar\org\fitc\rmi\dgc\client\DGCClient.java
            classlib\modules\rmi2\rmi-1.4.2\src\ar\org\fitc\rmi\dgc\client\DirtyTask.java
            classlib\modules\rmi2\rmi-1.4.2\src\dependencies\junit.jar
            classlib\modules\rmi2\rmi-1.4.2\src\doctools\UrlTaglet.java
            classlib\modules\rmi2\rmi-1.4.2\src\doctools\SpecRefTaglet.java
            classlib\modules\rmi2\rmi-1.4.2\src\doctools\RefTaglet.java
            classlib\modules\rmi2\rmi-1.4.2\make\build.xml
            classlib\modules\rmi2\src\java\rmi\dgc\VMID.java
            classlib\modules\rmi2\src\java\rmi\dgc\Lease.java
            classlib\modules\rmi2\src\java\rmi\dgc\DGC.java
            classlib\modules\rmi2\src\java\rmi\activation\Activatable.java
            classlib\modules\rmi2\src\java\rmi\activation\ActivationDesc.java
            classlib\modules\rmi2\src\java\rmi\activation\ActivationException.java
            classlib\modules\rmi2\src\java\rmi\activation\ActivationInstantiator.java
            classlib\modules\rmi2\src\java\rmi\activation\ActivateFailedException.java
            classlib\modules\rmi2\src\java\rmi\activation\UnknownObjectException.java
            classlib\modules\rmi2\src\java\rmi\activation\ActivationSystem.java
            classlib\modules\rmi2\src\java\rmi\activation\ActivationMonitor.java
            classlib\modules\rmi2\src\java\rmi\activation\ActivationGroupID.java
            classlib\modules\rmi2\src\java\rmi\activation\ActivationGroup_Stub.java
            classlib\modules\rmi2\src\java\rmi\activation\UnknownGroupException.java
            classlib\modules\rmi2\src\java\rmi\activation\Activator.java
            classlib\modules\rmi2\src\java\rmi\activation\ActivationGroupDesc.java
            classlib\modules\rmi2\src\java\rmi\activation\ActivationGroup.java
            classlib\modules\rmi2\src\java\rmi\activation\ActivationID.java
            classlib\modules\rmi2\src\java\rmi\server\Operation.java
            classlib\modules\rmi2\src\java\rmi\server\ExportException.java
            classlib\modules\rmi2\src\java\rmi\server\ServerNotActiveException.java
            classlib\modules\rmi2\src\java\rmi\server\ServerRef.java
            classlib\modules\rmi2\src\java\rmi\server\RMIClassLoader.java
            classlib\modules\rmi2\src\java\rmi\server\LoaderHandler.java
            classlib\modules\rmi2\src\java\rmi\server\Unreferenced.java
            classlib\modules\rmi2\src\java\rmi\server\ServerCloneException.java
            classlib\modules\rmi2\src\java\rmi\server\UnicastRemoteObject.java
            classlib\modules\rmi2\src\java\rmi\server\RemoteObjectInvocationHandler.java
            classlib\modules\rmi2\src\java\rmi\server\RMIServerSocketFactory.java
            classlib\modules\rmi2\src\java\rmi\server\RMIClassLoaderSpi.java
            classlib\modules\rmi2\src\java\rmi\server\SkeletonNotFoundException.java
            classlib\modules\rmi2\src\java\rmi\server\UID.java
            classlib\modules\rmi2\src\java\rmi\server\RemoteServer.java
            classlib\modules\rmi2\src\java\rmi\server\RemoteObject.java
            classlib\modules\rmi2\src\java\rmi\server\Skeleton.java
            classlib\modules\rmi2\src\java\rmi\server\RemoteCall.java
            classlib\modules\rmi2\src\java\rmi\server\RMIClientSocketFactory.java
            classlib\modules\rmi2\src\java\rmi\server\ObjID.java
            classlib\modules\rmi2\src\java\rmi\server\RemoteRef.java
            classlib\modules\rmi2\src\java\rmi\server\RMISocketFactory.java
            classlib\modules\rmi2\src\java\rmi\server\RemoteStub.java
            classlib\modules\rmi2\src\java\rmi\server\SkeletonMismatchException.java
            classlib\modules\rmi2\src\java\rmi\server\RMIFailureHandler.java
            classlib\modules\rmi2\src\java\rmi\server\LogStream.java
            classlib\modules\rmi2\src\java\rmi\AlreadyBoundException.java
            classlib\modules\rmi2\src\java\rmi\registry\LocateRegistry.java
            classlib\modules\rmi2\src\java\rmi\registry\RegistryHandler.java
            classlib\modules\rmi2\src\java\rmi\registry\Registry.java
            classlib\modules\rmi2\src\java\rmi\ServerRuntimeException.java
            classlib\modules\rmi2\src\java\rmi\Remote.java
            classlib\modules\rmi2\src\java\rmi\RMISecurityException.java
            classlib\modules\rmi2\src\ar\org\fitc\test\rmi\activation\TestActivatable.java
            classlib\modules\rmi2\src\ar\org\fitc\test\rmi\activation\TestActivationDesc.java
            classlib\modules\rmi2\src\ar\org\fitc\test\rmi\activation\TestActivationGroupDescCommandEnvironment.java
            classlib\modules\rmi2\src\ar\org\fitc\test\rmi\activation\TestSuiteRMIActivation.java
            classlib\modules\rmi2\src\ar\org\fitc\test\rmi\activation\TestActivationGroupID.java
            classlib\modules\rmi2\src\ar\org\fitc\test\rmi\activation\TestActivationGroup_Stub.java
            classlib\modules\rmi2\src\ar\org\fitc\test\rmi\activation\TestActivationGroupDesc.java
            classlib\modules\rmi2\src\ar\org\fitc\test\rmi\activation\TestActivationGroup.java
            classlib\modules\rmi2\src\ar\org\fitc\test\rmi\activation\TestActivationID.java
            classlib\modules\rmi2\src\ar\org\fitc\test\rmi\integration\fase2\serverExecutor\AbstractITCRemote.java
            classlib\modules\rmi2\src\ar\org\fitc\test\rmi\integration\fase2\serverExecutor\LogRemoteImpl.java
            classlib\modules\rmi2\src\ar\org\fitc\test\rmi\integration\fase2\serverExecutor\test\RemoteRegistryTestCase.java
            classlib\modules\rmi2\src\ar\org\fitc\test\rmi\integration\fase2\serverExecutor\test\ReportIPTestCase.java
            classlib\modules\rmi2\src\ar\org\fitc\test\rmi\integration\fase2\serverExecutor\test\TestITCRemoteUnicast.java
            classlib\modules\rmi2\src\ar\org\fitc\test\rmi\integration\fase2\serverExecutor\test\PortableTestCase.java
            classlib\modules\rmi2\src\ar\org\fitc\test\rmi\integration\fase2\serverExecutor\test\PropagableTestCase.java
            classlib\modules\rmi2\src\ar\org\fitc\test\rmi\integration\fase2\serverExecutor\test\DGCTestCase.java
            classlib\modules\rmi2\src\ar\org\fitc\test\rmi\integration\fase2\serverExecutor\test\ExecutorTestCase.java
            classlib\modules\rmi2\src\ar\org\fitc\test\rmi\integration\fase2\serverExecutor\test\ITCTestCase.java
            classlib\modules\rmi2\src\ar\org\fitc\test\rmi\integration\fase2\serverExecutor\test\TestITCRemote.java
            classlib\modules\rmi2\src\ar\org\fitc\test\rmi\integration\fase2\serverExecutor\interfaces\LogRemote.java
            classlib\modules\rmi2\src\ar\org\fitc\test\rmi\integration\fase2\serverExecutor\main\StartUp.java
            classlib\modules\rmi2\src\ar\org\fitc\test\rmi\integration\fase2\serverExecutor\GCRemote.java
            classlib\modules\rmi2\src\ar\org\fitc\test\rmi\integration\fase2\serverExecutor\AutoBindITCRemoteUnicast.java
            classlib\modules\rmi2\src\ar\org\fitc\test\rmi\integration\fase2\serverExecutor\PropagableTestRemote.java
            classlib\modules\rmi2\src\ar\org\fitc\test\rmi\integration\fase2\serverExecutor\MoveRemoteObject.java
            classlib\modules\rmi2\src\ar\org\fitc\test\rmi\integration\fase2\serverExecutor\remoteexport\ExportServiceExecutor.java
            classlib\modules\rmi2\src\ar\org\fitc\test\rmi\integration\fase2\serverExecutor\remoteexport\PortableUnicastRemoteObject.java
            classlib\modules\rmi2\src\ar\org\fitc\test\rmi\integration\fase2\serverExecutor\remoteexport\ExecutorGetClientHost.java
            classlib\modules\rmi2\src\ar\org\fitc\test\rmi\integration\fase2\serverExecutor\executor\ServerExecutor.java
            classlib\modules\rmi2\src\ar\org\fitc\test\rmi\integration\fase2\serverExecutor\executor\AbstractServerExecutor.java
            classlib\modules\rmi2\src\ar\org\fitc\test\rmi\integration\fase2\clientExecutor\interfaces\ITCRemote.java
            classlib\modules\rmi2\src\ar\org\fitc\test\rmi\integration\fase2\clientExecutor\executor\ReportIPException.java
            classlib\modules\rmi2\src\ar\org\fitc\test\rmi\integration\fase2\clientExecutor\executor\ReportIP.java
            classlib\modules\rmi2\src\ar\org\fitc\test\rmi\integration\fase2\clientExecutor\executor\ServerExecutor.java
            classlib\modules\rmi2\src\ar\org\fitc\test\rmi\integration\fase2\clientExecutor\executor\RemoteExecutor.java
            classlib\modules\rmi2\src\ar\org\fitc\test\rmi\integration\fase2\clientExecutor\executor\PropagableExecutor.java
            classlib\modules\rmi2\src\ar\org\fitc\test\rmi\integration\fase2\clientExecutor\executor\ReportIPServer.java
            classlib\modules\rmi2\src\ar\org\fitc\test\rmi\integration\fase2\clientExecutor\executor\RemoteExecutorImpl.java
            classlib\modules\rmi2\src\ar\org\fitc\test\rmi\integration\fase2\clientExecutor\executor\ClientExecutor.java
            classlib\modules\rmi2\src\ar\org\fitc\test\rmi\integration\fase2\clientExecutor\executor\PropagableExecutorImpl.java
            classlib\modules\rmi2\src\ar\org\fitc\test\rmi\integration\CipherSocket.java
            classlib\modules\rmi2\src\ar\org\fitc\test\rmi\integration\CipherRMISocketFactory.java
            classlib\modules\rmi2\src\ar\org\fitc\test\rmi\integration\ProtocolTestByte.java
            classlib\modules\rmi2\src\ar\org\fitc\test\rmi\integration\RemoteCipher.java
            classlib\modules\rmi2\src\ar\org\fitc\test\rmi\integration\RemoteHashServer.java
            classlib\modules\rmi2\src\ar\org\fitc\test\rmi\integration\ProtocolTestServer.java
            classlib\modules\rmi2\src\ar\org\fitc\test\rmi\integration\Calculator.java
            classlib\modules\rmi2\src\ar\org\fitc\test\rmi\integration\RemoteMap.java
            classlib\modules\rmi2\src\ar\org\fitc\test\rmi\integration\RemoteMapAdapter.java
            classlib\modules\rmi2\src\ar\org\fitc\test\rmi\integration\RemoteCalculatorServer.java
            classlib\modules\rmi2\src\ar\org\fitc\test\rmi\integration\RemoteHashClient.java
            classlib\modules\rmi2\src\ar\org\fitc\test\rmi\server\TestOperation.java
            classlib\modules\rmi2\src\ar\org\fitc\test\rmi\server\TestUID.java
            classlib\modules\rmi2\src\ar\org\fitc\test\rmi\server\TestRemoteObject.java
            classlib\modules\rmi2\src\ar\org\fitc\test\rmi\server\TestRemoteServer.java
            classlib\modules\rmi2\src\ar\org\fitc\test\rmi\server\TestRMIClassLoader.java
            classlib\modules\rmi2\src\ar\org\fitc\test\rmi\server\rmiclassloader\EchoTest2.java
            classlib\modules\rmi2\src\ar\org\fitc\test\rmi\server\rmiclassloader\EchoServer.java
            classlib\modules\rmi2\src\ar\org\fitc\test\rmi\server\rmiclassloader\IEcho.java
            classlib\modules\rmi2\src\ar\org\fitc\test\rmi\server\rmiclassloader\EchoClient.java
            classlib\modules\rmi2\src\ar\org\fitc\test\rmi\server\TestObjId.java
            classlib\modules\rmi2\src\ar\org\fitc\test\rmi\server\TestRMISocketFactory.java
            classlib\modules\rmi2\src\ar\org\fitc\test\rmi\server\TestSuiteRMIServer.java
            classlib\modules\rmi2\src\ar\org\fitc\test\rmi\server\TestUnicastRemoteObject.java
            classlib\modules\rmi2\src\ar\org\fitc\test\rmi\server\TestRemoteObjectInvocationHandler.java
            classlib\modules\rmi2\src\ar\org\fitc\test\rmi\server\TestLogStream.java
            classlib\modules\rmi2\src\ar\org\fitc\test\rmi\server\testclasses\LoaderClassTest003.java
            classlib\modules\rmi2\src\ar\org\fitc\test\rmi\server\testclasses\SuperProxy.java
            classlib\modules\rmi2\src\ar\org\fitc\test\rmi\server\testclasses\ProxyTest.java
            classlib\modules\rmi2\src\ar\org\fitc\test\rmi\server\testclasses\LoaderRemoteClassTest.java
            classlib\modules\rmi2\src\ar\org\fitc\test\rmi\server\testclasses\OverProxy.java
            classlib\modules\rmi2\src\ar\org\fitc\test\rmi\server\testclasses\LoaderClassTest002.java
            classlib\modules\rmi2\src\ar\org\fitc\test\rmi\server\testclasses\MyRMISocketFactory.java
            classlib\modules\rmi2\src\ar\org\fitc\test\rmi\object2test\BigEcho.java
            classlib\modules\rmi2\src\ar\org\fitc\test\rmi\object2test\MyActivator.java
            classlib\modules\rmi2\src\ar\org\fitc\test\rmi\object2test\EchoActivatable_Imp.java
            classlib\modules\rmi2\src\ar\org\fitc\test\rmi\object2test\Echo_Imp.java
            classlib\modules\rmi2\src\ar\org\fitc\test\rmi\object2test\EchoWithStubUnicast_Imp.java
            classlib\modules\rmi2\src\ar\org\fitc\test\rmi\object2test\BigEcho_imp.java
            classlib\modules\rmi2\src\ar\org\fitc\test\rmi\object2test\EchoUnicast_Imp.java
            classlib\modules\rmi2\src\ar\org\fitc\test\rmi\object2test\EchoWithStubActivatable_Imp.java
            classlib\modules\rmi2\src\ar\org\fitc\test\rmi\object2test\EchoWithStub_Imp.java
            classlib\modules\rmi2\src\ar\org\fitc\test\rmi\object2test\Echo.java
            classlib\modules\rmi2\src\ar\org\fitc\test\rmi\object2test\MyRemoteRef.java
            classlib\modules\rmi2\src\ar\org\fitc\test\rmi\registry\TestLocateRegistry.java
            classlib\modules\rmi2\src\ar\org\fitc\test\rmi\registry\TestSuiteRMIRegistry.java
            classlib\modules\rmi2\src\ar\org\fitc\test\rmi\TestNaming.java
            classlib\modules\rmi2\src\ar\org\fitc\test\rmi\TestRMISecurityManager.java
            classlib\modules\rmi2\src\ar\org\fitc\test\rmi\dgc\EchoClient2.java
            classlib\modules\rmi2\src\ar\org\fitc\test\rmi\dgc\TestVMID.java
            classlib\modules\rmi2\src\ar\org\fitc\test\rmi\dgc\TestDistributedGarbageCollector.java
            classlib\modules\rmi2\src\ar\org\fitc\test\rmi\dgc\TestSuitdgc.java
            classlib\modules\rmi2\src\ar\org\fitc\test\rmi\dgc\TestLease.java
            classlib\modules\rmi2\src\ar\org\fitc\test\util\MyClassLoader.java
            classlib\modules\rmi2\src\ar\org\fitc\test\util\Net.java
            classlib\modules\rmi2\src\ar\org\fitc\test\util\Messages.java
            classlib\modules\rmi2\src\ar\org\fitc\rmi\utils\PropertiesReader.java
            classlib\modules\rmi2\src\ar\org\fitc\rmi\utils\ReversibleHashSet.java
            classlib\modules\rmi2\src\ar\org\fitc\rmi\utils\PrintStreamHandler.java
            classlib\modules\rmi2\src\ar\org\fitc\rmi\utils\MethodHashGenerator.java
            classlib\modules\rmi2\src\ar\org\fitc\rmi\utils\Pair.java
            classlib\modules\rmi2\src\ar\org\fitc\rmi\utils\RemoteUtils.java
            classlib\modules\rmi2\src\ar\org\fitc\rmi\runtime\RMIDefaultClassLoaderSpi.java
            classlib\modules\rmi2\src\ar\org\fitc\rmi\runtime\RemoteReferenceManager.java
            classlib\modules\rmi2\src\ar\org\fitc\rmi\server\UnicastRemoteRefImpl.java
            classlib\modules\rmi2\src\ar\org\fitc\rmi\server\ReferenceTypes.java
            classlib\modules\rmi2\src\ar\org\fitc\rmi\server\UnicastRemoteRef2Impl.java
            classlib\modules\rmi2\src\ar\org\fitc\rmi\server\UnicastServerRefImpl.java
            classlib\modules\rmi2\src\ar\org\fitc\rmi\server\UnicastServerRef2Impl.java
            classlib\modules\rmi2\src\ar\org\fitc\rmi\registry\RegistryImpl_Stub.java
            classlib\modules\rmi2\src\ar\org\fitc\rmi\registry\RegistryImpl.java
            classlib\modules\rmi2\src\ar\org\fitc\rmi\transport\http\HttpServerOutputStream.java
            classlib\modules\rmi2\src\ar\org\fitc\rmi\transport\http\HttpSocketServerSide.java
            classlib\modules\rmi2\src\ar\org\fitc\rmi\transport\http\HttpSocketClientSide.java
            classlib\modules\rmi2\src\ar\org\fitc\rmi\transport\FallBackType.java
            classlib\modules\rmi2\src\ar\org\fitc\rmi\transport\StreamServerConnection.java
            classlib\modules\rmi2\src\ar\org\fitc\rmi\transport\RMIObjectInputStream.java
            classlib\modules\rmi2\src\ar\org\fitc\rmi\transport\AbstractServerConnection.java
            classlib\modules\rmi2\src\ar\org\fitc\rmi\transport\StreamClientConnection.java
            classlib\modules\rmi2\src\ar\org\fitc\rmi\transport\RMIObjectOutputStream.java
            classlib\modules\rmi2\src\ar\org\fitc\rmi\transport\ServerConnectionFactory.java
            classlib\modules\rmi2\src\ar\org\fitc\rmi\transport\ProtocolException.java
            classlib\modules\rmi2\src\ar\org\fitc\rmi\transport\Endpoint.java
            classlib\modules\rmi2\src\ar\org\fitc\rmi\transport\MultiThreadedServer.java
            classlib\modules\rmi2\src\ar\org\fitc\rmi\transport\AbstractClientConnection.java
            classlib\modules\rmi2\src\ar\org\fitc\rmi\transport\ClientConnectionFactory.java
            classlib\modules\rmi2\src\ar\org\fitc\rmi\transport\SingleOpServerConnection.java
            classlib\modules\rmi2\src\ar\org\fitc\rmi\transport\RMIServerSocket.java
            classlib\modules\rmi2\src\ar\org\fitc\rmi\transport\TransportManager.java
            classlib\modules\rmi2\src\ar\org\fitc\rmi\transport\jrmp\ReturnType.java
            classlib\modules\rmi2\src\ar\org\fitc\rmi\transport\jrmp\MessageResponse.java
            classlib\modules\rmi2\src\ar\org\fitc\rmi\transport\jrmp\ProtocolType.java
            classlib\modules\rmi2\src\ar\org\fitc\rmi\transport\jrmp\Message.java
            classlib\modules\rmi2\src\ar\org\fitc\rmi\transport\jrmp\ReturnMessage.java
            classlib\modules\rmi2\src\ar\org\fitc\rmi\transport\jrmp\MessageType.java
            classlib\modules\rmi2\src\ar\org\fitc\rmi\transport\jrmp\ServerProtocolHandler.java
            classlib\modules\rmi2\src\ar\org\fitc\rmi\transport\jrmp\HeaderResponse.java
            classlib\modules\rmi2\src\ar\org\fitc\rmi\transport\jrmp\Header.java
            classlib\modules\rmi2\src\ar\org\fitc\rmi\transport\jrmp\ProtocolHeader.java
            classlib\modules\rmi2\src\ar\org\fitc\rmi\transport\jrmp\ClientProtocolHandler.java
            classlib\modules\rmi2\src\ar\org\fitc\rmi\transport\ConnectionPool.java
            classlib\modules\rmi2\src\ar\org\fitc\rmi\transport\RMIDefaultSocketFactory.java
            classlib\modules\rmi2\src\ar\org\fitc\rmi\transport\EndpointID.java
            classlib\modules\rmi2\src\ar\org\fitc\rmi\dgc\server\DGCDataTable.java
            classlib\modules\rmi2\src\ar\org\fitc\rmi\dgc\server\DGCImpl.java
            classlib\modules\rmi2\src\ar\org\fitc\rmi\dgc\server\DGCData.java
            classlib\modules\rmi2\src\ar\org\fitc\rmi\dgc\DGCScheduledGC.java
            classlib\modules\rmi2\src\ar\org\fitc\rmi\dgc\client\DirtyRetryTask.java
            classlib\modules\rmi2\src\ar\org\fitc\rmi\dgc\client\DGCQueuePoll.java
            classlib\modules\rmi2\src\ar\org\fitc\rmi\dgc\client\DGCClient.java
            classlib\modules\rmi2\src\ar\org\fitc\rmi\dgc\client\DirtyTask.java
            classlib\modules\rmi2\src\dependencies\junit.jar
            classlib\modules\rmi2\src\doctools\UrlTaglet.java
            classlib\modules\rmi2\src\doctools\SpecRefTaglet.java
            classlib\modules\rmi2\src\doctools\RefTaglet.java
            classlib\modules\rmi2\make\build.xml
        
****************************************************************************
Output:
****************************************************************************
Buildfile: build.xml

build:
   [delete] Deleting directory C:\continuum-1.0.2\apps\continuum\working-directory\6\classlib\deploy
     [echo] Classlib revision is 406949
     [echo] Post process: ${is.post.process.host}
     [echo] JAPI: ${is.japi.ftp.host}
     [echo] Building with reference jdk/javac
     [exec] Buildfile: build.xml

     [exec] clean:

     [exec] clean-bin:
     [exec]    [delete] Deleting 4525 files from C:\continuum-1.0.2\apps\continuum\working-directory\6\classlib\build
     [exec]    [delete] Deleted 269 directories from C:\continuum-1.0.2\apps\continuum\working-directory\6\classlib\build

     [exec] clean:

     [exec] clean:
     [exec]    [delete] Deleting directory C:\continuum-1.0.2\apps\continuum\working-directory\6\classlib\modules\archive\bin\test

     [exec] clean:
     [exec]    [delete] Deleting directory C:\continuum-1.0.2\apps\continuum\working-directory\6\classlib\modules\auth\bin\test

     [exec] clean:

     [exec] clean:
     [exec]    [delete] Deleting directory C:\continuum-1.0.2\apps\continuum\working-directory\6\classlib\modules\beans\bin\test

     [exec] clean:
     [exec]    [delete] Deleting directory C:\continuum-1.0.2\apps\continuum\working-directory\6\classlib\modules\crypto\bin\test

     [exec] clean:
     [exec]    [delete] Deleting directory C:\continuum-1.0.2\apps\continuum\working-directory\6\classlib\modules\jndi\bin\test

     [exec] clean:
     [exec]    [delete] Deleting directory C:\continuum-1.0.2\apps\continuum\working-directory\6\classlib\modules\logging\bin\test

     [exec] clean:

     [exec] clean:
     [exec]    [delete] Deleting directory C:\continuum-1.0.2\apps\continuum\working-directory\6\classlib\modules\luni\bin\main
     [exec]    [delete] Deleting directory C:\continuum-1.0.2\apps\continuum\working-directory\6\classlib\modules\luni\bin\test

     [exec] clean:
     [exec]    [delete] Deleting directory C:\continuum-1.0.2\apps\continuum\working-directory\6\classlib\modules\math\bin\test

     [exec] clean:
     [exec]    [delete] Deleting directory C:\continuum-1.0.2\apps\continuum\working-directory\6\classlib\modules\nio\bin\test

     [exec] clean:
     [exec]    [delete] Deleting directory C:\continuum-1.0.2\apps\continuum\working-directory\6\classlib\modules\nio_char\bin\test

     [exec] clean:
     [exec]    [delete] Deleting directory C:\continuum-1.0.2\apps\continuum\working-directory\6\classlib\modules\prefs\bin\test

     [exec] clean:
     [exec]    [delete] Deleting directory C:\continuum-1.0.2\apps\continuum\working-directory\6\classlib\modules\regex\bin\test

     [exec] clean:

     [exec] clean:

     [exec] clean:

     [exec] clean:
     [exec]    [delete] Deleting directory C:\continuum-1.0.2\apps\continuum\working-directory\6\classlib\modules\security\bin\test

     [exec] clean:
     [exec]    [delete] Deleting directory C:\continuum-1.0.2\apps\continuum\working-directory\6\classlib\modules\sql\bin\test

     [exec] clean:
     [exec]    [delete] Deleting directory C:\continuum-1.0.2\apps\continuum\working-directory\6\classlib\modules\text\bin\test

     [exec] clean:
     [exec]    [delete] Deleting directory C:\continuum-1.0.2\apps\continuum\working-directory\6\classlib\modules\x-net\bin\test

     [exec] clean-layout:
     [exec]    [delete] C:\continuum-1.0.2\apps\continuum\working-directory\6\classlib\deploy not found.

     [exec] clean:

     [exec] init:

     [exec] windows-properties:

     [exec] linux-properties:

     [exec] properties:

     [exec] clean-overlay-oss:
     [exec]    [delete] Deleting directory C:\continuum-1.0.2\apps\continuum\working-directory\6\classlib\native-src\win.IA32\fdlibm\dist
     [exec]    [delete] Deleting directory C:\continuum-1.0.2\apps\continuum\working-directory\6\classlib\native-src\win.IA32\zlib\dist
     [exec]    [delete] Deleting directory C:\continuum-1.0.2\apps\continuum\working-directory\6\classlib\native-src\win.IA32\include\unicode
     [exec]    [delete] Deleting: C:\continuum-1.0.2\apps\continuum\working-directory\6\classlib\native-src\win.IA32\text\icuuc.lib

     [exec] make-clean:

     [exec]      [exec] Microsoft (R) Program Maintenance Utility Version 7.10.3077
     [exec]      [exec] Copyright (C) Microsoft Corporation.  All rights reserved.

     [exec]      [exec] 	cd auth
     [exec]      [exec] 	nmake /NOLOGO clean
     [exec]      [exec] 	del ..\..\shared\auth\auth_copyright.obj authwin32.obj *.res *.pdb  ..\lib\hyauth.lib ..\lib\hyauth.exp ..\lib\hyauth.map  ..\hyauth.dll  >nul 2>&1
     [exec]      [exec] 	cd ..
     [exec]      [exec] 	cd archive
     [exec]      [exec] 	nmake /NOLOGO clean
     [exec]      [exec] 	del ..\..\shared\archive\archive_copyright.obj ..\..\shared\archive\jclcrc32.obj  ..\..\shared\archive\zip.obj ..\..\shared\archive\adler32.obj ..\..\shared\archive\inflater.obj  ..\..\shared\archive\jarfile.obj ..\..\shared\archive\deflater.obj  ..\..\shared\archive\archiveglob.obj *.res *.pdb  ..\lib\hyarchive.lib ..\lib\hyarchive.exp ..\lib\hyarchive.map  ..\hyarchive.dll  >nul 2>&1
     [exec]      [exec] 	cd ..
     [exec]      [exec] 	cd launcher
     [exec]      [exec] 	nmake /NOLOGO clean
     [exec]      [exec] 	nmake /NOLOGO -f makefile.javae clean
     [exec]      [exec] 	del ..\..\shared\launcher\launcher_copyright.obj ..\..\shared\launcher\cmain.obj  ..\..\shared\launcher\main.obj ..\..\shared\launcher\strbuf.obj ..\..\shared\launcher\libhlp.obj *.res *.pdb       ..\java.exe >nul 2>&1
     [exec]      [exec] 	nmake /NOLOGO -f makefile.javaw clean
     [exec]      [exec] 	del ..\..\shared\launcher\launcher_copyright.obj ..\..\shared\launcher\main.obj  winmain.obj ..\..\shared\launcher\strbuf.obj ..\..\shared\launcher\libhlp.obj *.res *.pdb       ..\javaw.exe >nul 2>&1
     [exec]      [exec] 	cd ..
     [exec]      [exec] 	cd common
     [exec]      [exec] 	nmake /NOLOGO clean
     [exec]      [exec] 	del ..\..\shared\common\libglob.obj ..\..\shared\common\iohelp.obj  locklbl.obj lock386.obj  ..\..\shared\common\utf8decode.obj ..\..\shared\common\utf8encode.obj *.res *.pdb  ..\lib\hycommon.lib ..\lib\hycommon.exp ..\lib\hycommon.map    >nul 2>&1
     [exec]      [exec] 	cd ..
     [exec]      [exec] 	cd luni
     [exec]      [exec] 	nmake /NOLOGO clean
     [exec]      [exec] 	del ..\..\shared\luni\luni_copyright.obj ..\..\shared\luni\file.obj procimpl.obj  ..\..\shared\luni\oos.obj  ..\..\shared\luni\nethelp.obj ..\..\shared\luni\floatbits.obj  ..\..\shared\luni\ois.obj helpers.obj ..\..\shared\luni\math.obj  ..\..\shared\luni\luniglob.obj ..\..\shared\luni\proxy.obj ..\..\shared\luni\netif.obj  ..\..\shared\luni\cbigint.obj ..\..\shared\luni\dblparse.obj ..\..\shared\luni\fltparse.obj  ..\..\shared\luni\process.obj ..\..\shared\luni\bigint.obj ..\..\shared\luni\osc.obj  ..\..\shared\luni\socket.obj ..\..\shared\luni\inetadds.obj  ..\..\shared\luni\filedesc.obj ..\..\shared\luni\timezone.obj  OSFileSystemWin32.obj  ..\..\shared\luni\OSFileSystem.obj OSMemoryWin32.obj OSMemory.obj  ..\..\shared\luni\OSNetworkSystem.obj OSNetworkSystemWin32.obj *.res *.pdb  ..\lib\hyluni.lib ..\lib\hyluni.exp ..\lib\hyluni.map  ..\hyluni.dll  >nul 2>&1
     [exec]      [exec] 	cd ..
     [exec]      [exec] 	cd text
     [exec]      [exec] 	nmake /NOLOGO clean
     [exec]      [exec] 	del text_copyright.obj ..\..\shared\text\BidiWrapper.obj *.res *.pdb  ..\lib\hytext.lib ..\lib\hytext.exp ..\lib\hytext.map  ..\hytext.dll  >nul 2>&1
     [exec]      [exec] 	cd ..
     [exec]      [exec] 	cd vmi
     [exec]      [exec] 	nmake /NOLOGO clean
     [exec]      [exec] 	del ..\..\shared\vmi\vmi_copyright.obj ..\..\shared\vmi\vmi.obj *.res *.pdb  ..\lib\vmi.lib ..\lib\vmi.exp ..\lib\vmi.map    >nul 2>&1
     [exec]      [exec] 	cd ..
     [exec]      [exec] 	cd fdlibm
     [exec]      [exec] 	nmake /NOLOGO clean
     [exec]      [exec] 	del *.obj dist\*.obj
     [exec]      [exec] The system cannot find the file specified.
     [exec]      [exec] 	del ..\lib\..\lib\hyfdlibm.lib
     [exec]      [exec] 	del ..\lib\hyfdlibm.pdb
     [exec]      [exec] Could Not Find C:\continuum-1.0.2\apps\continuum\working-directory\6\classlib\native-src\win.IA32\lib\hyfdlibm.pdb
     [exec]      [exec] 	cd ..
     [exec]      [exec] 	cd sig
     [exec]      [exec] 	nmake /NOLOGO clean
     [exec]      [exec] 	del ..\..\shared\sig\hysig_copyright.obj hysigwin.obj *.res *.pdb  ..\lib\hysig.lib ..\lib\hysig.exp ..\lib\hysig.map  ..\hysig.dll  >nul 2>&1
     [exec]      [exec] 	cd ..
     [exec]      [exec] 	cd pool
     [exec]      [exec] 	nmake /NOLOGO clean
     [exec]      [exec] 	del ..\..\shared\pool\pool.obj ..\..\shared\pool\pool_cap.obj *.res *.pdb  ..\lib\hypool.lib ..\lib\hypool.exp ..\lib\hypool.map    >nul 2>&1
     [exec]      [exec] 	cd ..
     [exec]      [exec] 	cd port
     [exec]      [exec] 	nmake /NOLOGO clean
     [exec]      [exec] 	del ..\..\shared\port\port_copyright.obj hycpu.obj ..\..\shared\port\hyerror.obj  hyerrorhelpers.obj ..\..\shared\port\hyexit.obj hyfile.obj hyfiletext.obj  ..\..\shared\port\hygp.obj hyipcmutex.obj hymem.obj hymmap.obj  ..\..\shared\port\hynls.obj hynlshelpers.obj hyosdump.obj ..\..\shared\port\hyport.obj  ..\..\shared\port\hyportcontrol.obj hyportptb.obj hyshmem.obj hyshsem.obj  hysignal.obj hysl.obj hysock.obj ..\..\shared\port\hystr.obj  ..\..\shared\port\hystrftime.obj ..\..\shared\port\hystsl.obj hysysinfo.obj hytime.obj  ..\..\shared\port\hytlshelpers.obj hytty.obj hyvmem.obj *.res *.pdb  ..\lib\hyprt.lib ..\lib\hyprt.exp ..\lib\hyprt.map  ..\hyprt.dll  >nul 2>&1
     [exec]      [exec] 	cd ..
     [exec]      [exec] 	cd thread
     [exec]      [exec] 	nmake /NOLOGO clean
     [exec]      [exec] 	del ..\..\shared\thread\thread_copyright.obj thrhelp.obj thrspinlock.obj hythread.obj  ..\..\shared\thread\hythreadinspect.obj ..\..\shared\thread\rwmutex.obj thrdsup.obj  ..\..\shared\thread\thrprof.obj *.res *.pdb  ..\lib\hythr.lib ..\lib\hythr.exp ..\lib\hythr.map  ..\hythr.dll  >nul 2>&1
     [exec]      [exec] 	cd ..
     [exec]      [exec] 	cd zip
     [exec]      [exec] 	nmake /NOLOGO clean
     [exec]      [exec] 	del ..\..\shared\zip\zcpool.obj ..\..\shared\zip\zipalloc.obj  ..\..\shared\zip\zipcache.obj ..\..\shared\zip\zipsup.obj *.res *.pdb  ..\lib\hyzip.lib ..\lib\hyzip.exp ..\lib\hyzip.map    >nul 2>&1
     [exec]      [exec] 	cd ..
     [exec]      [exec] 	cd zlib
     [exec]      [exec] 	nmake /NOLOGO clean
     [exec]      [exec] 	del ..\..\shared\zlib\zlib_copyright.obj dist\adler32.obj dist\compress.obj  dist\crc32.obj dist\deflate.obj dist\gzio.obj dist\infback.obj  dist\inffast.obj dist\inflate.obj dist\inftrees.obj dist\trees.obj  dist\uncompr.obj dist\zutil.obj *.res *.pdb  ..\lib\hyzlib.lib ..\lib\hyzlib.exp ..\lib\hyzlib.map  ..\hyzlib.dll  >nul 2>&1
     [exec]      [exec] 	cd ..
     [exec]      [exec] 	cd prefs
     [exec]      [exec] 	nmake /NOLOGO clean
     [exec]      [exec] 	del prefs_copyright.obj PreferencesImpl.obj *.res *.pdb  ..\lib\hyprefs.lib ..\lib\hyprefs.exp ..\lib\hyprefs.map  ..\hyprefs.dll  >nul 2>&1
     [exec]      [exec] 	cd ..
     [exec]      [exec] 	cd vmls
     [exec]      [exec] 	nmake /NOLOGO clean
     [exec]      [exec] 	del ..\..\shared\vmls\vmls.obj *.res *.pdb  ..\lib\hyvmls.lib ..\lib\hyvmls.exp ..\lib\hyvmls.map    >nul 2>&1
     [exec]      [exec] 	cd ..

     [exec] clean-layout:
     [exec]    [delete] C:\continuum-1.0.2\apps\continuum\working-directory\6\classlib\deploy not found.

     [exec] clean:

     [exec] build:
     [exec]      [echo] 
     [exec]      [echo] ========================================
     [exec]      [echo] Building Java component archives...
     [exec]      [echo] ========================================

     [exec] copy-resources:
     [exec]     [mkdir] Created dir: C:\continuum-1.0.2\apps\continuum\working-directory\6\classlib\build
     [exec]      [copy] Copying 208 files to C:\continuum-1.0.2\apps\continuum\working-directory\6\classlib\build

     [exec] prepare-depends:

     [exec] check:
     [exec]      [echo] Checking for depends/jars/xalan-j_2.6.0/xalan.jar
     [exec]      [echo] Checking for depends/jars/xerces_2.6.2/resolver.jar
     [exec]      [echo] Checking for depends/jars/xerces_2.6.2/xercesImpl.jar
     [exec]      [echo] Checking for depends/jars/xerces_2.6.2/xml-apis.jar
     [exec]      [echo] Checking for depends/jars/junit_3.8.1/junit.jar
     [exec]      [echo] Checking for depends/jars/bcprov-jdk14-132/signed.bcprov.jar
     [exec]      [echo] Checking for depends/jars/icu4j_3.4.4/icu4j_3_4_4.jar

     [exec] create-unsigned-bcprov-jar:

     [exec] check-win:
     [exec]      [echo] Checking for depends/libs/win.IA32/msvcr71.dll

     [exec] compile:
     [exec]     [javac] Compiling 1658 source files to C:\continuum-1.0.2\apps\continuum\working-directory\6\classlib\build
     [exec]     [javac] Note: * uses or overrides a deprecated API.
     [exec]     [javac] Note: Recompile with -Xlint:deprecation for details.
     [exec]     [javac] Note: Some input files use unchecked or unsafe operations.
     [exec]     [javac] Note: Recompile with -Xlint:unchecked for details.
     [exec]     [mkdir] Created dir: C:\continuum-1.0.2\apps\continuum\working-directory\6\classlib\deploy\jre\lib\boot

     [exec] init:
     [exec]      [echo] build-date=20060516
     [exec]      [echo] build-time=20060516_1505
     [exec]      [echo] on platform=Windows XP version=5.1 build 2600 Service Pack 2 arch=x86

     [exec] build:

     [exec] compile.java:
     [exec]      [echo] Compiling APPLET classes from C:\continuum-1.0.2\apps\continuum\working-directory\6\classlib\modules\applet\src\main\java

     [exec] build.jar:
     [exec]       [jar] Building jar: C:\continuum-1.0.2\apps\continuum\working-directory\6\classlib\deploy\jre\lib\boot\applet.jar

     [exec] copy.resources:

     [exec] init:
     [exec]      [echo] build-date=20060516
     [exec]      [echo] build-time=20060516_1505
     [exec]      [echo] on platform=Windows XP version=5.1 build 2600 Service Pack 2 arch=x86

     [exec] build:

     [exec] compile.java:
     [exec]      [echo] Compiling ARCHIVE classes from C:\continuum-1.0.2\apps\continuum\working-directory\6\classlib\modules\archive\src\main\java

     [exec] build.jar:
     [exec]       [jar] Building jar: C:\continuum-1.0.2\apps\continuum\working-directory\6\classlib\deploy\jre\lib\boot\archive.jar

     [exec] copy.resources:

     [exec] init:
     [exec]      [echo] build-date=20060516
     [exec]      [echo] build-time=20060516_1505
     [exec]      [echo] on platform=Windows XP version=5.1 build 2600 Service Pack 2 arch=x86

     [exec] build:

     [exec] compile.java:
     [exec]      [echo] Compiling AUTH classes from C:\continuum-1.0.2\apps\continuum\working-directory\6\classlib\modules\auth\src\main\java\common

     [exec] build.jar:
     [exec]       [jar] Building jar: C:\continuum-1.0.2\apps\continuum\working-directory\6\classlib\deploy\jre\lib\boot\auth.jar

     [exec] copy.resources:

     [exec] init:
     [exec]      [echo] build-date=20060516
     [exec]      [echo] build-time=20060516_1505
     [exec]      [echo] on platform=Windows XP version=5.1 build 2600 Service Pack 2 arch=x86

     [exec] build:

     [exec] compile.java:
     [exec]      [echo] Compiling AWT classes from C:\continuum-1.0.2\apps\continuum\working-directory\6\classlib\modules\awt\src\main\java

     [exec] build.jar:
     [exec]       [jar] Building jar: C:\continuum-1.0.2\apps\continuum\working-directory\6\classlib\deploy\jre\lib\boot\awt.jar

     [exec] copy.resources:

     [exec] init:
     [exec]      [echo] build-date=20060516
     [exec]      [echo] build-time=20060516_1505
     [exec]      [echo] on platform=Windows XP version=5.1 build 2600 Service Pack 2 arch=x86

     [exec] build:

     [exec] compile.java:
     [exec]      [echo] Compiling BEANS classes from C:\continuum-1.0.2\apps\continuum\working-directory\6\classlib\modules\beans\src\main\java

     [exec] build.jar:
     [exec]       [jar] Building jar: C:\continuum-1.0.2\apps\continuum\working-directory\6\classlib\deploy\jre\lib\boot\beans.jar

     [exec] copy.resources:

     [exec] init:
     [exec]      [echo] build-date=20060516
     [exec]      [echo] build-time=20060516_1505
     [exec]      [echo] on platform=Windows XP version=5.1 build 2600 Service Pack 2 arch=x86

     [exec] build:

     [exec] compile.java:
     [exec]      [echo] Compiling CRYPTO classes from C:\continuum-1.0.2\apps\continuum\working-directory\6\classlib\modules\crypto\src\main\java

     [exec] build.jar:
     [exec]       [jar] Building jar: C:\continuum-1.0.2\apps\continuum\working-directory\6\classlib\deploy\jre\lib\boot\crypto.jar

     [exec] copy.resources:

     [exec] init:
     [exec]      [echo] build-date=20060516
     [exec]      [echo] build-time=20060516_1505
     [exec]      [echo] on platform=Windows XP version=5.1 build 2600 Service Pack 2 arch=x86

     [exec] build:

     [exec] compile.java:
     [exec]      [echo] Compiling JNDI classes from C:\continuum-1.0.2\apps\continuum\working-directory\6\classlib\modules\jndi\src\main\java

     [exec] build.jar:
     [exec]       [jar] Building jar: C:\continuum-1.0.2\apps\continuum\working-directory\6\classlib\deploy\jre\lib\boot\jndi.jar

     [exec] copy.resources:

     [exec] init:
     [exec]      [echo] build-date=20060516
     [exec]      [echo] build-time=20060516_1505
     [exec]      [echo] on platform=Windows XP version=5.1 build 2600 Service Pack 2 arch=x86

     [exec] build:

     [exec] copy.resources:
     [exec]      [copy] Copying 1 file to C:\continuum-1.0.2\apps\continuum\working-directory\6\classlib\deploy\jre\lib

     [exec] compile.java:
     [exec]      [echo] Compiling LOGGING classes from C:\continuum-1.0.2\apps\continuum\working-directory\6\classlib\modules\logging\src\main\java

     [exec] build.jar:
     [exec]       [jar] Building jar: C:\continuum-1.0.2\apps\continuum\working-directory\6\classlib\deploy\jre\lib\boot\logging.jar

     [exec] copy.resources:
     [exec]      [copy] Copying 1 file to C:\continuum-1.0.2\apps\continuum\working-directory\6\classlib\deploy\jre\lib

     [exec] build:
     [exec]       [jar] Building jar: C:\continuum-1.0.2\apps\continuum\working-directory\6\classlib\deploy\jre\lib\boot\luni-kernel-stubs.jar

     [exec] init:
     [exec]      [echo] build-date=20060516
     [exec]      [echo] build-time=20060516_1505
     [exec]      [echo] on platform=Windows XP version=5.1 build 2600 Service Pack 2 arch=x86

     [exec] build:

     [exec] copy.resources:
     [exec]     [mkdir] Created dir: C:\continuum-1.0.2\apps\continuum\working-directory\6\classlib\modules\luni\bin\main
     [exec]      [copy] Copying 2 files to C:\continuum-1.0.2\apps\continuum\working-directory\6\classlib\modules\luni\bin\main

     [exec] compile.java:
     [exec]      [echo] Compiling LUNI classes from C:\continuum-1.0.2\apps\continuum\working-directory\6\classlib\modules\luni\src\main\java

     [exec] build.jar:
     [exec]       [jar] Building jar: C:\continuum-1.0.2\apps\continuum\working-directory\6\classlib\deploy\jre\lib\boot\luni.jar

     [exec] copy.resources:

     [exec] init:
     [exec]      [echo] build-date=20060516
     [exec]      [echo] build-time=20060516_1505
     [exec]      [echo] on platform=Windows XP version=5.1 build 2600 Service Pack 2 arch=x86

     [exec] build:

     [exec] compile.java:
     [exec]      [echo] Compiling MATH classes from C:\continuum-1.0.2\apps\continuum\working-directory\6\classlib\modules\math\src\main\java

     [exec] build.jar:
     [exec]       [jar] Building jar: C:\continuum-1.0.2\apps\continuum\working-directory\6\classlib\deploy\jre\lib\boot\math.jar

     [exec] copy.resources:

     [exec] init:
     [exec]      [echo] build-date=20060516
     [exec]      [echo] build-time=20060516_1505
     [exec]      [echo] on platform=Windows XP version=5.1 build 2600 Service Pack 2 arch=x86

     [exec] build:

     [exec] compile.java:
     [exec]      [echo] Compiling NIO classes from C:\continuum-1.0.2\apps\continuum\working-directory\6\classlib\modules\nio\src\main\java

     [exec] build.jar:
     [exec]       [jar] Building jar: C:\continuum-1.0.2\apps\continuum\working-directory\6\classlib\deploy\jre\lib\boot\nio.jar

     [exec] copy.resources:

     [exec] init:
     [exec]      [echo] build-date=20060516
     [exec]      [echo] build-time=20060516_1505
     [exec]      [echo] on platform=Windows XP version=5.1 build 2600 Service Pack 2 arch=x86

     [exec] build:

     [exec] compile.java:
     [exec]      [echo] Compiling NIO_CHAR classes from C:\continuum-1.0.2\apps\continuum\working-directory\6\classlib\modules\nio_char\src\main\java

     [exec] build.jar:
     [exec]       [jar] Building jar: C:\continuum-1.0.2\apps\continuum\working-directory\6\classlib\deploy\jre\lib\boot\nio_char.jar

     [exec] copy.resources:

     [exec] init:
     [exec]      [echo] build-date=20060516
     [exec]      [echo] build-time=20060516_1505
     [exec]      [echo] on platform=Windows XP version=5.1 build 2600 Service Pack 2 arch=x86

     [exec] build:

     [exec] compile.java:
     [exec]      [echo] Compiling PREFS classes from C:\continuum-1.0.2\apps\continuum\working-directory\6\classlib\modules\prefs\src\main\java

     [exec] build.jar:
     [exec]       [jar] Building jar: C:\continuum-1.0.2\apps\continuum\working-directory\6\classlib\deploy\jre\lib\boot\prefs.jar

     [exec] copy.resources:

     [exec] init:
     [exec]      [echo] build-date=20060516
     [exec]      [echo] build-time=20060516_1505
     [exec]      [echo] on platform=Windows XP version=5.1 build 2600 Service Pack 2 arch=x86

     [exec] build:

     [exec] compile.java:
     [exec]      [echo] Compiling REGEX classes from C:\continuum-1.0.2\apps\continuum\working-directory\6\classlib\modules\regex\src\main\java

     [exec] build.jar:
     [exec]       [jar] Building jar: C:\continuum-1.0.2\apps\continuum\working-directory\6\classlib\deploy\jre\lib\boot\regex.jar

     [exec] copy.resources:

     [exec] build:

     [exec] clean:

     [exec] compile:
     [exec]     [mkdir] Created dir: C:\continuum-1.0.2\apps\continuum\working-directory\6\classlib\modules\rmi2\build\classes

     [exec] BUILD FAILED
     [exec] C:\continuum-1.0.2\apps\continuum\working-directory\6\classlib\make\build.xml:39: The following error occurred while executing this line:
     [exec] C:\continuum-1.0.2\apps\continuum\working-directory\6\classlib\make\build-java.xml:118: The following error occurred while executing this line:
     [exec] C:\continuum-1.0.2\apps\continuum\working-directory\6\classlib\make\properties.xml:159: The following error occurred while executing this line:
     [exec] C:\continuum-1.0.2\apps\continuum\working-directory\6\classlib\modules\rmi2\make\build.xml:106: The following error occurred while executing this line:
     [exec] C:\continuum-1.0.2\apps\continuum\working-directory\6\classlib\modules\rmi2\make\build.xml:68: srcdir "C:\continuum-1.0.2\apps\continuum\working-directory\6\classlib\modules\rmi2\${package}" does not exist!

     [exec] Total time: 59 seconds

copy-depends:
     [echo] Copying VME to C:\continuum-1.0.2\apps\continuum\working-directory\6/classlib/deploy
     [copy] Copying 44 files to C:\continuum-1.0.2\apps\continuum\working-directory\6\classlib\deploy\jre\bin\default

run-tests:
     [exec] Buildfile: build-test.xml

     [exec] clean:

     [exec] copy-test-resources:
     [exec]     [mkdir] Created dir: C:\continuum-1.0.2\apps\continuum\working-directory\6\classlib\build\tests
     [exec]      [copy] Copying 63 files to C:\continuum-1.0.2\apps\continuum\working-directory\6\classlib\build\tests

     [exec] check-support-jars:

     [exec] check:
     [exec]      [echo] Checking for depends/jars/xalan-j_2.6.0/xalan.jar
     [exec]      [echo] Checking for depends/jars/xerces_2.6.2/resolver.jar
     [exec]      [echo] Checking for depends/jars/xerces_2.6.2/xercesImpl.jar
     [exec]      [echo] Checking for depends/jars/xerces_2.6.2/xml-apis.jar
     [exec]      [echo] Checking for depends/jars/junit_3.8.1/junit.jar
     [exec]      [echo] Checking for depends/jars/bcprov-jdk14-132/signed.bcprov.jar
     [exec]      [echo] Checking for depends/jars/icu4j_3.4.4/icu4j_3_4_4.jar

     [exec] create-unsigned-bcprov-jar:

     [exec] check-win:
     [exec]      [echo] Checking for depends/libs/win.IA32/msvcr71.dll

     [exec] compile-support:
     [exec]     [javac] Compiling 53 source files to C:\continuum-1.0.2\apps\continuum\working-directory\6\classlib\build\tests
     [exec]     [javac] C:\continuum-1.0.2\apps\continuum\working-directory\6\classlib\support\src\test\java\tests\support\Support_DecimalFormat.java:18: package java.text does not exist
     [exec]     [javac] import java.text.DecimalFormat;
     [exec]     [javac]                  ^
     [exec]     [javac] C:\continuum-1.0.2\apps\continuum\working-directory\6\classlib\support\src\test\java\tests\support\Support_DecimalFormat.java:19: package java.text does not exist
     [exec]     [javac] import java.text.NumberFormat;
     [exec]     [javac]                  ^
     [exec]     [javac] C:\continuum-1.0.2\apps\continuum\working-directory\6\classlib\support\src\test\java\tests\support\Support_Format.java:18: package java.text does not exist
     [exec]     [javac] import java.text.AttributedCharacterIterator;
     [exec]     [javac]                  ^
     [exec]     [javac] C:\continuum-1.0.2\apps\continuum\working-directory\6\classlib\support\src\test\java\tests\support\Support_Format.java:19: package java.text does not exist
     [exec]     [javac] import java.text.FieldPosition;
     [exec]     [javac]                  ^
     [exec]     [javac] C:\continuum-1.0.2\apps\continuum\working-directory\6\classlib\support\src\test\java\tests\support\Support_Format.java:20: package java.text does not exist
     [exec]     [javac] import java.text.Format;
     [exec]     [javac]                  ^
     [exec]     [javac] C:\continuum-1.0.2\apps\continuum\working-directory\6\classlib\support\src\test\java\tests\support\Support_Format.java:21: package java.text.AttributedCharacterIterator does not exist
     [exec]     [javac] import java.text.AttributedCharacterIterator.Attribute;
     [exec]     [javac]                                              ^
     [exec]     [javac] C:\continuum-1.0.2\apps\continuum\working-directory\6\classlib\support\src\test\java\tests\support\Support_Format.java:33: cannot find symbol
     [exec]     [javac] symbol  : class Format
     [exec]     [javac] location: class tests.support.Support_Format
     [exec]     [javac] 	protected void t_FormatWithField(int count, Format format, Object object,
     [exec]     [javac]                                                     ^
     [exec]     [javac] C:\continuum-1.0.2\apps\continuum\working-directory\6\classlib\support\src\test\java\tests\support\Support_Format.java:34: package Format does not exist
     [exec]     [javac] 			String text, Format.Field field, int begin, int end) {
     [exec]     [javac]                                            ^
     [exec]     [javac] C:\continuum-1.0.2\apps\continuum\working-directory\6\classlib\support\src\test\java\tests\support\Support_Format.java:55: cannot find symbol
     [exec]     [javac] symbol  : class Format
     [exec]     [javac] location: class tests.support.Support_Format
     [exec]     [javac] 	protected void t_Format(int count, Object object, Format format,
     [exec]     [javac]                                                           ^
     [exec]     [javac] C:\continuum-1.0.2\apps\continuum\working-directory\6\classlib\support\src\test\java\tests\support\Support_Format.java:80: cannot find symbol
     [exec]     [javac] symbol  : class AttributedCharacterIterator
     [exec]     [javac] location: class tests.support.Support_Format
     [exec]     [javac] 	protected static Vector findFields(AttributedCharacterIterator iterator) {
     [exec]     [javac]                                            ^
     [exec]     [javac] C:\continuum-1.0.2\apps\continuum\working-directory\6\classlib\support\src\test\java\tests\support\Support_DummyPKCS12Keystore.java:21: package java.security does not exist
     [exec]     [javac] import java.security.Key;
     [exec]     [javac]                      ^
     [exec]     [javac] C:\continuum-1.0.2\apps\continuum\working-directory\6\classlib\support\src\test\java\tests\support\Support_DummyPKCS12Keystore.java:22: package java.security does not exist
     [exec]     [javac] import java.security.KeyStoreException;
     [exec]     [javac]                      ^
     [exec]     [javac] C:\continuum-1.0.2\apps\continuum\working-directory\6\classlib\support\src\test\java\tests\support\Support_DummyPKCS12Keystore.java:23: package java.security does not exist
     [exec]     [javac] import java.security.KeyStoreSpi;
     [exec]     [javac]                      ^
     [exec]     [javac] C:\continuum-1.0.2\apps\continuum\working-directory\6\classlib\support\src\test\java\tests\support\Support_DummyPKCS12Keystore.java:24: package java.security does not exist
     [exec]     [javac] import java.security.NoSuchAlgorithmException;
     [exec]     [javac]                      ^
     [exec]     [javac] C:\continuum-1.0.2\apps\continuum\working-directory\6\classlib\support\src\test\java\tests\support\Support_DummyPKCS12Keystore.java:25: package java.security does not exist
     [exec]     [javac] import java.security.UnrecoverableKeyException;
     [exec]     [javac]                      ^
     [exec]     [javac] C:\continuum-1.0.2\apps\continuum\working-directory\6\classlib\support\src\test\java\tests\support\Support_DummyPKCS12Keystore.java:26: package java.security.cert does not exist
     [exec]     [javac] import java.security.cert.Certificate;
     [exec]     [javac]                           ^
     [exec]     [javac] C:\continuum-1.0.2\apps\continuum\working-directory\6\classlib\support\src\test\java\tests\support\Support_DummyPKCS12Keystore.java:27: package java.security.cert does not exist
     [exec]     [javac] import java.security.cert.CertificateException;
     [exec]     [javac]                           ^
     [exec]     [javac] C:\continuum-1.0.2\apps\continuum\working-directory\6\classlib\support\src\test\java\tests\support\Support_DummyPKCS12Keystore.java:34: cannot find symbol
     [exec]     [javac] symbol: class KeyStoreSpi
     [exec]     [javac] public class Support_DummyPKCS12Keystore extends KeyStoreSpi {
     [exec]     [javac]                                                  ^
     [exec]     [javac] C:\continuum-1.0.2\apps\continuum\working-directory\6\classlib\support\src\test\java\tests\support\Support_DummyPKCS12Keystore.java:49: cannot find symbol
     [exec]     [javac] symbol  : class Key
     [exec]     [javac] location: class tests.support.Support_DummyPKCS12Keystore
     [exec]     [javac] 	public Key engineGetKey(String arg0, char[] arg1)
     [exec]     [javac]                ^
     [exec]     [javac] C:\continuum-1.0.2\apps\continuum\working-directory\6\classlib\support\src\test\java\tests\support\Support_DummyPKCS12Keystore.java:50: cannot find symbol
     [exec]     [javac] symbol  : class NoSuchAlgorithmException
     [exec]     [javac] location: class tests.support.Support_DummyPKCS12Keystore
     [exec]     [javac] 			throws NoSuchAlgorithmException, UnrecoverableKeyException {
     [exec]     [javac]                                ^
     [exec]     [javac] C:\continuum-1.0.2\apps\continuum\working-directory\6\classlib\support\src\test\java\tests\support\Support_DummyPKCS12Keystore.java:50: cannot find symbol
     [exec]     [javac] symbol  : class UnrecoverableKeyException
     [exec]     [javac] location: class tests.support.Support_DummyPKCS12Keystore
     [exec]     [javac] 			throws NoSuchAlgorithmException, UnrecoverableKeyException {
     [exec]     [javac]                                                          ^
     [exec]     [javac] C:\continuum-1.0.2\apps\continuum\working-directory\6\classlib\support\src\test\java\tests\support\Support_DummyPKCS12Keystore.java:60: cannot find symbol
     [exec]     [javac] symbol  : class Certificate
     [exec]     [javac] location: class tests.support.Support_DummyPKCS12Keystore
     [exec]     [javac] 	public Certificate[] engineGetCertificateChain(String arg0) {
     [exec]     [javac]                ^
     [exec]     [javac] C:\continuum-1.0.2\apps\continuum\working-directory\6\classlib\support\src\test\java\tests\support\Support_DummyPKCS12Keystore.java:70: cannot find symbol
     [exec]     [javac] symbol  : class Certificate
     [exec]     [javac] location: class tests.support.Support_DummyPKCS12Keystore
     [exec]     [javac] 	public Certificate engineGetCertificate(String arg0) {
     [exec]     [javac]                ^
     [exec]     [javac] C:\continuum-1.0.2\apps\continuum\working-directory\6\classlib\support\src\test\java\tests\support\Support_DummyPKCS12Keystore.java:91: cannot find symbol
     [exec]     [javac] symbol  : class Key
     [exec]     [javac] location: class tests.support.Support_DummyPKCS12Keystore
     [exec]     [javac] 	public void engineSetKeyEntry(String arg0, Key arg1, char[] arg2,
     [exec]     [javac]                                                    ^
     [exec]     [javac] C:\continuum-1.0.2\apps\continuum\working-directory\6\classlib\support\src\test\java\tests\support\Support_DummyPKCS12Keystore.java:92: cannot find symbol
     [exec]     [javac] symbol  : class Certificate
     [exec]     [javac] location: class tests.support.Support_DummyPKCS12Keystore
     [exec]     [javac] 			Certificate[] arg3) throws KeyStoreException {
     [exec]     [javac]                         ^
     [exec]     [javac] C:\continuum-1.0.2\apps\continuum\working-directory\6\classlib\support\src\test\java\tests\support\Support_DummyPKCS12Keystore.java:92: cannot find symbol
     [exec]     [javac] symbol  : class KeyStoreException
     [exec]     [javac] location: class tests.support.Support_DummyPKCS12Keystore
     [exec]     [javac] 			Certificate[] arg3) throws KeyStoreException {
     [exec]     [javac]                                                    ^
     [exec]     [javac] C:\continuum-1.0.2\apps\continuum\working-directory\6\classlib\support\src\test\java\tests\support\Support_DummyPKCS12Keystore.java:103: cannot find symbol
     [exec]     [javac] symbol  : class Certificate
     [exec]     [javac] location: class tests.support.Support_DummyPKCS12Keystore
     [exec]     [javac] 	public void engineSetKeyEntry(String arg0, byte[] arg1, Certificate[] arg2)
     [exec]     [javac]                                                                 ^
     [exec]     [javac] C:\continuum-1.0.2\apps\continuum\working-directory\6\classlib\support\src\test\java\tests\support\Support_DummyPKCS12Keystore.java:104: cannot find symbol
     [exec]     [javac] symbol  : class KeyStoreException
     [exec]     [javac] location: class tests.support.Support_DummyPKCS12Keystore
     [exec]     [javac] 			throws KeyStoreException {
     [exec]     [javac]                                ^
     [exec]     [javac] C:\continuum-1.0.2\apps\continuum\working-directory\6\classlib\support\src\test\java\tests\support\Support_DummyPKCS12Keystore.java:115: cannot find symbol
     [exec]     [javac] symbol  : class Certificate
     [exec]     [javac] location: class tests.support.Support_DummyPKCS12Keystore
     [exec]     [javac] 	public void engineSetCertificateEntry(String arg0, Certificate arg1)
     [exec]     [javac]                                                            ^
     [exec]     [javac] C:\continuum-1.0.2\apps\continuum\working-directory\6\classlib\support\src\test\java\tests\support\Support_DummyPKCS12Keystore.java:116: cannot find symbol
     [exec]     [javac] symbol  : class KeyStoreException
     [exec]     [javac] location: class tests.support.Support_DummyPKCS12Keystore
     [exec]     [javac] 			throws KeyStoreException {
     [exec]     [javac]                                ^
     [exec]     [javac] C:\continuum-1.0.2\apps\continuum\working-directory\6\classlib\support\src\test\java\tests\support\Support_DummyPKCS12Keystore.java:126: cannot find symbol
     [exec]     [javac] symbol  : class KeyStoreException
     [exec]     [javac] location: class tests.support.Support_DummyPKCS12Keystore
     [exec]     [javac] 	public void engineDeleteEntry(String arg0) throws KeyStoreException {
     [exec]     [javac]                                                           ^
     [exec]     [javac] C:\continuum-1.0.2\apps\continuum\working-directory\6\classlib\support\src\test\java\tests\support\Support_DummyPKCS12Keystore.java:186: cannot find symbol
     [exec]     [javac] symbol  : class Certificate
     [exec]     [javac] location: class tests.support.Support_DummyPKCS12Keystore
     [exec]     [javac] 	public String engineGetCertificateAlias(Certificate arg0) {
     [exec]     [javac]                                                 ^
     [exec]     [javac] C:\continuum-1.0.2\apps\continuum\working-directory\6\classlib\support\src\test\java\tests\support\Support_DummyPKCS12Keystore.java:197: cannot find symbol
     [exec]     [javac] symbol  : class NoSuchAlgorithmException
     [exec]     [javac] location: class tests.support.Support_DummyPKCS12Keystore
     [exec]     [javac] 			NoSuchAlgorithmException, CertificateException {
     [exec]     [javac]                         ^
     [exec]     [javac] C:\continuum-1.0.2\apps\continuum\working-directory\6\classlib\support\src\test\java\tests\support\Support_DummyPKCS12Keystore.java:197: cannot find symbol
     [exec]     [javac] symbol  : class CertificateException
     [exec]     [javac] location: class tests.support.Support_DummyPKCS12Keystore
     [exec]     [javac] 			NoSuchAlgorithmException, CertificateException {
     [exec]     [javac]                                                   ^
     [exec]     [javac] C:\continuum-1.0.2\apps\continuum\working-directory\6\classlib\support\src\test\java\tests\support\Support_DummyPKCS12Keystore.java:208: cannot find symbol
     [exec]     [javac] symbol  : class NoSuchAlgorithmException
     [exec]     [javac] location: class tests.support.Support_DummyPKCS12Keystore
     [exec]     [javac] 			NoSuchAlgorithmException, CertificateException {
     [exec]     [javac]                         ^
     [exec]     [javac] C:\continuum-1.0.2\apps\continuum\working-directory\6\classlib\support\src\test\java\tests\support\Support_DummyPKCS12Keystore.java:208: cannot find symbol
     [exec]     [javac] symbol  : class CertificateException
     [exec]     [javac] location: class tests.support.Support_DummyPKCS12Keystore
     [exec]     [javac] 			NoSuchAlgorithmException, CertificateException {
     [exec]     [javac]                                                   ^
     [exec]     [javac] C:\continuum-1.0.2\apps\continuum\working-directory\6\classlib\support\src\test\java\tests\support\Support_Format.java:105: package AttributedCharacterIterator does not exist
     [exec]     [javac] 		AttributedCharacterIterator.Attribute attribute;
     [exec]     [javac]                                            ^
     [exec]     [javac] C:\continuum-1.0.2\apps\continuum\working-directory\6\classlib\support\src\test\java\tests\support\Support_Format.java:111: package AttributedCharacterIterator does not exist
     [exec]     [javac] 				AttributedCharacterIterator.Attribute attribute) {
     [exec]     [javac]                                                            ^
     [exec]     [javac] C:\continuum-1.0.2\apps\continuum\working-directory\6\classlib\support\src\test\java\tests\support\Support_Format.java:116: cannot find symbol
     [exec]     [javac] symbol  : class Attribute
     [exec]     [javac] location: class tests.support.Support_Format.FieldContainer
     [exec]     [javac] 		public FieldContainer(int start, int end, Attribute attribute, int value) {
     [exec]     [javac]                                                           ^
     [exec]     [javac] C:\continuum-1.0.2\apps\continuum\working-directory\6\classlib\support\src\test\java\tests\support\Support_Format.java:121: cannot find symbol
     [exec]     [javac] symbol  : class Attribute
     [exec]     [javac] location: class tests.support.Support_Format.FieldContainer
     [exec]     [javac] 		public FieldContainer(int start, int end, Attribute attribute,
     [exec]     [javac]                                                           ^
     [exec]     [javac] C:\continuum-1.0.2\apps\continuum\working-directory\6\classlib\support\src\test\java\tests\support\Support_MessageFormat.java:18: package java.text does not exist
     [exec]     [javac] import java.text.DateFormat;
     [exec]     [javac]                  ^
     [exec]     [javac] C:\continuum-1.0.2\apps\continuum\working-directory\6\classlib\support\src\test\java\tests\support\Support_MessageFormat.java:19: package java.text does not exist
     [exec]     [javac] import java.text.MessageFormat;
     [exec]     [javac]                  ^
     [exec]     [javac] C:\continuum-1.0.2\apps\continuum\working-directory\6\classlib\support\src\test\java\tests\support\Support_MessageFormat.java:20: package java.text does not exist
     [exec]     [javac] import java.text.NumberFormat;
     [exec]     [javac]                  ^
     [exec]     [javac] C:\continuum-1.0.2\apps\continuum\working-directory\6\classlib\support\src\test\java\tests\support\Support_MessageFormat.java:21: package java.text.MessageFormat does not exist
     [exec]     [javac] import java.text.MessageFormat.Field;
     [exec]     [javac]                                ^
     [exec]     [javac] C:\continuum-1.0.2\apps\continuum\working-directory\6\classlib\support\src\test\java\tests\support\Support_PermissionCollection.java:20: package java.security does not exist
     [exec]     [javac] import java.security.BasicPermission;
     [exec]     [javac]                      ^
     [exec]     [javac] C:\continuum-1.0.2\apps\continuum\working-directory\6\classlib\support\src\test\java\tests\support\Support_PermissionCollection.java:21: package java.security does not exist
     [exec]     [javac] import java.security.PermissionCollection;
     [exec]     [javac]                      ^
     [exec]     [javac] C:\continuum-1.0.2\apps\continuum\working-directory\6\classlib\support\src\test\java\tests\support\Support_PermissionCollection.java:22: package java.security does not exist
     [exec]     [javac] import java.security.Policy;
     [exec]     [javac]                      ^
     [exec]     [javac] C:\continuum-1.0.2\apps\continuum\working-directory\6\classlib\support\src\test\java\tests\support\Support_PermissionCollection.java:23: package java.security does not exist
     [exec]     [javac] import java.security.ProtectionDomain;
     [exec]     [javac]                      ^
     [exec]     [javac] C:\continuum-1.0.2\apps\continuum\working-directory\6\classlib\support\src\test\java\tests\support\Support_ProviderJCE.java:18: package java.security does not exist
     [exec]     [javac] import java.security.AccessController;
     [exec]     [javac]                      ^
     [exec]     [javac] C:\continuum-1.0.2\apps\continuum\working-directory\6\classlib\support\src\test\java\tests\support\Support_ProviderJCE.java:19: package java.security does not exist
     [exec]     [javac] import java.security.PrivilegedAction;
     [exec]     [javac]                      ^
     [exec]     [javac] C:\continuum-1.0.2\apps\continuum\working-directory\6\classlib\support\src\test\java\tests\support\Support_ProviderJCE.java:20: package java.security does not exist
     [exec]     [javac] import java.security.Provider;
     [exec]     [javac]                      ^
     [exec]     [javac] C:\continuum-1.0.2\apps\continuum\working-directory\6\classlib\support\src\test\java\tests\support\Support_ProviderJCE.java:25: cannot find symbol
     [exec]     [javac] symbol: class Provider
     [exec]     [javac] public class Support_ProviderJCE extends Provider {
     [exec]     [javac]                                          ^
     [exec]     [javac] C:\continuum-1.0.2\apps\continuum\working-directory\6\classlib\support\src\test\java\tests\support\Support_ProviderRSA.java:18: package java.security does not exist
     [exec]     [javac] import java.security.AccessController;
     [exec]     [javac]                      ^
     [exec]     [javac] C:\continuum-1.0.2\apps\continuum\working-directory\6\classlib\support\src\test\java\tests\support\Support_ProviderRSA.java:19: package java.security does not exist
     [exec]     [javac] import java.security.PrivilegedAction;
     [exec]     [javac]                      ^
     [exec]     [javac] C:\continuum-1.0.2\apps\continuum\working-directory\6\classlib\support\src\test\java\tests\support\Support_ProviderRSA.java:20: package java.security does not exist
     [exec]     [javac] import java.security.Provider;
     [exec]     [javac]                      ^
     [exec]     [javac] C:\continuum-1.0.2\apps\continuum\working-directory\6\classlib\support\src\test\java\tests\support\Support_ProviderRSA.java:25: cannot find symbol
     [exec]     [javac] symbol: class Provider
     [exec]     [javac] public class Support_ProviderRSA extends Provider {
     [exec]     [javac]                                          ^
     [exec]     [javac] C:\continuum-1.0.2\apps\continuum\working-directory\6\classlib\support\src\test\java\tests\support\Support_ProviderTrust.java:18: package java.security does not exist
     [exec]     [javac] import java.security.AccessController;
     [exec]     [javac]                      ^
     [exec]     [javac] C:\continuum-1.0.2\apps\continuum\working-directory\6\classlib\support\src\test\java\tests\support\Support_ProviderTrust.java:19: package java.security does not exist
     [exec]     [javac] import java.security.PrivilegedAction;
     [exec]     [javac]                      ^
     [exec]     [javac] C:\continuum-1.0.2\apps\continuum\working-directory\6\classlib\support\src\test\java\tests\support\Support_ProviderTrust.java:20: package java.security does not exist
     [exec]     [javac] import java.security.Provider;
     [exec]     [javac]                      ^
     [exec]     [javac] C:\continuum-1.0.2\apps\continuum\working-directory\6\classlib\support\src\test\java\tests\support\Support_ProviderTrust.java:26: cannot find symbol
     [exec]     [javac] symbol: class Provider
     [exec]     [javac] public class Support_ProviderTrust extends Provider {
     [exec]     [javac]                                            ^
     [exec]     [javac] C:\continuum-1.0.2\apps\continuum\working-directory\6\classlib\support\src\test\java\tests\support\Support_SimpleDateFormat.java:18: package java.text does not exist
     [exec]     [javac] import java.text.DateFormat;
     [exec]     [javac]                  ^
     [exec]     [javac] C:\continuum-1.0.2\apps\continuum\working-directory\6\classlib\support\src\test\java\tests\support\Support_SimpleDateFormat.java:19: package java.text does not exist
     [exec]     [javac] import java.text.NumberFormat;
     [exec]     [javac]                  ^
     [exec]     [javac] C:\continuum-1.0.2\apps\continuum\working-directory\6\classlib\support\src\test\java\tests\support\Support_SimpleDateFormat.java:20: package java.text does not exist
     [exec]     [javac] import java.text.SimpleDateFormat;
     [exec]     [javac]                  ^
     [exec]     [javac] C:\continuum-1.0.2\apps\continuum\working-directory\6\classlib\support\src\test\java\tests\support\Support_SimpleDateFormat.java:21: package java.text.DateFormat does not exist
     [exec]     [javac] import java.text.DateFormat.Field;
     [exec]     [javac]                             ^
     [exec]     [javac] C:\continuum-1.0.2\apps\continuum\working-directory\6\classlib\support\src\test\java\tests\support\Support_TestProvider.java:18: package java.security does not exist
     [exec]     [javac] import java.security.AccessController;
     [exec]     [javac]                      ^
     [exec]     [javac] C:\continuum-1.0.2\apps\continuum\working-directory\6\classlib\support\src\test\java\tests\support\Support_TestProvider.java:19: package java.security does not exist
     [exec]     [javac] import java.security.PrivilegedAction;
     [exec]     [javac]                      ^
     [exec]     [javac] C:\continuum-1.0.2\apps\continuum\working-directory\6\classlib\support\src\test\java\tests\support\Support_TestProvider.java:20: package java.security does not exist
     [exec]     [javac] import java.security.Provider;
     [exec]     [javac]                      ^
     [exec]     [javac] C:\continuum-1.0.2\apps\continuum\working-directory\6\classlib\support\src\test\java\tests\support\Support_TestProvider.java:25: cannot find symbol
     [exec]     [javac] symbol: class Provider
     [exec]     [javac] public class Support_TestProvider extends Provider {
     [exec]     [javac]                                           ^
     [exec]     [javac] C:\continuum-1.0.2\apps\continuum\working-directory\6\classlib\support\src\test\java\tests\util\SomeTests.java:37: package org.apache.xpath does not exist
     [exec]     [javac] import org.apache.xpath.XPathAPI;
     [exec]     [javac]                         ^
     [exec]     [javac] C:\continuum-1.0.2\apps\continuum\working-directory\6\classlib\support\src\test\java\tests\util\SomeTests.java:38: package org.apache.xpath.objects does not exist
     [exec]     [javac] import org.apache.xpath.objects.XObject;
     [exec]     [javac]                                 ^
     [exec]     [javac] C:\continuum-1.0.2\apps\continuum\working-directory\6\classlib\support\src\test\java\tests\support\Support_Format.java:36: cannot find symbol
     [exec]     [javac] symbol  : class FieldPosition
     [exec]     [javac] location: class tests.support.Support_Format
     [exec]     [javac] 		FieldPosition pos = new FieldPosition(field);
     [exec]     [javac]                 ^
     [exec]     [javac] C:\continuum-1.0.2\apps\continuum\working-directory\6\classlib\support\src\test\java\tests\support\Support_Format.java:36: cannot find symbol
     [exec]     [javac] symbol  : class FieldPosition
     [exec]     [javac] location: class tests.support.Support_Format
     [exec]     [javac] 		FieldPosition pos = new FieldPosition(field);
     [exec]     [javac]                                         ^
     [exec]     [javac] C:\continuum-1.0.2\apps\continuum\working-directory\6\classlib\support\src\test\java\tests\support\Support_Format.java:88: package AttributedCharacterIterator does not exist
     [exec]     [javac] 				AttributedCharacterIterator.Attribute attribute = (AttributedCharacterIterator.Attribute) it
     [exec]     [javac]                                                            ^
     [exec]     [javac] C:\continuum-1.0.2\apps\continuum\working-directory\6\classlib\support\src\test\java\tests\support\Support_Format.java:88: package AttributedCharacterIterator does not exist
     [exec]     [javac] 				AttributedCharacterIterator.Attribute attribute = (AttributedCharacterIterator.Attribute) it
     [exec]     [javac]                                                                                                               ^
     [exec]     [javac] C:\continuum-1.0.2\apps\continuum\working-directory\6\classlib\support\src\test\java\tests\support\Support_DecimalFormat.java:39: cannot find symbol
     [exec]     [javac] symbol  : class DecimalFormat
     [exec]     [javac] location: class tests.support.Support_DecimalFormat
     [exec]     [javac] 		DecimalFormat format = (DecimalFormat) NumberFormat
     [exec]     [javac]                 ^
     [exec]     [javac] C:\continuum-1.0.2\apps\continuum\working-directory\6\classlib\support\src\test\java\tests\support\Support_DecimalFormat.java:39: cannot find symbol
     [exec]     [javac] symbol  : class DecimalFormat
     [exec]     [javac] location: class tests.support.Support_DecimalFormat
     [exec]     [javac] 		DecimalFormat format = (DecimalFormat) NumberFormat
     [exec]     [javac]                                         ^
     [exec]     [javac] C:\continuum-1.0.2\apps\continuum\working-directory\6\classlib\support\src\test\java\tests\support\Support_DecimalFormat.java:39: cannot find symbol
     [exec]     [javac] symbol  : variable NumberFormat
     [exec]     [javac] location: class tests.support.Support_DecimalFormat
     [exec]     [javac] 		DecimalFormat format = (DecimalFormat) NumberFormat
     [exec]     [javac]                                                        ^
     [exec]     [javac] C:\continuum-1.0.2\apps\continuum\working-directory\6\classlib\support\src\test\java\tests\support\Support_DecimalFormat.java:44: package NumberFormat does not exist
     [exec]     [javac] 		t_FormatWithField(0, format, number, text, NumberFormat.Field.CURRENCY,
     [exec]     [javac]                                                                        ^
     [exec]     [javac] C:\continuum-1.0.2\apps\continuum\working-directory\6\classlib\support\src\test\java\tests\support\Support_DecimalFormat.java:46: package NumberFormat does not exist
     [exec]     [javac] 		t_FormatWithField(1, format, number, text, NumberFormat.Field.INTEGER,
     [exec]     [javac]                                                                        ^
     [exec]     [javac] C:\continuum-1.0.2\apps\continuum\working-directory\6\classlib\support\src\test\java\tests\support\Support_DecimalFormat.java:49: package NumberFormat does not exist
     [exec]     [javac] 				NumberFormat.Field.GROUPING_SEPARATOR, 3, 4);
     [exec]     [javac]                                             ^
     [exec]     [javac] C:\continuum-1.0.2\apps\continuum\working-directory\6\classlib\support\src\test\java\tests\support\Support_DecimalFormat.java:51: package NumberFormat does not exist
     [exec]     [javac] 				NumberFormat.Field.DECIMAL_SEPARATOR, 11, 12);
     [exec]     [javac]                                             ^
     [exec]     [javac] C:\continuum-1.0.2\apps\continuum\working-directory\6\classlib\support\src\test\java\tests\support\Support_DecimalFormat.java:52: package NumberFormat does not exist
     [exec]     [javac] 		t_FormatWithField(4, format, number, text, NumberFormat.Field.FRACTION,
     [exec]     [javac]                                                                        ^
     [exec]     [javac] C:\continuum-1.0.2\apps\continuum\working-directory\6\classlib\support\src\test\java\tests\support\Support_DecimalFormat.java:56: package NumberFormat does not exist
     [exec]     [javac] 		t_FormatWithField(5, format, number, text, NumberFormat.Field.SIGN, 0,
     [exec]     [javac]                                                                        ^
     [exec]     [javac] C:\continuum-1.0.2\apps\continuum\working-directory\6\classlib\support\src\test\java\tests\support\Support_DecimalFormat.java:58: package NumberFormat does not exist
     [exec]     [javac] 		t_FormatWithField(6, format, number, text, NumberFormat.Field.EXPONENT,
     [exec]     [javac]                                                                        ^
     [exec]     [javac] C:\continuum-1.0.2\apps\continuum\working-directory\6\classlib\support\src\test\java\tests\support\Support_DecimalFormat.java:61: package NumberFormat does not exist
     [exec]     [javac] 				NumberFormat.Field.EXPONENT_SIGN, 0, 0);
     [exec]     [javac]                                             ^
     [exec]     [javac] C:\continuum-1.0.2\apps\continuum\working-directory\6\classlib\support\src\test\java\tests\support\Support_DecimalFormat.java:63: package NumberFormat does not exist
     [exec]     [javac] 				NumberFormat.Field.EXPONENT_SYMBOL, 0, 0);
     [exec]     [javac]                                             ^
     [exec]     [javac] C:\continuum-1.0.2\apps\continuum\working-directory\6\classlib\support\src\test\java\tests\support\Support_DecimalFormat.java:64: package NumberFormat does not exist
     [exec]     [javac] 		t_FormatWithField(9, format, number, text, NumberFormat.Field.PERCENT,
     [exec]     [javac]                                                                        ^
     [exec]     [javac] C:\continuum-1.0.2\apps\continuum\working-directory\6\classlib\support\src\test\java\tests\support\Support_DecimalFormat.java:67: package NumberFormat does not exist
     [exec]     [javac] 				NumberFormat.Field.PERMILLE, 0, 0);
     [exec]     [javac]                                             ^
     [exec]     [javac] C:\continuum-1.0.2\apps\continuum\working-directory\6\classlib\support\src\test\java\tests\support\Support_DecimalFormat.java:70: cannot find symbol
     [exec]     [javac] symbol  : class DecimalFormat
     [exec]     [javac] location: class tests.support.Support_DecimalFormat
     [exec]     [javac] 		format = new DecimalFormat("000000000.0#E0");
     [exec]     [javac]                              ^
     [exec]     [javac] C:\continuum-1.0.2\apps\continuum\working-directory\6\classlib\support\src\test\java\tests\support\Support_DecimalFormat.java:72: package NumberFormat does not exist
     [exec]     [javac] 		t_FormatWithField(11, format, number, text, NumberFormat.Field.INTEGER,
     [exec]     [javac]                                                                         ^
     [exec]     [javac] C:\continuum-1.0.2\apps\continuum\working-directory\6\classlib\support\src\test\java\tests\support\Support_DecimalFormat.java:75: package NumberFormat does not exist
     [exec]     [javac] 				NumberFormat.Field.DECIMAL_SEPARATOR, 9, 10);
     [exec]     [javac]                                             ^
     [exec]     [javac] C:\continuum-1.0.2\apps\continuum\working-directory\6\classlib\support\src\test\java\tests\support\Support_DecimalFormat.java:77: package NumberFormat does not exist
     [exec]     [javac] 				NumberFormat.Field.FRACTION, 10, 11);
     [exec]     [javac]                                             ^
     [exec]     [javac] C:\continuum-1.0.2\apps\continuum\working-directory\6\classlib\support\src\test\java\tests\support\Support_DecimalFormat.java:79: package NumberFormat does not exist
     [exec]     [javac] 				NumberFormat.Field.EXPONENT_SYMBOL, 11, 12);
     [exec]     [javac]                                             ^
     [exec]     [javac] C:\continuum-1.0.2\apps\continuum\working-directory\6\classlib\support\src\test\java\tests\support\Support_DecimalFormat.java:81: package NumberFormat does not exist
     [exec]     [javac] 				NumberFormat.Field.EXPONENT_SIGN, 12, 13);
     [exec]     [javac]                                             ^
     [exec]     [javac] C:\continuum-1.0.2\apps\continuum\working-directory\6\classlib\support\src\test\java\tests\support\Support_DecimalFormat.java:83: package NumberFormat does not exist
     [exec]     [javac] 				NumberFormat.Field.EXPONENT, 13, 14);
     [exec]     [javac]                                             ^
     [exec]     [javac] C:\continuum-1.0.2\apps\continuum\working-directory\6\classlib\support\src\test\java\tests\support\Support_DecimalFormat.java:87: package NumberFormat does not exist
     [exec]     [javac] 				NumberFormat.Field.GROUPING_SEPARATOR, 0, 0);
     [exec]     [javac]                                             ^
     [exec]     [javac] C:\continuum-1.0.2\apps\continuum\working-directory\6\classlib\support\src\test\java\tests\support\Support_DecimalFormat.java:88: package NumberFormat does not exist
     [exec]     [javac] 		t_FormatWithField(18, format, number, text, NumberFormat.Field.SIGN, 0,
     [exec]     [javac]                                                                         ^
     [exec]     [javac] C:\continuum-1.0.2\apps\continuum\working-directory\6\classlib\support\src\test\java\tests\support\Support_DecimalFormat.java:91: package NumberFormat does not exist
     [exec]     [javac] 				NumberFormat.Field.CURRENCY, 0, 0);
     [exec]     [javac]                                             ^
     [exec]     [javac] C:\continuum-1.0.2\apps\continuum\working-directory\6\classlib\support\src\test\java\tests\support\Support_DecimalFormat.java:92: package NumberFormat does not exist
     [exec]     [javac] 		t_FormatWithField(20, format, number, text, NumberFormat.Field.PERCENT,
     [exec]     [javac]                                                                         ^
     [exec]     [javac] C:\continuum-1.0.2\apps\continuum\working-directory\6\classlib\support\src\test\java\tests\support\Support_DecimalFormat.java:95: package NumberFormat does not exist
     [exec]     [javac] 				NumberFormat.Field.PERMILLE, 0, 0);
     [exec]     [javac]                                             ^
     [exec]     [javac] Note: C:\continuum-1.0.2\apps\continuum\working-directory\6\classlib\support\src\test\java\tests\support\Support_PortManager.java uses or overrides a deprecated API.
     [exec]     [javac] Note: Recompile with -Xlint:deprecation for details.
     [exec]     [javac] Note: Some input files use unchecked or unsafe operations.
     [exec]     [javac] Note: Recompile with -Xlint:unchecked for details.
     [exec]     [javac] 100 errors

     [exec] BUILD FAILED
     [exec] C:\continuum-1.0.2\apps\continuum\working-directory\6\classlib\make\build-test.xml:194: Compile failed; see the compiler error output for details.

     [exec] Total time: 4 seconds
     [echo] Tests.failed is set to ${tests.failed}

check-class-load-lists:

japi:

publish:
    [mkdir] Created dir: C:\publish\20060516-1504
    [mkdir] Created dir: C:\publish\20060516-1504\test

BUILD FAILED
C:\continuum-1.0.2\apps\continuum\working-directory\6\build.xml:311: C:\continuum-1.0.2\apps\continuum\working-directory\6\classlib\build\test_report\html not found.

Total time: 1 minute 7 seconds

****************************************************************************




Mime
View raw message