harmony-commits mailing list archives

Site index · List index
Message view « Date » · « Thread »
Top « Date » · « Thread »
From "Loenko, Mikhail Y" <mikhail.y.loe...@intel.com>
Subject RE: [continuum] BUILD FAILURE: Classlib/linux.ia32
Date Wed, 05 Apr 2006 05:41:43 GMT
Hmmm...

Somehow not all the changes went to repository...

Thanks,
Mikhail

>-----Original Message-----
>From: Apache Harmony Build [mailto:nomail@hursley.ibm.com]
>Sent: Wednesday, April 05, 2006 12:02 PM
>To: harmony-commits@incubator.apache.org
>Subject: [continuum] BUILD FAILURE: Classlib/linux.ia32
>
>Online report :
>http://ibmonly.hursley.ibm.com/continuum/linux.ia32/servlet/continuum/t
arget/ProjectBuild.vm/view/P
>rojectBuild/id/1/buildId/423
>Build statistics:
>  State: Failed
>  Previous State: Ok
>  Started at: Wed, 5 Apr 2006 06:00:44 +0100
>  Finished at: Wed, 5 Apr 2006 06:01:33 +0100
>  Total time: 48s
>  Build Trigger: Schedule
>  Exit code: 1
>  Building machine hostname: hy2
>  Operating system : Linux
>  Java version : 1.4.2(IBM Corporation)
>
>Changes
>                            modules/crypto/make/common/build.xml
>
>modules/security/src/test/java/linux/org/apache/harmony/security/x/secu
rity/auth/module/UnixLoginMo
>duleTest.java
>
modules/security/src/test/java/common/java/security/interfaces/DSAPublic
KeyTest.java
>
modules/security/src/test/java/common/java/security/interfaces/ECPublicK
eyTest.java
>
>modules/security/src/test/java/common/java/security/interfaces/RSAPriva
teCrtKeyTest.java
>
modules/security/src/test/java/common/java/security/interfaces/RSAPrivat
eKeyTest.java
>
>modules/security/src/test/java/common/java/security/interfaces/RSAMulti
PrimePrivateCrtKeyTest.java
>
modules/security/src/test/java/common/java/security/interfaces/DSAPrivat
eKeyTest.java
>
modules/security/src/test/java/common/java/security/interfaces/ECPrivate
KeyTest.java
>
modules/security/src/test/java/common/java/security/interfaces/RSAPublic
KeyTest.java
>
>modules/security/src/test/java/common/java/security/serialization/Inval
idAlgorithmParameterExceptio
>nTest.0.dat
>
>modules/security/src/test/java/common/java/security/serialization/Unres
olvedPermissionCollectionTes
>t.2.dat
>
>modules/security/src/test/java/common/java/security/serialization/Provi
derExceptionTest.5.dat
>
modules/security/src/test/java/common/java/security/serialization/KeyPai
rTest.java
>
>modules/security/src/test/java/common/java/security/serialization/Inval
idAlgorithmParameterExceptio
>nTest.2.dat
>
>modules/security/src/test/java/common/java/security/serialization/Signa
tureExceptionTest.0.dat
>
>modules/security/src/test/java/common/java/security/serialization/Inval
idAlgorithmParameterExceptio
>nTest.4.dat
>
>modules/security/src/test/java/common/java/security/serialization/Signa
tureExceptionTest.2.dat
>
>modules/security/src/test/java/common/java/security/serialization/Signa
tureExceptionTest.4.dat
>
modules/security/src/test/java/common/java/security/serialization/Permis
sionTest.0.dat
>
modules/security/src/test/java/common/java/security/serialization/KeyPai
r.RSA.dat
>
>modules/security/src/test/java/common/java/security/serialization/Acces
sControlExceptionTest.java
>
>modules/security/src/test/java/common/java/security/serialization/AllPe
rmissionCollectionTest.0.dat
>
>modules/security/src/test/java/common/java/security/serialization/Signe
dObjectTest.0.dat
>
>modules/security/src/test/java/common/java/security/serialization/Guard
edObjectTest.1.dat
>
modules/security/src/test/java/common/java/security/serialization/Timest
ampTest.0.dat
>
>modules/security/src/test/java/common/java/security/serialization/KeyMa
nagementExceptionTest.1.dat
>
>modules/security/src/test/java/common/java/security/serialization/Basic
PermissionCollectionTest.0.d
>at
>
>modules/security/src/test/java/common/java/security/serialization/KeyMa
nagementExceptionTest.3.dat
>
>modules/security/src/test/java/common/java/security/serialization/KeyEx
ceptionTest.0.dat
>
>modules/security/src/test/java/common/java/security/serialization/Basic
PermissionCollectionTest.2.d
>at
>
>modules/security/src/test/java/common/java/security/serialization/KeyMa
nagementExceptionTest.5.dat
>
>modules/security/src/test/java/common/java/security/serialization/KeyEx
ceptionTest.2.dat
>
>modules/security/src/test/java/common/java/security/cert/serialization/
CertificateEncodingException
>Test.5.dat
>
>modules/security/src/test/java/common/java/security/cert/serialization/
CertificateExpiredExceptionT
>est.0.dat
>
>modules/security/src/test/java/common/java/security/cert/serialization/
CertificateExpiredExceptionT
>est.1.dat
>
>modules/security/src/test/java/common/java/security/cert/serialization/
CertificateEncodingException
>Test.java
>
>modules/security/src/test/java/common/java/security/cert/serialization/
CertificateNotYetValidExcept
>ionTest.0.dat
>
>modules/security/src/test/java/common/java/security/cert/serialization/
CertificateExpiredExceptionT
>est.2.dat
>
>modules/security/src/test/java/common/java/security/cert/serialization/
CertificateNotYetValidExcept
>ionTest.1.dat
>
>modules/security/src/test/java/common/java/security/cert/serialization/
CertificateNotYetValidExcept
>ionTest.2.dat
>
>modules/security/src/test/java/common/java/security/cert/serialization/
CertificateNotYetValidExcept
>ionTest.java
>
>modules/security/src/test/java/common/java/security/cert/serialization/
Certificate.X.509
>
>modules/security/src/test/java/common/java/security/cert/serialization/
CertificateParsingExceptionT
>est.java
>
>modules/security/src/test/java/common/java/security/cert/serialization/
CertPathBuilderExceptionTest
>.0.dat
>
>modules/security/src/test/java/common/java/security/cert/serialization/
CertPathBuilderExceptionTest
>.1.dat
>
>modules/security/src/test/java/common/java/security/cert/serialization/
CertPathBuilderExceptionTest
>.2.dat
>
>modules/security/src/test/java/common/java/security/cert/serialization/
CertPathBuilderExceptionTest
>.3.dat
>
>modules/security/src/test/java/common/java/security/cert/serialization/
CertPathBuilderExceptionTest
>.4.dat
>
>modules/security/src/test/java/common/java/security/cert/serialization/
CertPathBuilderExceptionTest
>.5.dat
>
>modules/security/src/test/java/common/java/security/cert/LDAPCertStoreP
arametersTest.java
>
>modules/security/src/test/java/common/java/security/cert/CertPathValida
torExceptionTest.java
>
modules/security/src/test/java/common/java/security/cert/PKIXParametersT
est.java
>
modules/security/src/test/java/common/java/security/cert/CertPathValidat
or1Test.java
>
modules/security/src/test/java/common/java/security/cert/MyCertPathValid
atorSpi.java
>
modules/security/src/test/java/common/java/security/cert/CertPathBuilder
2Test.java
>
modules/security/src/test/java/common/java/security/cert/CertPathValidat
or3Test.java
>
>modules/security/src/test/java/common/java/security/cert/CertificateEnc
odingExceptionTest.java
>
modules/security/src/test/java/common/java/security/cert/CertPathTest.ja
va
>
modules/security/src/test/java/common/java/security/cert/TrustAnchorTest
.java
>
modules/security/src/test/java/common/java/security/cert/PolicyQualifier
InfoTest.java
>
modules/security/src/test/java/common/java/security/cert/myCertPath.java
>
>modules/security/src/test/java/common/java/security/cert/CertificateExp
iredExceptionTest.java
>
>modules/security/src/test/java/common/java/security/cert/CertificateNot
YetValidExceptionTest.java
>
modules/security/src/test/java/common/java/security/cert/X509CertSelecto
rTest.java
>
>modules/security/src/test/java/common/java/security/cert/CertificatePar
singExceptionTest.java
>
modules/security/src/test/java/common/java/security/cert/CertificateFact
orySpiTest.java
>
modules/security/src/test/java/common/java/security/cert/CertStoreSpiTes
t.java
>
modules/security/src/test/java/common/java/security/cert/X509CRLEntryTes
t.java
>
modules/security/src/test/java/common/java/security/cert/PKIXCertPathChe
ckerTest.java
>
modules/security/src/test/java/common/java/security/cert/CertificateFact
ory2Test.java
>
modules/security/src/test/java/common/java/security/cert/CertPathValidat
orSpiTest.java
>
modules/security/src/test/java/common/java/security/cert/CertStore2Test.
java
>
modules/security/src/test/java/common/java/security/acl/NotOwnerExceptio
nTest.java
>
modules/security/src/test/java/common/java/security/acl/AclNotFoundExcep
tionTest.java
>
modules/security/src/test/java/common/java/security/acl/LastOwnerExcepti
onTest.java
>
>modules/security/src/test/java/common/java/security/spec/serialization/
InvalidKeySpecExceptionTest.
>3.dat
>
>modules/security/src/test/java/common/java/security/spec/serialization/
InvalidParameterSpecExceptio
>nTest.java
>
>modules/security/src/test/java/common/java/security/spec/serialization/
InvalidKeySpecExceptionTest.
>4.dat
>
>modules/security/src/test/java/common/java/security/spec/serialization/
InvalidKeySpecExceptionTest.
>5.dat
>
>modules/security/src/test/java/common/java/security/spec/serialization/
InvalidParameterSpecExceptio
>nTest.0.dat
>
>modules/security/src/test/java/common/java/security/spec/serialization/
InvalidParameterSpecExceptio
>nTest.1.dat
>
>modules/security/src/test/java/common/java/security/spec/serialization/
InvalidParameterSpecExceptio
>nTest.2.dat
>
>modules/security/src/test/java/common/java/security/spec/serialization/
InvalidKeySpecExceptionTest.
>java
>
>modules/security/src/test/java/common/java/security/spec/serialization/
InvalidKeySpecExceptionTest.
>0.dat
>
modules/security/src/test/java/common/java/security/spec/PKCS8EncodedKey
SpecTest.java
>
modules/security/src/test/java/common/java/security/PermissionsTest.java
>
modules/security/src/test/java/common/java/security/KSSecretKeyEntryTest
.java
>
>modules/security/src/test/java/common/java/security/AlgorithmParameterG
enerator1Test.java
>
modules/security/src/test/java/common/java/security/MyAlgorithmParameter
s.java
>
modules/security/src/test/java/common/java/security/SignatureExceptionTe
st.java
>
modules/security/src/test/java/common/java/security/KeyStoreSpiTest.java
>
modules/security/src/test/java/common/java/security/AccessControlExcepti
onTest.java
>
modules/security/src/test/java/common/java/security/IdentityScopeTest.ja
va
>
modules/security/src/test/java/common/java/security/KSEmpty.dat
>
modules/security/src/test/java/common/java/security/KeyStore2Test.java
>
modules/security/src/test/java/common/java/security/PermissionTest.java
>
modules/security/src/test/java/common/java/security/KeyTest.java
>
modules/security/src/test/java/common/java/security/CodeSourceTest.java
>
modules/security/src/test/java/common/java/security/DigestExceptionTest.
java
>
modules/security/src/test/java/common/org/apache/harmony/security/test/T
estUtils.java
>
>modules/security/src/test/java/common/org/apache/harmony/security/test/
SecurityTest.java
>
>modules/security/src/test/java/common/org/apache/harmony/security/test/
SecurityChecker.java
>
>modules/security/src/test/java/common/org/apache/harmony/security/test/
SerializationTest.java
>
>modules/security/src/test/java/common/org/apache/harmony/security/provi
der/cert/CertFactoryTestData
>.java
>
>modules/security/src/test/java/common/org/apache/harmony/security/provi
der/cert/X509CertPathImplTes
>t.java
>
>modules/security/src/test/java/common/org/apache/harmony/security/provi
der/cert/X509CertImplTest.ja
>va
>
>modules/security/src/test/java/common/org/apache/harmony/security/provi
der/cert/DRLCertFactoryTest.
>java
>
>modules/security/src/test/java/common/org/apache/harmony/security/provi
der/cert/X509CRLImplTest.jav
>a
>
>modules/security/src/test/java/common/org/apache/harmony/security/provi
der/cert/X509CertFactoryPerf
>Test.java
>
>modules/security/src/test/java/common/org/apache/harmony/security/provi
der/cert/X509CertFactoryImpl
>Test.java
>
>modules/security/src/test/java/common/org/apache/harmony/security/spec/
MyEncodedKeySpec.java
>
modules/security/src/test/java/common/org/apache/harmony/security/cert/M
yCertPath.java
>
modules/security/src/test/java/common/org/apache/harmony/security/cert/T
estUtils.java
>
modules/security/src/test/java/common/org/apache/harmony/security/cert/M
yCRL.java
>
>modules/security/src/test/java/common/org/apache/harmony/security/cert/
MyCertificate.java
>
>modules/security/src/test/java/common/org/apache/harmony/security/asn1/
der/BooleanTest.java
>
>modules/security/src/test/java/common/org/apache/harmony/security/asn1/
der/ExplicitTest.java
>
>modules/security/src/test/java/common/org/apache/harmony/security/asn1/
der/BerInputStreamTest.java
>
>modules/security/src/test/java/common/org/apache/harmony/security/asn1/
der/BitStringTest.java
>
>modules/security/src/test/java/common/org/apache/harmony/security/asn1/
der/NameDecoderTest.java
>
modules/security/src/test/java/common/org/apache/harmony/security/asn1/d
er/AnyTest.java
>
>modules/security/src/test/java/common/org/apache/harmony/security/asn1/
der/SequenceTest.java
>
>modules/security/src/test/java/common/org/apache/harmony/security/asn1/
der/ChoiceTest.java
>
>modules/security/src/test/java/common/org/apache/harmony/security/asn1/
der/ImplicitTest.java
>
modules/security/src/test/java/common/org/apache/harmony/security/asn1/d
er/OidTest.java
>
>modules/security/src/test/java/common/org/apache/harmony/security/asn1/
der/DerGeneralizedTimeEDTest
>.java
>
>modules/security/src/test/java/common/org/apache/harmony/security/asn1/
der/IntegerTest.java
>
>modules/security/src/test/java/common/org/apache/harmony/security/asn1/
der/SequenceOfTest.java
>
>modules/security/src/test/java/common/org/apache/harmony/security/asn1/
der/DerUTCTimeEDTest.java
>
>modules/security/src/test/java/common/org/apache/harmony/security/x509/
GeneralNamesTest.java
>
>modules/security/src/test/java/common/org/apache/harmony/security/x509/
CertificateTest.java
>
>modules/security/src/test/java/common/org/apache/harmony/security/x509/
EDIPartyNameTest.java
>
>modules/security/src/test/java/common/org/apache/harmony/security/x509/
ORAddressTest.java
>
>modules/security/src/test/java/common/org/apache/harmony/security/x509/
CertificatePoliciesTest.java
>
>modules/security/src/test/java/common/org/apache/harmony/security/x509/
PrivateKeyUsagePeriodTest.ja
>va
>
>modules/security/src/test/java/common/org/apache/harmony/security/x509/
PolicyQualifierInfoTest.java
>
>modules/security/src/test/java/common/org/apache/harmony/security/x509/
CertificateListTest.java
>
>modules/security/src/test/java/common/org/apache/harmony/security/x509/
GeneralNameTest.java
>
>modules/security/src/test/java/common/org/apache/harmony/security/fortr
ess/DefaultPolicyTest.java
>
>modules/security/src/test/java/common/org/apache/harmony/security/fortr
ess/EngineTest.java
>
>modules/security/src/test/java/common/org/apache/harmony/security/fortr
ess/SomeClass.java
>
>modules/security/src/test/java/common/org/apache/harmony/security/x/sec
urity/auth/login/jaas.conf
>
>modules/security/src/test/java/common/org/apache/harmony/security/x/sec
urity/auth/login/DefaultConf
>igParserTest.java
>
>modules/security/src/test/java/common/org/apache/harmony/security/x/sec
urity/auth/login/DefaultConf
>igurationTest.java
>
>modules/security/src/test/java/common/org/apache/harmony/security/Unres
olvedPrincipalTest.java
>
modules/security/src/test/java/common/org/ietf/jgss/ChannelBindingTest.j
ava
>
modules/security/src/test/java/common/org/ietf/jgss/MessagePropTest.java
>
modules/security/src/test/java/common/org/ietf/jgss/GSSManagerTest.java
>
modules/security/src/test/java/common/org/ietf/jgss/GSSExceptionTest.jav
a
>
modules/security/src/test/java/common/org/ietf/jgss/OidTest.java
>
modules/security/src/test/java/common/org/ietf/jgss/GSSNameTest.java
>
>modules/security/src/test/java/common/javax/security/auth/callback/seri
alization/SerConfirmationCal
>lbackTest.java
>
>modules/security/src/test/java/common/javax/security/auth/callback/seri
alization/SerTextInputCallba
>ckTest.0.dat
>
>modules/security/src/test/java/common/javax/security/auth/callback/seri
alization/SerTextOutputCallb
>ackTest.0.dat
>
>modules/security/src/test/java/common/javax/security/auth/callback/seri
alization/SerTextInputCallba
>ckTest.1.dat
>
>modules/security/src/test/java/common/javax/security/auth/callback/seri
alization/SerChoiceCallbackT
>est.java
>
>modules/security/src/test/java/common/javax/security/auth/callback/seri
alization/SerUnsupportedCall
>backExceptionTest.0.dat
>
>modules/security/src/test/java/common/javax/security/auth/callback/seri
alization/SerPasswordCallbac
>kTest.java
>
>modules/security/src/test/java/common/javax/security/auth/callback/seri
alization/SerTextInputCallba
>ckTest.java
>
>modules/security/src/test/java/common/javax/security/auth/callback/seri
alization/SerNameCallbackTes
>t.0.dat
>
>modules/security/src/test/java/common/javax/security/auth/callback/seri
alization/SerTextOutputCallb
>ackTest.java
>
>modules/security/src/test/java/common/javax/security/auth/callback/seri
alization/SerNameCallbackTes
>t.1.dat
>
>modules/security/src/test/java/common/javax/security/auth/callback/seri
alization/SerUnsupportedCall
>backExceptionTest.java
>
>modules/security/src/test/java/common/javax/security/auth/x500/X500Priv
ateCredentialTest.java
>
modules/security/src/test/java/common/javax/security/auth/x500/inputdata
.0
>
modules/security/src/test/java/common/javax/security/auth/x500/inputdata
>
>modules/security/src/test/java/common/javax/security/auth/x500/serializ
ation/X500PrincipalTest.0.da
>t
>
>modules/security/src/test/java/common/javax/security/auth/x500/serializ
ation/X500PrincipalTest.1.da
>t
>
>modules/security/src/test/java/common/javax/security/auth/x500/serializ
ation/X500PrincipalTest.2.da
>t
>
>modules/security/src/test/java/common/javax/security/auth/x500/serializ
ation/X500PrincipalTest.java
>
modules/security/src/test/java/common/javax/security/auth/x500/X500Princ
ipalTest.java
>
>modules/security/src/test/java/common/javax/security/auth/login/seriali
zation/SerLoginExceptionTest
>.java
>
>modules/security/src/test/java/common/javax/security/auth/login/seriali
zation/SerAccountNotFoundExc
>eptionTest.java
>
>modules/security/src/test/java/common/javax/security/auth/login/seriali
zation/SerCredentialExceptio
>nTest.java
>
>modules/security/src/test/java/common/javax/security/auth/login/seriali
zation/SerCredentialNotFound
>ExceptionTest.0.dat
>
>modules/security/src/test/java/common/javax/security/auth/login/seriali
zation/SerFailedLoginExcepti
>onTest.java
>
>modules/security/src/test/java/common/javax/security/auth/login/seriali
zation/SerAccountExpiredExce
>ptionTest.java
>
>modules/security/src/test/java/common/javax/security/auth/login/seriali
zation/SerAccountLockedExcep
>tionTest.java
>
>modules/security/src/test/java/common/javax/security/auth/login/seriali
zation/SerCredentialExpiredE
>xceptionTest.0.dat
>
>modules/security/src/test/java/common/javax/security/auth/login/seriali
zation/SerAccountExceptionTe
>st.0.dat
>
>modules/security/src/test/java/common/javax/security/auth/login/seriali
zation/SerCredentialNotFound
>ExceptionTest.java
>
>modules/security/src/test/java/common/javax/security/auth/login/seriali
zation/SerCredentialExpiredE
>xceptionTest.java
>
>modules/security/src/test/java/common/javax/security/auth/login/seriali
zation/SerAccountExceptionTe
>st.java
>
>modules/security/src/test/java/common/javax/security/auth/login/seriali
zation/SerLoginExceptionTest
>.0.dat
>
>modules/security/src/test/java/common/javax/security/auth/login/seriali
zation/SerAccountNotFoundExc
>eptionTest.0.dat
>
>modules/security/src/test/java/common/javax/security/auth/login/seriali
zation/SerCredentialExceptio
>nTest.0.dat
>
>modules/security/src/test/java/common/javax/security/auth/login/seriali
zation/SerFailedLoginExcepti
>onTest.0.dat
>
>modules/security/src/test/java/common/javax/security/auth/login/seriali
zation/SerAccountExpiredExce
>ptionTest.0.dat
>
>modules/security/src/test/java/common/javax/security/auth/login/seriali
zation/SerAccountLockedExcep
>tionTest.0.dat
>
>modules/security/src/test/java/common/javax/security/auth/kerberos/Serv
icePermissionTest.java
>
>modules/security/src/test/java/common/javax/security/auth/kerberos/seri
alization/ServicePermissionT
>est.1.dat
>
>modules/security/src/test/java/common/javax/security/auth/kerberos/seri
alization/KrbDelegationPermi
>ssionCollectionTest.java
>
>modules/security/src/test/java/common/javax/security/auth/kerberos/seri
alization/ServicePermissionT
>est.2.dat
>
>modules/security/src/test/java/common/javax/security/auth/kerberos/seri
alization/ServicePermissionT
>est.3.dat
>
>modules/security/src/test/java/common/javax/security/auth/kerberos/seri
alization/ServicePermissionT
>est.java
>
>modules/security/src/test/java/common/javax/security/auth/kerberos/seri
alization/KrbServicePermissi
>onCollectionTest.0.dat
>
>modules/security/src/test/java/common/javax/security/auth/kerberos/seri
alization/DelegationPermissi
>onTest.0.dat
>
>modules/security/src/test/java/common/javax/security/auth/kerberos/seri
alization/KrbServicePermissi
>onCollectionTest.1.dat
>
>modules/security/src/test/java/common/javax/security/auth/kerberos/seri
alization/DelegationPermissi
>onTest.1.dat
>
>modules/security/src/test/java/common/javax/security/auth/kerberos/seri
alization/KrbServicePermissi
>onCollectionTest.2.dat
>
>modules/security/src/test/java/common/javax/security/auth/kerberos/seri
alization/KrbServicePermissi
>onCollectionTest.java
>
>modules/security/src/test/java/common/javax/security/auth/kerberos/seri
alization/KrbDelegationPermi
>ssionCollectionTest.0.dat
>
>modules/security/src/test/java/common/javax/security/auth/kerberos/seri
alization/DelegationPermissi
>onTest.java
>
>modules/security/src/test/java/common/javax/security/auth/kerberos/seri
alization/KrbDelegationPermi
>ssionCollectionTest.1.dat
>
>modules/security/src/test/java/common/javax/security/auth/kerberos/seri
alization/KrbDelegationPermi
>ssionCollectionTest.2.dat
>
>modules/security/src/test/java/common/javax/security/auth/kerberos/seri
alization/ServicePermissionT
>est.0.dat
>
>modules/security/src/test/java/common/javax/security/auth/serialization
/SubjectTest.java
>
>modules/security/src/test/java/common/javax/security/auth/serialization
/SerRefreshFailedExceptionTe
>st.0.dat
>
>modules/security/src/test/java/common/javax/security/auth/serialization
/SerAuthPermissionTest.java
>
>modules/security/src/test/java/common/javax/security/auth/serialization
/SubjectTest.0.dat
>
>modules/security/src/test/java/common/javax/security/auth/serialization
/SubjectTest.1.dat
>
>modules/security/src/test/java/common/javax/security/auth/serialization
/SubjectTest.2.dat
>
>modules/security/src/test/java/common/javax/security/auth/serialization
/SerDestroyFailedExceptionTe
>st.java
>
>modules/security/src/test/java/common/javax/security/auth/serialization
/SubjectTest.3.dat
>
>modules/security/src/test/java/common/javax/security/auth/serialization
/SerPrivateCredentialPermiss
>ionTest.java
>
>modules/security/src/test/java/common/javax/security/auth/serialization
/SerAuthPermissionTest.0.dat
>
>modules/security/src/test/java/common/javax/security/auth/serialization
/SerDestroyFailedExceptionTe
>st.0.dat
>
>modules/security/src/test/java/common/javax/security/auth/serialization
/SerRefreshFailedExceptionTe
>st.java
>
>modules/security/src/test/java/common/javax/security/auth/serialization
/SerPrivateCredentialPermiss
>ionTest.0.dat
>
>modules/security/src/test/java/common/javax/security/sasl/serialization
/AuthorizeCallbackTest.3.dat
>
>modules/security/src/test/java/common/javax/security/sasl/serialization
/RealmChoiceCallbackTest.2.d
>at
>
>modules/security/src/test/java/common/javax/security/sasl/serialization
/RealmChoiceCallbackTest.3.d
>at
>
>modules/security/src/test/java/common/javax/security/sasl/serialization
/SaslExceptionTest.java
>
>modules/security/src/test/java/common/javax/security/sasl/serialization
/AuthenticationExceptionTest
>.0.dat
>
>modules/security/src/test/java/common/javax/security/sasl/serialization
/AuthenticationExceptionTest
>.1.dat
>
>modules/security/src/test/java/common/javax/security/sasl/serialization
/AuthenticationExceptionTest
>.2.dat
>
>modules/security/src/test/java/common/javax/security/sasl/serialization
/AuthenticationExceptionTest
>.3.dat
>
>modules/security/src/test/java/common/javax/security/sasl/serialization
/AuthorizeCallbackTest.java
>
>modules/security/src/test/java/common/javax/security/sasl/serialization
/AuthenticationExceptionTest
>.4.dat
>
>modules/security/src/test/java/common/javax/security/sasl/serialization
/AuthenticationExceptionTest
>.5.dat
>
>modules/security/src/test/java/common/javax/security/sasl/serialization
/RealmChoiceCallbackTest.jav
>a
>
>modules/security/src/test/java/common/javax/security/sasl/serialization
/AuthenticationExceptionTest
>.6.dat
>
>modules/security/src/test/java/common/javax/security/sasl/serialization
/AuthenticationExceptionTest
>.java
>
>modules/security/src/test/java/common/javax/security/sasl/Authenticatio
nExceptionTest.java
>
>modules/security/src/test/java/common/javax/security/cert/serialization
/CertificateNotYetValidExcep
>tionTest.java
>
>modules/security/src/test/java/common/javax/security/cert/serialization
/CertificateParsingException
>Test.java
>
>modules/security/src/test/java/common/javax/security/cert/serialization
/CertificateExceptionTest.0.
>dat
>
>modules/security/src/test/java/common/javax/security/cert/serialization
/CertificateExceptionTest.1.
>dat
>
>modules/security/src/test/java/common/javax/security/cert/serialization
/CertificateExceptionTest.2.
>dat
>
>modules/security/src/test/java/common/javax/security/cert/serialization
/CertificateExceptionTest.3.
>dat
>
>modules/security/src/test/java/common/javax/security/cert/serialization
/CertificateEncodingExceptio
>nTest.0.dat
>
>modules/security/src/test/java/common/javax/security/cert/serialization
/CertificateEncodingExceptio
>nTest.1.dat
>
>modules/security/src/test/java/windows/org/apache/harmony/security/x/se
curity/auth/module/NTLoginMo
>duleTest.java
>
>modules/security/src/main/java/linux/org/apache/harmony/security/x/secu
rity/auth/UnixNumericGroupPr
>incipal.java
>
>modules/security/src/main/java/linux/org/apache/harmony/security/x/secu
rity/auth/UnixPrincipal.java
>
>modules/security/src/main/java/linux/org/apache/harmony/security/x/secu
rity/auth/module/UnixLoginMo
>dule.java
>
>modules/security/src/main/java/linux/org/apache/harmony/security/x/secu
rity/auth/module/UnixSystem.
>java
>
>modules/security/src/main/java/linux/org/apache/harmony/security/x/secu
rity/auth/UnixNumericUserPri
>ncipal.java
>
modules/security/src/main/java/common/java/security/interfaces/DSAPublic
Key.java
>
modules/security/src/main/java/common/java/security/interfaces/ECPublicK
ey.java
>
modules/security/src/main/java/common/java/security/interfaces/DSAKey.ja
va
>
modules/security/src/main/java/common/java/security/interfaces/ECKey.jav
a
>
modules/security/src/main/java/common/java/security/interfaces/RSAPrivat
eCrtKey.java
>
modules/security/src/main/java/common/java/security/interfaces/DSAKeyPai
rGenerator.java
>
modules/security/src/main/java/common/java/security/interfaces/RSAPrivat
eKey.java
>
>modules/security/src/main/java/common/java/security/interfaces/RSAMulti
PrimePrivateCrtKey.java
>
modules/security/src/main/java/common/java/security/interfaces/DSAParams
.java
>
modules/security/src/main/java/common/java/security/interfaces/DSAPrivat
eKey.java
>
modules/security/src/main/java/common/java/security/interfaces/ECPrivate
Key.java
>
modules/security/src/main/java/common/java/security/interfaces/RSAPublic
Key.java
>
modules/security/src/main/java/common/java/security/interfaces/RSAKey.ja
va
>
>modules/security/src/main/java/common/java/security/cert/PKIXCertPathVa
lidatorResult.java
>
modules/security/src/main/java/common/java/security/cert/PKIXCertPathBui
lderResult.java
>
modules/security/src/main/java/common/java/security/cert/CRL.java
>
modules/security/src/main/java/common/java/security/cert/CRLSelector.jav
a
>
modules/security/src/main/java/common/java/security/cert/Certificate.jav
a
>
modules/security/src/main/java/common/java/security/cert/CertStoreExcept
ion.java
>
modules/security/src/main/java/common/java/security/cert/CertPathBuilder
Spi.java
>
modules/security/src/main/java/common/java/security/cert/CertStoreParame
ters.java
>
modules/security/src/main/java/common/java/security/cert/CertPathParamet
ers.java
>
modules/security/src/main/java/common/java/security/cert/LDAPCertStorePa
rameters.java
>
>modules/security/src/main/java/common/java/security/cert/CertPathValida
torException.java
>
modules/security/src/main/java/common/java/security/cert/PKIXParameters.
java
>
modules/security/src/main/java/common/java/security/cert/PolicyNode.java
>
>modules/security/src/main/java/common/java/security/cert/CertificateEnc
odingException.java
>
modules/security/src/main/java/common/java/security/cert/CertificateFact
ory.java
>
modules/security/src/main/java/common/java/security/cert/CertPath.java
>
modules/security/src/main/java/common/java/security/cert/CertStore.java
>
modules/security/src/main/java/common/java/security/cert/TrustAnchor.jav
a
>
modules/security/src/main/java/common/java/security/cert/PolicyQualifier
Info.java
>
modules/security/src/main/java/common/java/security/cert/CertPathValidat
orResult.java
>
modules/security/src/main/java/common/java/security/cert/CertPathBuilder
Result.java
>
modules/security/src/main/java/common/java/security/cert/CertPathValidat
or.java
>
modules/security/src/main/java/common/java/security/cert/CertPathBuilder
.java
>
>modules/security/src/main/java/common/java/security/cert/CertificateExp
iredException.java
>
>modules/security/src/main/java/common/java/security/cert/CertificateNot
YetValidException.java
>
modules/security/src/main/java/common/java/security/cert/X509CertSelecto
r.java
>
>modules/security/src/main/java/common/java/security/cert/CertificatePar
singException.java
>
modules/security/src/main/java/common/java/security/cert/CertificateFact
orySpi.java
>
modules/security/src/main/java/common/java/security/cert/CertStoreSpi.ja
va
>
modules/security/src/main/java/common/java/security/cert/X509CRLEntry.ja
va
>
modules/security/src/main/java/common/java/security/cert/PKIXCertPathChe
cker.java
>
modules/security/src/main/java/common/java/security/cert/CertPathValidat
orSpi.java
>
modules/security/src/main/java/common/java/security/cert/CertSelector.ja
va
>
modules/security/src/main/java/common/java/security/acl/Acl.java
>
modules/security/src/main/java/common/java/security/acl/AclEntry.java
>
modules/security/src/main/java/common/java/security/acl/Permission.java
>
modules/security/src/main/java/common/java/security/acl/NotOwnerExceptio
n.java
>
modules/security/src/main/java/common/java/security/acl/Owner.java
>
modules/security/src/main/java/common/java/security/acl/AclNotFoundExcep
tion.java
>
modules/security/src/main/java/common/java/security/acl/Group.java
>
modules/security/src/main/java/common/java/security/acl/LastOwnerExcepti
on.java
>
modules/security/src/main/java/common/java/security/NoSuchProviderExcept
ion.java
>
modules/security/src/main/java/common/java/security/Identity.java
>
modules/security/src/main/java/common/java/security/KeyFactorySpi.java
>
modules/security/src/main/java/common/java/security/UnrecoverableEntryEx
ception.java
>
modules/security/src/main/java/common/java/security/Signature.java
>
modules/security/src/main/java/common/java/security/Timestamp.java
>
modules/security/src/main/java/common/java/security/SecureRandomSpi.java
>
modules/security/src/main/java/common/java/security/InvalidParameterExce
ption.java
>
modules/security/src/main/java/common/java/security/KeyException.java
>
modules/security/src/main/java/common/java/security/spec/ECFieldF2m.java
>
modules/security/src/main/java/common/java/security/spec/RSAOtherPrimeIn
fo.java
>
modules/security/src/main/java/common/java/security/spec/ECPoint.java
>
modules/security/src/main/java/common/java/security/spec/AlgorithmParame
terSpec.java
>
modules/security/src/main/java/common/java/security/spec/ECParameterSpec
.java
>
modules/security/src/main/java/common/java/security/spec/KeySpec.java
>
modules/security/src/main/java/common/java/security/spec/RSAKeyGenParame
terSpec.java
>
modules/security/src/main/java/common/java/security/spec/RSAPrivateKeySp
ec.java
>
modules/security/src/main/java/common/java/security/spec/ECPrivateKeySpe
c.java
>
modules/security/src/main/java/common/java/security/spec/MGF1ParameterSp
ec.java
>
modules/security/src/main/java/common/java/security/spec/RSAPublicKeySpe
c.java
>
modules/security/src/main/java/common/java/security/spec/EllipticCurve.j
ava
>
modules/security/src/main/java/common/java/security/spec/ECPublicKeySpec
.java
>
modules/security/src/main/java/common/java/security/spec/X509EncodedKeyS
pec.java
>
modules/security/src/main/java/common/java/security/spec/RSAPrivateCrtKe
ySpec.java
>
>modules/security/src/main/java/common/java/security/spec/InvalidParamet
erSpecException.java
>
modules/security/src/main/java/common/java/security/spec/ECFieldFp.java
>
modules/security/src/main/java/common/java/security/spec/PSSParameterSpe
c.java
>
modules/security/src/main/java/common/java/security/spec/DSAParameterSpe
c.java
>
modules/security/src/main/java/common/java/security/spec/EncodedKeySpec.
java
>
>modules/security/src/main/java/common/java/security/spec/RSAMultiPrimeP
rivateCrtKeySpec.java
>
modules/security/src/main/java/common/java/security/spec/DSAPrivateKeySp
ec.java
>
modules/security/src/main/java/common/java/security/spec/InvalidKeySpecE
xception.java
>
modules/security/src/main/java/common/java/security/spec/DSAPublicKeySpe
c.java
>
modules/security/src/main/java/common/java/security/spec/ECField.java
>
modules/security/src/main/java/common/java/security/spec/ECGenParameterS
pec.java
>
modules/security/src/main/java/common/java/security/spec/PKCS8EncodedKey
Spec.java
>
modules/security/src/main/java/common/java/security/AllPermission.java
>
modules/security/src/main/java/common/java/security/MessageDigest.java
>
modules/security/src/main/java/common/java/security/SecureRandom.java
>
modules/security/src/main/java/common/java/security/PublicKey.java
>
modules/security/src/main/java/common/java/security/KeyPairGeneratorSpi.
java
>
modules/security/src/main/java/common/java/security/AlgorithmParameterGe
nerator.java
>
>modules/security/src/main/java/common/org/apache/harmony/security/utils
/TwoKeyHashMap.java
>
>modules/security/src/main/java/common/org/apache/harmony/security/utils
/ObjectIdentifier.java
>
modules/security/src/main/java/common/org/apache/harmony/security/utils/
JarUtils.java
>
modules/security/src/main/java/common/org/apache/harmony/security/utils/
Array.java
>
>modules/security/src/main/java/common/org/apache/harmony/security/asn1/
ASN1Constants.java
>
modules/security/src/main/java/common/org/apache/harmony/security/asn1/A
SN1Boolean.java
>
modules/security/src/main/java/common/org/apache/harmony/security/asn1/A
SN1SetOf.java
>
modules/security/src/main/java/common/org/apache/harmony/security/asn1/A
SN1Type.java
>
>modules/security/src/main/java/common/org/apache/harmony/security/asn1/
ASN1Explicit.java
>
>modules/security/src/main/java/common/org/apache/harmony/security/asn1/
BerOutputStream.java
>
>modules/security/src/main/java/common/org/apache/harmony/security/asn1/
DerOutputStream.java
>
>modules/security/src/main/java/common/org/apache/harmony/security/asn1/
ObjectIdentifier.java
>
>modules/security/src/main/java/common/org/apache/harmony/security/asn1/
ASN1ValueCollection.java
>
>modules/security/src/main/java/common/org/apache/harmony/security/asn1/
ASN1Enumerated.java
>
modules/security/src/main/java/common/org/apache/harmony/security/asn1/A
SN1Set.java
>
modules/security/src/main/java/common/org/apache/harmony/security/asn1/A
SN1Integer.java
>
>modules/security/src/main/java/common/org/apache/harmony/security/asn1/
ASN1Exception.java
>
>modules/security/src/main/java/common/org/apache/harmony/security/asn1/
ASN1OpenType.java
>
>modules/security/src/main/java/common/org/apache/harmony/security/asn1/
ASN1BitString.java
>
>modules/security/src/main/java/common/org/apache/harmony/security/asn1/
ASN1OctetString.java
>
>modules/security/src/main/java/common/org/apache/harmony/security/asn1/
InformationObjectSet.java
>
>modules/security/src/main/java/common/org/apache/harmony/security/asn1/
ASN1GeneralizedTime.java
>
>modules/security/src/main/java/common/org/apache/harmony/security/asn1/
ASN1Implicit.java
>
>modules/security/src/main/java/common/org/apache/harmony/security/asn1/
BerInputStream.java
>
modules/security/src/main/java/common/org/apache/harmony/security/asn1/B
itString.java
>
>modules/security/src/main/java/common/org/apache/harmony/security/asn1/
DerInputStream.java
>
modules/security/src/main/java/common/org/apache/harmony/security/asn1/A
SN1Any.java
>
modules/security/src/main/java/common/org/apache/harmony/security/asn1/A
SN1Choice.java
>
>modules/security/src/main/java/common/org/apache/harmony/security/asn1/
ASN1TypeCollection.java
>
>modules/security/src/main/java/common/org/apache/harmony/security/asn1/
ASN1SequenceOf.java
>
modules/security/src/main/java/common/org/apache/harmony/security/asn1/A
SN1Time.java
>
>modules/security/src/main/java/common/org/apache/harmony/security/asn1/
ASN1Constructured.java
>
>modules/security/src/main/java/common/org/apache/harmony/security/asn1/
ASN1StringType.java
>
>modules/security/src/main/java/common/org/apache/harmony/security/asn1/
ASN1Sequence.java
>
>modules/security/src/main/java/common/org/apache/harmony/security/asn1/
ASN1Primitive.java
>
modules/security/src/main/java/common/org/apache/harmony/security/asn1/A
SN1UTCTime.java
>
modules/security/src/main/java/common/org/apache/harmony/security/asn1/A
SN1Oid.java
>
>modules/security/src/main/java/common/org/apache/harmony/security/x509/
NameConstraints.java
>
>modules/security/src/main/java/common/org/apache/harmony/security/x509/
CertificatePolicies.java
>
>modules/security/src/main/java/common/org/apache/harmony/security/x509/
PrivateKeyUsagePeriod.java
>
modules/security/src/main/java/common/org/apache/harmony/security/x509/E
xtension.java
>
>modules/security/src/main/java/common/org/apache/harmony/security/x509/
CRLDistributionPoints.java
>
>modules/security/src/main/java/common/org/apache/harmony/security/x509/
PolicyQualifierInfo.java
>
modules/security/src/main/java/common/org/apache/harmony/security/x509/G
eneralName.java
>
modules/security/src/main/java/common/org/apache/harmony/security/x509/D
NParser.java
>
>modules/security/src/main/java/common/org/apache/harmony/security/x509/
CertificateList.java
>
>modules/security/src/main/java/common/org/apache/harmony/security/x509/
EDIPartyName.java
>
modules/security/src/main/java/common/org/apache/harmony/security/x509/C
ertificate.java
>
modules/security/src/main/java/common/org/apache/harmony/security/x509/O
therName.java
>
>modules/security/src/main/java/common/org/apache/harmony/security/x509/
SubjectPublicKeyInfo.java
>
modules/security/src/main/java/common/org/apache/harmony/security/x509/V
alidity.java
>
modules/security/src/main/java/common/org/apache/harmony/security/x509/O
RAddress.java
>
>modules/security/src/main/java/common/org/apache/harmony/security/x509/
PolicyConstraints.java
>
>modules/security/src/main/java/common/org/apache/harmony/security/x509/
DistributionPoint.java
>
>modules/security/src/main/java/common/org/apache/harmony/security/x509/
AlgorithmIdentifier.java
>
>modules/security/src/main/java/common/org/apache/harmony/security/x509/
GeneralSubtrees.java
>
>modules/security/src/main/java/common/org/apache/harmony/security/x509/
DistributionPointName.java
>
>modules/security/src/main/java/common/org/apache/harmony/security/x509/
TBSCertificate.java
>
modules/security/src/main/java/common/org/apache/harmony/security/x509/T
ime.java
>
>modules/security/src/main/java/common/org/apache/harmony/security/fortr
ess/PolicyUtils.java
>
>modules/security/src/main/java/common/org/apache/harmony/security/fortr
ess/DefaultPolicyParser.java
>
>modules/security/src/main/java/common/org/apache/harmony/security/fortr
ess/Services.java
>
>modules/security/src/main/java/common/org/apache/harmony/security/fortr
ess/DefaultPolicy.java
>
modules/security/src/main/java/common/org/apache/harmony/security/fortre
ss/Engine.java
>
>modules/security/src/main/java/common/org/apache/harmony/security/fortr
ess/SecurityUtils.java
>
>modules/security/src/main/java/common/org/apache/harmony/security/fortr
ess/SecurityAccess.java
>
modules/security/src/main/java/common/org/apache/harmony/security/pkcs7/
SignedData.java
>
modules/security/src/main/java/common/org/apache/harmony/security/pkcs7/
SignerInfo.java
>
>modules/security/src/main/java/common/org/apache/harmony/security/pkcs7
/ContentInfo.java
>
>modules/security/src/main/java/common/org/apache/harmony/security/x/sec
urity/auth/DefaultSubjectPol
>icy.java
>
>modules/security/src/main/java/common/org/apache/harmony/security/x/sec
urity/auth/login/DefaultConf
>igurationParser.java
>
>modules/security/src/main/java/common/org/apache/harmony/security/x/sec
urity/auth/login/DefaultConf
>iguration.java
>
>modules/security/src/main/java/common/org/apache/harmony/security/provi
der/cert/X509CertPathImpl.ja
>va
>
>modules/security/src/main/java/common/org/apache/harmony/security/provi
der/cert/Cache.java
>
>modules/security/src/main/java/common/org/apache/harmony/security/provi
der/cert/X509CertImpl.java
>
>modules/security/src/main/java/common/org/apache/harmony/security/provi
der/cert/DRLCertFactory.java
>
>modules/security/src/main/java/common/org/apache/harmony/security/provi
der/cert/X509CRLImpl.java
>
>modules/security/src/main/java/common/org/apache/harmony/security/provi
der/cert/X509CRLEntryImpl.ja
>va
>
>modules/security/src/main/java/common/org/apache/harmony/security/provi
der/cert/X509CertFactoryImpl
>.java
>
>modules/security/src/main/java/common/org/apache/harmony/security/x501/
AttributeValue.java
>
modules/security/src/main/java/common/org/apache/harmony/security/x501/N
ame.java
>
>modules/security/src/main/java/common/org/apache/harmony/security/x501/
AttributeType.java
>
>modules/security/src/main/java/common/org/apache/harmony/security/x501/
AttributeTypeAndValue.java
>
modules/security/src/main/java/common/org/apache/harmony/security/x501/A
ttributes.java
>
>modules/security/src/main/java/common/org/apache/harmony/security/x501/
DirectoryString.java
>
modules/security/src/main/java/common/org/apache/harmony/security/x501/s
vn-commit.tmp
>
>modules/security/src/main/java/common/org/apache/harmony/security/x501/
AttributeTypeAndValueCompara
>tor.java
>
>modules/security/src/main/java/common/org/apache/harmony/security/Defau
ltPolicyScanner.java
>
modules/security/src/main/java/common/org/apache/harmony/security/System
Scope.java
>
modules/security/src/main/java/common/org/apache/harmony/misc/Base64.jav
a
>
modules/security/src/main/java/common/org/ietf/jgss/GSSContext.java
>
modules/security/src/main/java/common/org/ietf/jgss/ChannelBinding.java
>
modules/security/src/main/java/common/org/ietf/jgss/MessageProp.java
>
modules/security/src/main/java/common/org/ietf/jgss/GSSCredential.java
>
modules/security/src/main/java/common/org/ietf/jgss/GSSManager.java
>
modules/security/src/main/java/common/org/ietf/jgss/GSSException.java
>
modules/security/src/main/java/common/org/ietf/jgss/Oid.java
>
modules/security/src/main/java/common/org/ietf/jgss/GSSName.java
>
>modules/security/src/main/java/common/javax/security/auth/login/Credent
ialNotFoundException.java
>
modules/security/src/main/java/common/javax/security/auth/login/Configur
ation.java
>
modules/security/src/main/java/common/javax/security/auth/login/LoginExc
eption.java
>
>modules/security/src/main/java/common/javax/security/auth/login/Account
NotFoundException.java
>
>modules/security/src/main/java/common/javax/security/auth/login/Credent
ialException.java
>
>modules/security/src/main/java/common/javax/security/auth/login/AppConf
igurationEntry.java
>
>modules/security/src/main/java/common/javax/security/auth/login/Credent
ialExpiredException.java
>
modules/security/src/main/java/common/javax/security/auth/login/AccountE
xception.java
>
>modules/security/src/main/java/common/javax/security/auth/login/Account
ExpiredException.java
>
>modules/security/src/main/java/common/javax/security/auth/login/FailedL
oginException.java
>
>modules/security/src/main/java/common/javax/security/auth/login/Account
LockedException.java
>
modules/security/src/main/java/common/javax/security/auth/login/LoginCon
text.java
>
modules/security/src/main/java/common/javax/security/auth/AuthPermission
.java
>
modules/security/src/main/java/common/javax/security/auth/spi/LoginModul
e.java
>
>modules/security/src/main/java/common/javax/security/auth/callback/Pass
wordCallback.java
>
>modules/security/src/main/java/common/javax/security/auth/callback/Lang
uageCallback.java
>
>modules/security/src/main/java/common/javax/security/auth/callback/Text
InputCallback.java
>
>modules/security/src/main/java/common/javax/security/auth/callback/Text
OutputCallback.java
>
>modules/security/src/main/java/common/javax/security/auth/callback/Unsu
pportedCallbackException.jav
>a
>
>modules/security/src/main/java/common/javax/security/auth/callback/Conf
irmationCallback.java
>
modules/security/src/main/java/common/javax/security/auth/callback/Choic
eCallback.java
>
modules/security/src/main/java/common/javax/security/auth/callback/Callb
ackHandler.java
>
modules/security/src/main/java/common/javax/security/auth/callback/Callb
ack.java
>
modules/security/src/main/java/common/javax/security/auth/callback/NameC
allback.java
>
modules/security/src/main/java/common/javax/security/auth/kerberos/Kerbe
rosTicket.java
>
>modules/security/src/main/java/common/javax/security/auth/kerberos/Dele
gationPermission.java
>
modules/security/src/main/java/common/javax/security/auth/kerberos/Kerbe
rosKey.java
>
>modules/security/src/main/java/common/javax/security/auth/kerberos/Serv
icePermission.java
>
>modules/security/src/main/java/common/javax/security/auth/kerberos/Kerb
erosPrincipal.java
>
>modules/security/src/main/java/common/javax/security/auth/x500/X500Priv
ateCredential.java
>
modules/security/src/main/java/common/javax/security/auth/x500/X500Princ
ipal.java
>
modules/security/src/main/java/common/javax/security/auth/DestroyFailedE
xception.java
>
modules/security/src/main/java/common/javax/security/auth/Destroyable.ja
va
>
>modules/security/src/main/java/common/javax/security/auth/PrivateCreden
tialPermission.java
>
modules/security/src/main/java/common/javax/security/sasl/SaslClient.jav
a
>
modules/security/src/main/java/common/javax/security/sasl/SaslException.
java
>
modules/security/src/main/java/common/javax/security/sasl/SaslServerFact
ory.java
>
modules/security/src/main/java/common/javax/security/sasl/Sasl.java
>
modules/security/src/main/java/common/javax/security/sasl/AuthorizeCallb
ack.java
>
modules/security/src/main/java/common/javax/security/sasl/RealmChoiceCal
lback.java
>
modules/security/src/main/java/common/javax/security/sasl/SaslClientFact
ory.java
>
modules/security/src/main/java/common/javax/security/sasl/SaslServer.jav
a
>
modules/security/src/main/java/common/javax/security/sasl/RealmCallback.
java
>
modules/security/src/main/java/common/javax/security/sasl/Authentication
Exception.java
>
modules/security/src/main/java/common/javax/security/cert/CertificateExc
eption.java
>
modules/security/src/main/java/common/javax/security/cert/Certificate.ja
va
>
>modules/security/src/main/java/common/javax/security/cert/CertificateEx
piredException.java
>
>modules/security/src/main/java/common/javax/security/cert/CertificateNo
tYetValidException.java
>
>modules/security/src/main/java/common/javax/security/cert/CertificatePa
rsingException.java
>
>modules/security/src/main/java/common/javax/security/cert/CertificateEn
codingException.java
>
modules/security/src/main/java/common/javax/security/cert/X509Certificat
e.java
>
>modules/security/src/main/java/windows/org/apache/harmony/security/x/se
curity/auth/NTNumericCredent
>ial.java
>
>modules/security/src/main/java/windows/org/apache/harmony/security/x/se
curity/auth/NTSidGroupPrinci
>pal.java
>
>modules/security/src/main/java/windows/org/apache/harmony/security/x/se
curity/auth/NTSid.java
>
>modules/security/src/main/java/windows/org/apache/harmony/security/x/se
curity/auth/NTSidUserPrincip
>al.java
>
>modules/security/src/main/java/windows/org/apache/harmony/security/x/se
curity/auth/NTUserPrincipal.
>java
>
>modules/security/src/main/java/windows/org/apache/harmony/security/x/se
curity/auth/NTSidPrimaryGrou
>pPrincipal.java
>
>modules/security/src/main/java/windows/org/apache/harmony/security/x/se
curity/auth/module/NTLoginMo
>dule.java
>
>modules/security/src/main/java/windows/org/apache/harmony/security/x/se
curity/auth/module/NTSystem.
>java
>
>modules/security/src/main/java/windows/org/apache/harmony/security/x/se
curity/auth/NTDomainPrincipa
>l.java
>
>modules/security/src/main/java/windows/org/apache/harmony/security/x/se
curity/auth/NTSidDomainPrinc
>ipal.java
>            modules/security/make/common/hyproperties.xml
>            modules/security/make/common/build.xml
>
>***********************************************************************
*****
>Output:
>***********************************************************************
*****
>Buildfile: make/build.xml
>
>clean:
>
>clean-bin:
>   [delete] Deleting 2007 files from
/home/hybld/continuum-1.0.2/apps/continuum/working-
>directory/1/build
>   [delete] Deleted 114 directories from
/home/hybld/continuum-1.0.2/apps/continuum/working-
>directory/1/build
>
>clean-layout:
>   [delete] Deleting 63 files from
/home/hybld/continuum-1.0.2/apps/continuum/working-
>directory/1/deploy
>   [delete] Deleted 7 directories from
/home/hybld/continuum-1.0.2/apps/continuum/working-
>directory/1/deploy
>
>clean-package:
>   [delete]
/home/hybld/continuum-1.0.2/apps/continuum/working-directory/1/build/com
ponents not
>found.
>
>clean:
>
>init:
>
>windows-properties:
>
>linux-properties:
>
>properties:
>
>clean-overlay-oss:
>   [delete] Deleting directory
/home/hybld/continuum-1.0.2/apps/continuum/working-
>directory/1/native-src/linux.IA32/fdlibm/dist
>   [delete] Deleting directory
/home/hybld/continuum-1.0.2/apps/continuum/working-
>directory/1/native-src/linux.IA32/zlib/dist
>   [delete] Deleting directory
/home/hybld/continuum-1.0.2/apps/continuum/working-
>directory/1/native-src/linux.IA32/include/unicode
>   [delete] Deleting:
/home/hybld/continuum-1.0.2/apps/continuum/working-directory/1/native-
>src/linux.IA32/text/libicuuc.so.34
>
>make-clean:
>     [exec] (cd auth && /usr/bin/make clean )
>     [exec] make[1]: Entering directory
`/home/hybld/continuum-1.0.2/apps/continuum/working-
>directory/1/native-src/linux.IA32/auth'
>     [exec] rm -f ../../shared/auth/auth_copyright.o authnix.o
../libhyauth.so
>     [exec] make[1]: Leaving directory
`/home/hybld/continuum-1.0.2/apps/continuum/working-
>directory/1/native-src/linux.IA32/auth'
>     [exec] (cd sig && /usr/bin/make clean )
>     [exec] make[1]: Entering directory
`/home/hybld/continuum-1.0.2/apps/continuum/working-
>directory/1/native-src/linux.IA32/sig'
>     [exec] rm -f ../../shared/sig/hysig_copyright.o hysiglinux.o
hysigunix.o ../libhysig.so
>     [exec] make[1]: Leaving directory
`/home/hybld/continuum-1.0.2/apps/continuum/working-
>directory/1/native-src/linux.IA32/sig'
>     [exec] (cd pool  && /usr/bin/make clean )
>     [exec] make[1]: Entering directory
`/home/hybld/continuum-1.0.2/apps/continuum/working-
>directory/1/native-src/linux.IA32/pool'
>     [exec] rm -f ../../shared/pool/pool.o ../../shared/pool/pool_cap.o
../lib/libhypool.a
>     [exec] make[1]: Leaving directory
`/home/hybld/continuum-1.0.2/apps/continuum/working-
>directory/1/native-src/linux.IA32/pool'
>     [exec] (cd thread && /usr/bin/make clean )
>     [exec] make[1]: Entering directory
`/home/hybld/continuum-1.0.2/apps/continuum/working-
>directory/1/native-src/linux.IA32/thread'
>     [exec] rm -f ../../shared/thread/thread_copyright.o thrhelp.o
thrspinlock.o hythread.o
>../../shared/thread/hythreadinspect.o linuxonexit.o priority.o
rasthrsup.o
>../../shared/thread/rwmutex.o thrcreate.o thrdsup.o
../../shared/thread/thrprof.o ../libhythr.so
>     [exec] make[1]: Leaving directory
`/home/hybld/continuum-1.0.2/apps/continuum/working-
>directory/1/native-src/linux.IA32/thread'
>     [exec] (cd port && /usr/bin/make clean )
>     [exec] make[1]: Entering directory
`/home/hybld/continuum-1.0.2/apps/continuum/working-
>directory/1/native-src/linux.IA32/port'
>     [exec] rm -f ../../shared/port/port_copyright.o hycpu.o
../../shared/port/hyerror.o
>hyerrorhelpers.o ../../shared/port/hyexit.o hyfile.o hyfiletext.o
../../shared/port/hygp.o
>hyipcmutex.o hymem.o hymmap.o ../../shared/port/hynls.o hynlshelpers.o
hyosdump.o
>../../shared/port/hyport.o ../../shared/port/hyportcontrol.o
hyportptb.o hysharedhelper.o hyshmem.o
>hyshsem.o hysignal.o hysl.o hysock.o ../../shared/port/hystr.o
../../shared/port/hystrftime.o
>../../shared/port/hystsl.o hysysinfo.o hytime.o
../../shared/port/hytlshelpers.o hytty.o hyvmem.o
>../libhyprt.so
>     [exec] make[1]: Leaving directory
`/home/hybld/continuum-1.0.2/apps/continuum/working-
>directory/1/native-src/linux.IA32/port'
>     [exec] (cd fdlibm && /usr/bin/make clean )
>     [exec] make[1]: Entering directory
`/home/hybld/continuum-1.0.2/apps/continuum/working-
>directory/1/native-src/linux.IA32/fdlibm'
>     [exec] rm -f dist/e_acos.o dist/e_acosh.o dist/e_asin.o
dist/e_atan2.o dist/e_atanh.o
>dist/e_cosh.o dist/e_exp.o dist/e_fmod.o dist/e_gamma.o
dist/e_gamma_r.o dist/e_hypot.o dist/e_j0.o
>dist/e_j1.o dist/e_jn.o dist/e_lgamma.o dist/e_lgamma_r.o dist/e_log.o
dist/e_log10.o dist/e_pow.o
>dist/e_rem_pio2.o dist/e_remainder.o dist/e_scalb.o dist/e_sinh.o
dist/e_sqrt.o dist/k_cos.o
>dist/k_rem_pio2.o dist/k_sin.o dist/k_standard.o dist/k_tan.o
dist/s_asinh.o dist/s_atan.o
>dist/s_cbrt.o dist/s_ceil.o dist/s_copysign.o dist/s_cos.o dist/s_erf.o
dist/s_expm1.o
>dist/s_fabs.o dist/s_finite.o dist/s_floor.o dist/s_frexp.o
dist/s_ilogb.o dist/s_isnan.o
>dist/s_ldexp.o ../../shared/fdlibm/s_lib_version.o dist/s_log1p.o
dist/s_logb.o dist/s_matherr.o
>dist/s_modf.o dist/s_nextafter.o dist/s_rint.o dist/s_scalbn.o
dist/s_signgam.o
>dist/s_significand.o dist/s_sin.o dist/s_tan.o dist/s_tanh.o
dist/w_acos.o dist/w_acosh.o
>dist/w_asin.o dist/w_atan2.o dist/w_atanh.o dist/w_cosh.o dist/w_exp.o
dist/w_fmod.o dist/w_gamma.o
>dist/w_gamma_r.o dist/w_hypot.o dist/w_j0.o dist/w_j1.o dist/w_jn.o
dist/w_lgamma.o
>dist/w_lgamma_r.o dist/w_log.o dist/w_log10.o dist/w_pow.o
dist/w_remainder.o dist/w_scalb.o
>dist/w_sinh.o dist/w_sqrt.o   ../lib/libhyfdlibm.a
>     [exec] make[1]: Leaving directory
`/home/hybld/continuum-1.0.2/apps/continuum/working-
>directory/1/native-src/linux.IA32/fdlibm'
>     [exec] (cd zip && /usr/bin/make clean )
>     [exec] make[1]: Entering directory
`/home/hybld/continuum-1.0.2/apps/continuum/working-
>directory/1/native-src/linux.IA32/zip'
>     [exec] rm -f ../../shared/zip/zcpool.o ../../shared/zip/zipalloc.o
../../shared/zip/zipcache.o
>../../shared/zip/zipsup.o   ../lib/libhyzip.a
>     [exec] make[1]: Leaving directory
`/home/hybld/continuum-1.0.2/apps/continuum/working-
>directory/1/native-src/linux.IA32/zip'
>     [exec] (cd zlib && /usr/bin/make clean )
>     [exec] make[1]: Entering directory
`/home/hybld/continuum-1.0.2/apps/continuum/working-
>directory/1/native-src/linux.IA32/zlib'
>     [exec] rm -f ../../shared/zlib/zlib_copyright.o dist/adler32.o
dist/compress.o dist/crc32.o
>dist/deflate.o dist/infback.o dist/inffast.o dist/inflate.o
dist/inftrees.o dist/trees.o
>dist/uncompr.o dist/zutil.o ../libhyzlib.so
>     [exec] make[1]: Leaving directory
`/home/hybld/continuum-1.0.2/apps/continuum/working-
>directory/1/native-src/linux.IA32/zlib'
>     [exec] (cd vmi && /usr/bin/make clean )
>     [exec] make[1]: Entering directory
`/home/hybld/continuum-1.0.2/apps/continuum/working-
>directory/1/native-src/linux.IA32/vmi'
>     [exec] rm -f ../../shared/vmi/vmi_copyright.o
../../shared/vmi/vmi.o ../libvmi.so
>     [exec] make[1]: Leaving directory
`/home/hybld/continuum-1.0.2/apps/continuum/working-
>directory/1/native-src/linux.IA32/vmi'
>     [exec] (cd common && /usr/bin/make clean )
>     [exec] make[1]: Entering directory
`/home/hybld/continuum-1.0.2/apps/continuum/working-
>directory/1/native-src/linux.IA32/common'
>     [exec] rm -f ../../shared/common/libglob.o
../../shared/common/iohelp.o
>../../shared/common/utf8encode.o ../../shared/common/utf8decode.o
../lib/libhycommon.a
>     [exec] make[1]: Leaving directory
`/home/hybld/continuum-1.0.2/apps/continuum/working-
>directory/1/native-src/linux.IA32/common'
>     [exec] (cd luni && /usr/bin/make clean )
>     [exec] make[1]: Entering directory
`/home/hybld/continuum-1.0.2/apps/continuum/working-
>directory/1/native-src/linux.IA32/luni'
>     [exec] rm -f ../../shared/luni/luni_copyright.o
../../shared/luni/file.o procimpl.o
>../../shared/luni/oos.o ../../shared/luni/nethelp.o
../../shared/luni/floatbits.o
>../../shared/luni/ois.o helpers.o ../../shared/luni/math.o
../../shared/luni/luniglob.o
>../../shared/luni/proxy.o ../../shared/luni/netif.o
../../shared/luni/process.o
>../../shared/luni/bigint.o ../../shared/luni/osc.o
../../shared/luni/socket.o
>../../shared/luni/inetadds.o ../../shared/luni/filedesc.o
../../shared/luni/timezone.o
>../../shared/luni/OSFileSystem.o OSFileSystemLinux32.o OSMemory.o
OSMemoryLinux32.o
>OSNetworkSystem.o OSNetworkSystemLinux.o ../libhyluni.so
>     [exec] make[1]: Leaving directory
`/home/hybld/continuum-1.0.2/apps/continuum/working-
>directory/1/native-src/linux.IA32/luni'
>     [exec] (cd nio && /usr/bin/make clean )
>     [exec] make[1]: Entering directory
`/home/hybld/continuum-1.0.2/apps/continuum/working-
>directory/1/native-src/linux.IA32/nio'
>     [exec] rm -f ../../shared/nio/nio_copyright.o ../libhynio.so
>     [exec] make[1]: Leaving directory
`/home/hybld/continuum-1.0.2/apps/continuum/working-
>directory/1/native-src/linux.IA32/nio'
>     [exec] (cd archive && /usr/bin/make clean )
>     [exec] make[1]: Entering directory
`/home/hybld/continuum-1.0.2/apps/continuum/working-
>directory/1/native-src/linux.IA32/archive'
>     [exec] rm -f ../../shared/archive/archive_copyright.o
../../shared/archive/jclcrc32.o
>../../shared/archive/zip.o ../../shared/archive/adler32.o
../../shared/archive/inflater.o
>../../shared/archive/jarfile.o ../../shared/archive/deflater.o
../../shared/archive/archiveglob.o
>../libhyarchive.so
>     [exec] make[1]: Leaving directory
`/home/hybld/continuum-1.0.2/apps/continuum/working-
>directory/1/native-src/linux.IA32/archive'
>     [exec] (cd math && /usr/bin/make clean )
>     [exec] make[1]: Entering directory
`/home/hybld/continuum-1.0.2/apps/continuum/working-
>directory/1/native-src/linux.IA32/math'
>     [exec] rm -f ../../shared/math/math_copyright.o
../../shared/math/fltparse.o
>../../shared/math/mathglob.o ../../shared/math/dblparse.o
../../shared/math/bigint.o
>../../shared/math/cbigint.o ../libhymath.so
>     [exec] make[1]: Leaving directory
`/home/hybld/continuum-1.0.2/apps/continuum/working-
>directory/1/native-src/linux.IA32/math'
>     [exec] (cd text && /usr/bin/make clean )
>     [exec] make[1]: Entering directory
`/home/hybld/continuum-1.0.2/apps/continuum/working-
>directory/1/native-src/linux.IA32/text'
>     [exec] rm -f text_copyright.o ../../shared/text/BidiWrapper.o
../libhytext.so
>     [exec] make[1]: Leaving directory
`/home/hybld/continuum-1.0.2/apps/continuum/working-
>directory/1/native-src/linux.IA32/text'
>     [exec] (cd vmls && /usr/bin/make clean )
>     [exec] make[1]: Entering directory
`/home/hybld/continuum-1.0.2/apps/continuum/working-
>directory/1/native-src/linux.IA32/vmls'
>     [exec] rm -f ../../shared/vmls/vmls.o   ../lib/libhyvmls.a
>     [exec] make[1]: Leaving directory
`/home/hybld/continuum-1.0.2/apps/continuum/working-
>directory/1/native-src/linux.IA32/vmls'
>     [exec] (cd launcher && /usr/bin/make clean )
>     [exec] make[1]: Entering directory
`/home/hybld/continuum-1.0.2/apps/continuum/working-
>directory/1/native-src/linux.IA32/launcher'
>     [exec] rm -f ../../shared/launcher/main.o
../../shared/launcher/cmain.o
>../../shared/launcher/launcher_copyright.o
../../shared/launcher/strbuf.o
>../../shared/launcher/libhlp.o    ../java
>     [exec] make[1]: Leaving directory
`/home/hybld/continuum-1.0.2/apps/continuum/working-
>directory/1/native-src/linux.IA32/launcher'
>
>clean-layout:
>
>clean:
>
>build:
>     [echo]
>     [echo] ========================================
>     [echo] Building Java component archives...
>     [echo] ========================================
>
>copy-resources:
>    [mkdir] Created dir:
/home/hybld/continuum-1.0.2/apps/continuum/working-directory/1/build
>     [copy] Copying 276 files to
/home/hybld/continuum-1.0.2/apps/continuum/working-
>directory/1/build
>
>prepare-depends:
>
>check:
>     [echo] Checking for depends/jars/xalan-j_2.6.0/xalan.jar
>     [echo] Checking for depends/jars/xerces_2.6.2/resolver.jar
>     [echo] Checking for depends/jars/xerces_2.6.2/xercesImpl.jar
>     [echo] Checking for depends/jars/xerces_2.6.2/xml-apis.jar
>     [echo] Checking for depends/jars/junit_3.8.1/junit.jar
>     [echo] Checking for
depends/jars/bcprov-jdk14-132/signed.bcprov.jar
>     [echo] Checking for depends/jars/icu4j_3.4.4/icu4j_3_4_4.jar
>
>create-unsigned-bcprov-jar:
>
>check-win:
>
>compile:
>    [javac] Compiling 1221 source files to
/home/hybld/continuum-1.0.2/apps/continuum/working-
>directory/1/build
>    [javac] /home/hybld/continuum-1.0.2/apps/continuum/working-
>directory/1/modules/crypto/src/main/java/javax/crypto/Cipher.java:42:
package
>org.apache.harmony.security.fortress does not exist
>    [javac] import org.apache.harmony.security.fortress.Engine;
>    [javac]                                             ^
>    [javac] /home/hybld/continuum-1.0.2/apps/continuum/working-
>directory/1/modules/crypto/src/main/java/javax/crypto/Cipher.java:103:
cannot find symbol
>    [javac] symbol  : class Engine
>    [javac] location: class javax.crypto.Cipher
>    [javac]     private static Engine engine = new Engine(SERVICE);
>    [javac]                    ^
>    [javac] /home/hybld/continuum-1.0.2/apps/continuum/working-
>directory/1/modules/crypto/src/main/java/javax/crypto/ExemptionMechanis
m.java:34: package
>org.apache.harmony.security.fortress does not exist
>    [javac] import org.apache.harmony.security.fortress.Engine;
>    [javac]                                             ^
>    [javac] /home/hybld/continuum-1.0.2/apps/continuum/working-
>directory/1/modules/crypto/src/main/java/javax/crypto/ExemptionMechanis
m.java:47: cannot find
>symbol
>    [javac] symbol  : class Engine
>    [javac] location: class javax.crypto.ExemptionMechanism
>    [javac]     private static Engine engine = new Engine(SERVICE);
>    [javac]                    ^
>    [javac] /home/hybld/continuum-1.0.2/apps/continuum/working-
>directory/1/modules/crypto/src/main/java/javax/crypto/EncryptedPrivateK
eyInfo.java:35: package
>org.apache.harmony.security.asn1 does not exist
>    [javac] import org.apache.harmony.security.asn1.ASN1Any;
>    [javac]                                         ^
>    [javac] /home/hybld/continuum-1.0.2/apps/continuum/working-
>directory/1/modules/crypto/src/main/java/javax/crypto/EncryptedPrivateK
eyInfo.java:36: package
>org.apache.harmony.security.asn1 does not exist
>    [javac] import org.apache.harmony.security.asn1.ASN1Implicit;
>    [javac]                                         ^
>    [javac] /home/hybld/continuum-1.0.2/apps/continuum/working-
>directory/1/modules/crypto/src/main/java/javax/crypto/EncryptedPrivateK
eyInfo.java:37: package
>org.apache.harmony.security.asn1 does not exist
>    [javac] import org.apache.harmony.security.asn1.ASN1Integer;
>    [javac]                                         ^
>    [javac] /home/hybld/continuum-1.0.2/apps/continuum/working-
>directory/1/modules/crypto/src/main/java/javax/crypto/EncryptedPrivateK
eyInfo.java:38: package
>org.apache.harmony.security.asn1 does not exist
>    [javac] import org.apache.harmony.security.asn1.ASN1OctetString;
>    [javac]                                         ^
>    [javac] /home/hybld/continuum-1.0.2/apps/continuum/working-
>directory/1/modules/crypto/src/main/java/javax/crypto/EncryptedPrivateK
eyInfo.java:39: package
>org.apache.harmony.security.asn1 does not exist
>    [javac] import org.apache.harmony.security.asn1.ASN1Sequence;
>    [javac]                                         ^
>    [javac] /home/hybld/continuum-1.0.2/apps/continuum/working-
>directory/1/modules/crypto/src/main/java/javax/crypto/EncryptedPrivateK
eyInfo.java:40: package
>org.apache.harmony.security.asn1 does not exist
>    [javac] import org.apache.harmony.security.asn1.ASN1SetOf;
>    [javac]                                         ^
>    [javac] /home/hybld/continuum-1.0.2/apps/continuum/working-
>directory/1/modules/crypto/src/main/java/javax/crypto/EncryptedPrivateK
eyInfo.java:41: package
>org.apache.harmony.security.asn1 does not exist
>    [javac] import org.apache.harmony.security.asn1.ASN1Type;
>    [javac]                                         ^
>    [javac] /home/hybld/continuum-1.0.2/apps/continuum/working-
>directory/1/modules/crypto/src/main/java/javax/crypto/EncryptedPrivateK
eyInfo.java:43: package
>org.apache.harmony.security.x509 does not exist
>    [javac] import
org.apache.harmony.security.x509.AlgorithmIdentifier;
>    [javac]                                         ^
>    [javac] /home/hybld/continuum-1.0.2/apps/continuum/working-
>directory/1/modules/crypto/src/main/java/javax/crypto/EncryptedPrivateK
eyInfo.java:388: cannot find
>symbol
>    [javac] symbol  : class ASN1Sequence
>    [javac] location: class javax.crypto.EncryptedPrivateKeyInfo
>    [javac]     private static final ASN1Sequence asn1 = new
ASN1Sequence(new ASN1Type[] {
>    [javac]                          ^
>    [javac] /home/hybld/continuum-1.0.2/apps/continuum/working-
>directory/1/modules/crypto/src/main/java/javax/crypto/EncryptedPrivateK
eyInfo.java:426: cannot find
>symbol
>    [javac] symbol  : class ASN1SetOf
>    [javac] location: class javax.crypto.EncryptedPrivateKeyInfo
>    [javac]     private static final ASN1SetOf ASN1Attributes = new
>ASN1SetOf(ASN1Any.getInstance());
>    [javac]                          ^
>    [javac] /home/hybld/continuum-1.0.2/apps/continuum/working-
>directory/1/modules/crypto/src/main/java/javax/crypto/EncryptedPrivateK
eyInfo.java:428: cannot find
>symbol
>    [javac] symbol  : class ASN1Sequence
>    [javac] location: class javax.crypto.EncryptedPrivateKeyInfo
>    [javac]     private static final ASN1Sequence ASN1PrivateKeyInfo =
new ASN1Sequence(
>    [javac]                          ^
>    [javac] /home/hybld/continuum-1.0.2/apps/continuum/working-
>directory/1/modules/crypto/src/main/java/javax/crypto/KeyAgreement.java
:34: package
>org.apache.harmony.security.fortress does not exist
>    [javac] import org.apache.harmony.security.fortress.Engine;
>    [javac]                                             ^
>    [javac] /home/hybld/continuum-1.0.2/apps/continuum/working-
>directory/1/modules/crypto/src/main/java/javax/crypto/KeyAgreement.java
:48: cannot find symbol
>    [javac] symbol  : class Engine
>    [javac] location: class javax.crypto.KeyAgreement
>    [javac]     private static Engine engine = new Engine(SERVICE);
>    [javac]                    ^
>    [javac] /home/hybld/continuum-1.0.2/apps/continuum/working-
>directory/1/modules/crypto/src/main/java/javax/crypto/KeyGenerator.java
:32: package
>org.apache.harmony.security.fortress does not exist
>    [javac] import org.apache.harmony.security.fortress.Engine;
>    [javac]                                             ^
>    [javac] /home/hybld/continuum-1.0.2/apps/continuum/working-
>directory/1/modules/crypto/src/main/java/javax/crypto/KeyGenerator.java
:46: cannot find symbol
>    [javac] symbol  : class Engine
>    [javac] location: class javax.crypto.KeyGenerator
>    [javac]     private static Engine engine = new Engine(SERVICE);
>    [javac]                    ^
>    [javac] /home/hybld/continuum-1.0.2/apps/continuum/working-
>directory/1/modules/crypto/src/main/java/javax/crypto/Mac.java:34:
package
>org.apache.harmony.security.fortress does not exist
>    [javac] import org.apache.harmony.security.fortress.Engine;
>    [javac]                                             ^
>    [javac] /home/hybld/continuum-1.0.2/apps/continuum/working-
>directory/1/modules/crypto/src/main/java/javax/crypto/Mac.java:48:
cannot find symbol
>    [javac] symbol  : class Engine
>    [javac] location: class javax.crypto.Mac
>    [javac]     private static Engine engine = new Engine(SERVICE);
>    [javac]                    ^
>    [javac] /home/hybld/continuum-1.0.2/apps/continuum/working-
>directory/1/modules/crypto/src/main/java/javax/crypto/SecretKeyFactory.
java:32: package
>org.apache.harmony.security.fortress does not exist
>    [javac] import org.apache.harmony.security.fortress.Engine;
>    [javac]                                             ^
>    [javac] /home/hybld/continuum-1.0.2/apps/continuum/working-
>directory/1/modules/crypto/src/main/java/javax/crypto/SecretKeyFactory.
java:45: cannot find symbol
>    [javac] symbol  : class Engine
>    [javac] location: class javax.crypto.SecretKeyFactory
>    [javac]     private static Engine engine = new Engine(SERVICE);
>    [javac]                    ^
>    [javac] /home/hybld/continuum-1.0.2/apps/continuum/working-
>directory/1/modules/archive/src/main/java/java/util/jar/JarVerifier.jav
a:37: package
>org.apache.harmony.security.utils does not exist
>    [javac] import org.apache.harmony.security.utils.JarUtils;
>    [javac]                                          ^
>    [javac]
/home/hybld/continuum-1.0.2/apps/continuum/working-directory/1/modules/x
-
>net/src/main/java/javax/net/ssl/DefaultSSLContext.java:32: package
>org.apache.harmony.security.fortress does not exist
>    [javac] import org.apache.harmony.security.fortress.Engine;
>    [javac]                                             ^
>    [javac]
/home/hybld/continuum-1.0.2/apps/continuum/working-directory/1/modules/x
-
>net/src/main/java/javax/net/ssl/DefaultSSLContext.java:33: package
>org.apache.harmony.security.fortress does not exist
>    [javac] import org.apache.harmony.security.fortress.Services;
>    [javac]                                             ^
>    [javac]
/home/hybld/continuum-1.0.2/apps/continuum/working-directory/1/modules/x
-
>net/src/main/java/javax/net/ssl/SSLContext.java:31: package
org.apache.harmony.security.fortress
>does not exist
>    [javac] import org.apache.harmony.security.fortress.Engine;
>    [javac]                                             ^
>    [javac]
/home/hybld/continuum-1.0.2/apps/continuum/working-directory/1/modules/x
-
>net/src/main/java/javax/net/ssl/SSLContext.java:44: cannot find symbol
>    [javac] symbol  : class Engine
>    [javac] location: class javax.net.ssl.SSLContext
>    [javac]     private static Engine engine = new Engine(SERVICE);
>    [javac]                    ^
>    [javac]
/home/hybld/continuum-1.0.2/apps/continuum/working-directory/1/modules/x
-
>net/src/main/java/javax/net/ssl/KeyManagerFactory.java:34: package
>org.apache.harmony.security.fortress does not exist
>    [javac] import org.apache.harmony.security.fortress.Engine;
>    [javac]                                             ^
>    [javac]
/home/hybld/continuum-1.0.2/apps/continuum/working-directory/1/modules/x
-
>net/src/main/java/javax/net/ssl/KeyManagerFactory.java:47: cannot find
symbol
>    [javac] symbol  : class Engine
>    [javac] location: class javax.net.ssl.KeyManagerFactory
>    [javac]     private static Engine engine = new Engine(SERVICE);
>    [javac]                    ^
>    [javac]
/home/hybld/continuum-1.0.2/apps/continuum/working-directory/1/modules/x
-
>net/src/main/java/javax/net/ssl/TrustManagerFactory.java:33: package
>org.apache.harmony.security.fortress does not exist
>    [javac] import org.apache.harmony.security.fortress.Engine;
>    [javac]                                             ^
>    [javac]
/home/hybld/continuum-1.0.2/apps/continuum/working-directory/1/modules/x
-
>net/src/main/java/javax/net/ssl/TrustManagerFactory.java:46: cannot
find symbol
>    [javac] symbol  : class Engine
>    [javac] location: class javax.net.ssl.TrustManagerFactory
>    [javac]     private static Engine engine = new Engine(SERVICE);
>    [javac]                    ^
>    [javac] /home/hybld/continuum-1.0.2/apps/continuum/working-
>directory/1/modules/crypto/src/main/java/javax/crypto/Cipher.java:103:
cannot find symbol
>    [javac] symbol  : class Engine
>    [javac] location: class javax.crypto.Cipher
>    [javac]     private static Engine engine = new Engine(SERVICE);
>    [javac]                                        ^
>    [javac] /home/hybld/continuum-1.0.2/apps/continuum/working-
>directory/1/modules/crypto/src/main/java/javax/crypto/ExemptionMechanis
m.java:47: cannot find
>symbol
>    [javac] symbol  : class Engine
>    [javac] location: class javax.crypto.ExemptionMechanism
>    [javac]     private static Engine engine = new Engine(SERVICE);
>    [javac]                                        ^
>    [javac] /home/hybld/continuum-1.0.2/apps/continuum/working-
>directory/1/modules/crypto/src/main/java/javax/crypto/EncryptedPrivateK
eyInfo.java:75: cannot find
>symbol
>    [javac] symbol  : class AlgorithmIdentifier
>    [javac] location: class javax.crypto.EncryptedPrivateKeyInfo
>    [javac]         AlgorithmIdentifier aId = (AlgorithmIdentifier)
values[0];
>    [javac]         ^
>    [javac] /home/hybld/continuum-1.0.2/apps/continuum/working-
>directory/1/modules/crypto/src/main/java/javax/crypto/EncryptedPrivateK
eyInfo.java:75: cannot find
>symbol
>    [javac] symbol  : class AlgorithmIdentifier
>    [javac] location: class javax.crypto.EncryptedPrivateKeyInfo
>    [javac]         AlgorithmIdentifier aId = (AlgorithmIdentifier)
values[0];
>    [javac]                                    ^
>    [javac] /home/hybld/continuum-1.0.2/apps/continuum/working-
>directory/1/modules/crypto/src/main/java/javax/crypto/EncryptedPrivateK
eyInfo.java:388: cannot find
>symbol
>    [javac] symbol  : class ASN1Sequence
>    [javac] location: class javax.crypto.EncryptedPrivateKeyInfo
>    [javac]     private static final ASN1Sequence asn1 = new
ASN1Sequence(new ASN1Type[] {
>    [javac]                                                  ^
>    [javac] /home/hybld/continuum-1.0.2/apps/continuum/working-
>directory/1/modules/crypto/src/main/java/javax/crypto/EncryptedPrivateK
eyInfo.java:388: cannot find
>symbol
>    [javac] symbol  : class ASN1Type
>    [javac] location: class javax.crypto.EncryptedPrivateKeyInfo
>    [javac]     private static final ASN1Sequence asn1 = new
ASN1Sequence(new ASN1Type[] {
>    [javac]
^
>    [javac] /home/hybld/continuum-1.0.2/apps/continuum/working-
>directory/1/modules/crypto/src/main/java/javax/crypto/EncryptedPrivateK
eyInfo.java:389: cannot find
>symbol
>    [javac] symbol  : variable AlgorithmIdentifier
>    [javac] location: class javax.crypto.EncryptedPrivateKeyInfo
>    [javac]             AlgorithmIdentifier.ASN1,
ASN1OctetString.getInstance() }) {
>    [javac]             ^
>    [javac] /home/hybld/continuum-1.0.2/apps/continuum/working-
>directory/1/modules/crypto/src/main/java/javax/crypto/EncryptedPrivateK
eyInfo.java:389: cannot find
>symbol
>    [javac] symbol  : variable ASN1OctetString
>    [javac] location: class javax.crypto.EncryptedPrivateKeyInfo
>    [javac]             AlgorithmIdentifier.ASN1,
ASN1OctetString.getInstance() }) {
>    [javac]                                       ^
>    [javac] /home/hybld/continuum-1.0.2/apps/continuum/working-
>directory/1/modules/crypto/src/main/java/javax/crypto/EncryptedPrivateK
eyInfo.java:426: cannot find
>symbol
>    [javac] symbol  : class ASN1SetOf
>    [javac] location: class javax.crypto.EncryptedPrivateKeyInfo
>    [javac]     private static final ASN1SetOf ASN1Attributes = new
>ASN1SetOf(ASN1Any.getInstance());
>    [javac]                                                         ^
>    [javac] /home/hybld/continuum-1.0.2/apps/continuum/working-
>directory/1/modules/crypto/src/main/java/javax/crypto/EncryptedPrivateK
eyInfo.java:426: cannot find
>symbol
>    [javac] symbol  : variable ASN1Any
>    [javac] location: class javax.crypto.EncryptedPrivateKeyInfo
>    [javac]     private static final ASN1SetOf ASN1Attributes = new
>ASN1SetOf(ASN1Any.getInstance());
>    [javac]
^
>    [javac] /home/hybld/continuum-1.0.2/apps/continuum/working-
>directory/1/modules/crypto/src/main/java/javax/crypto/EncryptedPrivateK
eyInfo.java:428: cannot find
>symbol
>    [javac] symbol  : class ASN1Sequence
>    [javac] location: class javax.crypto.EncryptedPrivateKeyInfo
>    [javac]     private static final ASN1Sequence ASN1PrivateKeyInfo =
new ASN1Sequence(
>    [javac]
^
>    [javac] /home/hybld/continuum-1.0.2/apps/continuum/working-
>directory/1/modules/crypto/src/main/java/javax/crypto/EncryptedPrivateK
eyInfo.java:429: cannot find
>symbol
>    [javac] symbol  : class ASN1Type
>    [javac] location: class javax.crypto.EncryptedPrivateKeyInfo
>    [javac]             new ASN1Type[] { ASN1Integer.getInstance(),
AlgorithmIdentifier.ASN1,
>    [javac]                 ^
>    [javac] /home/hybld/continuum-1.0.2/apps/continuum/working-
>directory/1/modules/crypto/src/main/java/javax/crypto/EncryptedPrivateK
eyInfo.java:429: cannot find
>symbol
>    [javac] symbol  : variable ASN1Integer
>    [javac] location: class javax.crypto.EncryptedPrivateKeyInfo
>    [javac]             new ASN1Type[] { ASN1Integer.getInstance(),
AlgorithmIdentifier.ASN1,
>    [javac]                              ^
>    [javac] /home/hybld/continuum-1.0.2/apps/continuum/working-
>directory/1/modules/crypto/src/main/java/javax/crypto/EncryptedPrivateK
eyInfo.java:429: cannot find
>symbol
>    [javac] symbol  : variable AlgorithmIdentifier
>    [javac] location: class javax.crypto.EncryptedPrivateKeyInfo
>    [javac]             new ASN1Type[] { ASN1Integer.getInstance(),
AlgorithmIdentifier.ASN1,
>    [javac]                                                         ^
>    [javac] /home/hybld/continuum-1.0.2/apps/continuum/working-
>directory/1/modules/crypto/src/main/java/javax/crypto/EncryptedPrivateK
eyInfo.java:430: cannot find
>symbol
>    [javac] symbol  : variable ASN1OctetString
>    [javac] location: class javax.crypto.EncryptedPrivateKeyInfo
>    [javac]                     ASN1OctetString.getInstance(),
>    [javac]                     ^
>    [javac] /home/hybld/continuum-1.0.2/apps/continuum/working-
>directory/1/modules/crypto/src/main/java/javax/crypto/EncryptedPrivateK
eyInfo.java:431: cannot find
>symbol
>    [javac] symbol  : class ASN1Implicit
>    [javac] location: class javax.crypto.EncryptedPrivateKeyInfo
>    [javac]                     new ASN1Implicit(0, ASN1Attributes) })
{
>    [javac]                         ^
>    [javac] /home/hybld/continuum-1.0.2/apps/continuum/working-
>directory/1/modules/crypto/src/main/java/javax/crypto/KeyAgreement.java
:48: cannot find symbol
>    [javac] symbol  : class Engine
>    [javac] location: class javax.crypto.KeyAgreement
>    [javac]     private static Engine engine = new Engine(SERVICE);
>    [javac]                                        ^
>    [javac] /home/hybld/continuum-1.0.2/apps/continuum/working-
>directory/1/modules/crypto/src/main/java/javax/crypto/KeyGenerator.java
:46: cannot find symbol
>    [javac] symbol  : class Engine
>    [javac] location: class javax.crypto.KeyGenerator
>    [javac]     private static Engine engine = new Engine(SERVICE);
>    [javac]                                        ^
>    [javac] /home/hybld/continuum-1.0.2/apps/continuum/working-
>directory/1/modules/crypto/src/main/java/javax/crypto/Mac.java:48:
cannot find symbol
>    [javac] symbol  : class Engine
>    [javac] location: class javax.crypto.Mac
>    [javac]     private static Engine engine = new Engine(SERVICE);
>    [javac]                                        ^
>    [javac] /home/hybld/continuum-1.0.2/apps/continuum/working-
>directory/1/modules/crypto/src/main/java/javax/crypto/SecretKeyFactory.
java:45: cannot find symbol
>    [javac] symbol  : class Engine
>    [javac] location: class javax.crypto.SecretKeyFactory
>    [javac]     private static Engine engine = new Engine(SERVICE);
>    [javac]                                        ^
>    [javac] /home/hybld/continuum-1.0.2/apps/continuum/working-
>directory/1/modules/archive/src/main/java/java/util/jar/JarVerifier.jav
a:270: cannot find symbol
>    [javac] symbol  : variable JarUtils
>    [javac] location: class java.util.jar.JarVerifier
>    [javac] 			Certificate[] signerCertChain =
JarUtils.verifySignature(
>    [javac]                                                         ^
>    [javac]
/home/hybld/continuum-1.0.2/apps/continuum/working-directory/1/modules/x
-
>net/src/main/java/javax/net/ssl/DefaultSSLContext.java:60: cannot find
symbol
>    [javac] symbol  : variable Services
>    [javac] location: class javax.net.ssl.DefaultSSLContext
>    [javac]         for (Iterator it1 =
Services.getProvidersList().iterator(); it1
>    [javac]                             ^
>    [javac]
/home/hybld/continuum-1.0.2/apps/continuum/working-directory/1/modules/x
-
>net/src/main/java/javax/net/ssl/DefaultSSLContext.java:62: package
Engine does not exist
>    [javac]             service = Engine.door.getService((Provider)
it1.next(),
>    [javac]                             ^
>    [javac]
/home/hybld/continuum-1.0.2/apps/continuum/working-directory/1/modules/x
-
>net/src/main/java/javax/net/ssl/SSLContext.java:44: cannot find symbol
>    [javac] symbol  : class Engine
>    [javac] location: class javax.net.ssl.SSLContext
>    [javac]     private static Engine engine = new Engine(SERVICE);
>    [javac]                                        ^
>    [javac]
/home/hybld/continuum-1.0.2/apps/continuum/working-directory/1/modules/x
-
>net/src/main/java/javax/net/ssl/KeyManagerFactory.java:47: cannot find
symbol
>    [javac] symbol  : class Engine
>    [javac] location: class javax.net.ssl.KeyManagerFactory
>    [javac]     private static Engine engine = new Engine(SERVICE);
>    [javac]                                        ^
>    [javac]
/home/hybld/continuum-1.0.2/apps/continuum/working-directory/1/modules/x
-
>net/src/main/java/javax/net/ssl/TrustManagerFactory.java:46: cannot
find symbol
>    [javac] symbol  : class Engine
>    [javac] location: class javax.net.ssl.TrustManagerFactory
>    [javac]     private static Engine engine = new Engine(SERVICE);
>    [javac]                                        ^
>    [javac] Note: * uses or overrides a deprecated API.
>    [javac] Note: Recompile with -Xlint:deprecation for details.
>    [javac] 58 errors
>
>BUILD FAILED
>/home/hybld/continuum-1.0.2/apps/continuum/working-directory/1/make/bui
ld.xml:36: The following
>error occurred while executing this line:
>/home/hybld/continuum-1.0.2/apps/continuum/working-directory/1/make/bui
ld-java.xml:239: Compile
>failed; see the compiler error output for details.
>
>Total time: 39 seconds
>
>***********************************************************************
*****

Mime
View raw message