harmony-alerts mailing list archives

Site index · List index
Message view « Date » · « Thread »
Top « Date » · « Thread »
From Apache Hudson Server <hud...@hudson.apache.org>
Subject Build failed in Hudson: Harmony-1.5-head-linux-x86_64 #1023
Date Mon, 13 Dec 2010 16:10:41 GMT
See <https://hudson.apache.org/hudson/job/Harmony-1.5-head-linux-x86_64/1023/changes>

Changes:

[tellison] Fix help text.  Dependencies now downloaded straight to target.

------------------------------------------
[...truncated 5517 lines...]
      [tar] Entry: harmony-5.0-hdk-1045185/build/test/security/resources/serialization/org/apache/harmony/security/tests/java/security/serialization/GeneralSecurityExceptionTest.golden.0.ser
longer than 100 characters.
      [tar] Entry: harmony-5.0-hdk-1045185/build/test/security/resources/serialization/org/apache/harmony/security/tests/java/security/serialization/GeneralSecurityExceptionTest.golden.1.ser
longer than 100 characters.
      [tar] Entry: harmony-5.0-hdk-1045185/build/test/security/resources/serialization/org/apache/harmony/security/tests/java/security/serialization/GeneralSecurityExceptionTest.golden.2.ser
longer than 100 characters.
      [tar] Entry: harmony-5.0-hdk-1045185/build/test/security/resources/serialization/org/apache/harmony/security/tests/java/security/serialization/GeneralSecurityExceptionTest.golden.3.ser
longer than 100 characters.
      [tar] Entry: harmony-5.0-hdk-1045185/build/test/security/resources/serialization/org/apache/harmony/security/tests/java/security/serialization/GeneralSecurityExceptionTest.golden.4.ser
longer than 100 characters.
      [tar] Entry: harmony-5.0-hdk-1045185/build/test/security/resources/serialization/org/apache/harmony/security/tests/java/security/serialization/GeneralSecurityExceptionTest.golden.5.ser
longer than 100 characters.
      [tar] Entry: harmony-5.0-hdk-1045185/build/test/security/resources/serialization/org/apache/harmony/security/tests/java/security/serialization/GuardedObjectTest.golden.0.ser
longer than 100 characters.
      [tar] Entry: harmony-5.0-hdk-1045185/build/test/security/resources/serialization/org/apache/harmony/security/tests/java/security/serialization/GuardedObjectTest.golden.1.ser
longer than 100 characters.
      [tar] Entry: harmony-5.0-hdk-1045185/build/test/security/resources/serialization/org/apache/harmony/security/tests/java/security/serialization/GuardedObjectTest.golden.2.ser
longer than 100 characters.
      [tar] Entry: harmony-5.0-hdk-1045185/build/test/security/resources/serialization/org/apache/harmony/security/tests/java/security/serialization/InvalidAlgorithmParameterExceptionTest.golden.0.ser
longer than 100 characters.
      [tar] Entry: harmony-5.0-hdk-1045185/build/test/security/resources/serialization/org/apache/harmony/security/tests/java/security/serialization/InvalidAlgorithmParameterExceptionTest.golden.1.ser
longer than 100 characters.
      [tar] Entry: harmony-5.0-hdk-1045185/build/test/security/resources/serialization/org/apache/harmony/security/tests/java/security/serialization/InvalidAlgorithmParameterExceptionTest.golden.2.ser
longer than 100 characters.
      [tar] Entry: harmony-5.0-hdk-1045185/build/test/security/resources/serialization/org/apache/harmony/security/tests/java/security/serialization/InvalidAlgorithmParameterExceptionTest.golden.3.ser
longer than 100 characters.
      [tar] Entry: harmony-5.0-hdk-1045185/build/test/security/resources/serialization/org/apache/harmony/security/tests/java/security/serialization/InvalidAlgorithmParameterExceptionTest.golden.4.ser
longer than 100 characters.
      [tar] Entry: harmony-5.0-hdk-1045185/build/test/security/resources/serialization/org/apache/harmony/security/tests/java/security/serialization/InvalidAlgorithmParameterExceptionTest.golden.5.ser
longer than 100 characters.
      [tar] Entry: harmony-5.0-hdk-1045185/build/test/security/resources/serialization/org/apache/harmony/security/tests/java/security/serialization/InvalidKeyExceptionTest.golden.0.ser
longer than 100 characters.
      [tar] Entry: harmony-5.0-hdk-1045185/build/test/security/resources/serialization/org/apache/harmony/security/tests/java/security/serialization/InvalidKeyExceptionTest.golden.1.ser
longer than 100 characters.
      [tar] Entry: harmony-5.0-hdk-1045185/build/test/security/resources/serialization/org/apache/harmony/security/tests/java/security/serialization/InvalidKeyExceptionTest.golden.2.ser
longer than 100 characters.
      [tar] Entry: harmony-5.0-hdk-1045185/build/test/security/resources/serialization/org/apache/harmony/security/tests/java/security/serialization/InvalidKeyExceptionTest.golden.3.ser
longer than 100 characters.
      [tar] Entry: harmony-5.0-hdk-1045185/build/test/security/resources/serialization/org/apache/harmony/security/tests/java/security/serialization/InvalidKeyExceptionTest.golden.4.ser
longer than 100 characters.
      [tar] Entry: harmony-5.0-hdk-1045185/build/test/security/resources/serialization/org/apache/harmony/security/tests/java/security/serialization/InvalidKeyExceptionTest.golden.5.ser
longer than 100 characters.
      [tar] Entry: harmony-5.0-hdk-1045185/build/test/security/resources/serialization/org/apache/harmony/security/tests/java/security/serialization/InvalidParameterExceptionTest.golden.0.ser
longer than 100 characters.
      [tar] Entry: harmony-5.0-hdk-1045185/build/test/security/resources/serialization/org/apache/harmony/security/tests/java/security/serialization/InvalidParameterExceptionTest.golden.1.ser
longer than 100 characters.
      [tar] Entry: harmony-5.0-hdk-1045185/build/test/security/resources/serialization/org/apache/harmony/security/tests/java/security/serialization/InvalidParameterExceptionTest.golden.2.ser
longer than 100 characters.
      [tar] Entry: harmony-5.0-hdk-1045185/build/test/security/resources/serialization/org/apache/harmony/security/tests/java/security/serialization/KeyExceptionTest.golden.0.ser
longer than 100 characters.
      [tar] Entry: harmony-5.0-hdk-1045185/build/test/security/resources/serialization/org/apache/harmony/security/tests/java/security/serialization/KeyExceptionTest.golden.1.ser
longer than 100 characters.
      [tar] Entry: harmony-5.0-hdk-1045185/build/test/security/resources/serialization/org/apache/harmony/security/tests/java/security/serialization/KeyExceptionTest.golden.2.ser
longer than 100 characters.
      [tar] Entry: harmony-5.0-hdk-1045185/build/test/security/resources/serialization/org/apache/harmony/security/tests/java/security/serialization/KeyExceptionTest.golden.3.ser
longer than 100 characters.
      [tar] Entry: harmony-5.0-hdk-1045185/build/test/security/resources/serialization/org/apache/harmony/security/tests/java/security/serialization/KeyExceptionTest.golden.4.ser
longer than 100 characters.
      [tar] Entry: harmony-5.0-hdk-1045185/build/test/security/resources/serialization/org/apache/harmony/security/tests/java/security/serialization/KeyExceptionTest.golden.5.ser
longer than 100 characters.
      [tar] Entry: harmony-5.0-hdk-1045185/build/test/security/resources/serialization/org/apache/harmony/security/tests/java/security/serialization/KeyManagementExceptionTest.golden.0.ser
longer than 100 characters.
      [tar] Entry: harmony-5.0-hdk-1045185/build/test/security/resources/serialization/org/apache/harmony/security/tests/java/security/serialization/KeyManagementExceptionTest.golden.1.ser
longer than 100 characters.
      [tar] Entry: harmony-5.0-hdk-1045185/build/test/security/resources/serialization/org/apache/harmony/security/tests/java/security/serialization/KeyManagementExceptionTest.golden.2.ser
longer than 100 characters.
      [tar] Entry: harmony-5.0-hdk-1045185/build/test/security/resources/serialization/org/apache/harmony/security/tests/java/security/serialization/KeyManagementExceptionTest.golden.3.ser
longer than 100 characters.
      [tar] Entry: harmony-5.0-hdk-1045185/build/test/security/resources/serialization/org/apache/harmony/security/tests/java/security/serialization/KeyManagementExceptionTest.golden.4.ser
longer than 100 characters.
      [tar] Entry: harmony-5.0-hdk-1045185/build/test/security/resources/serialization/org/apache/harmony/security/tests/java/security/serialization/KeyManagementExceptionTest.golden.5.ser
longer than 100 characters.
      [tar] Entry: harmony-5.0-hdk-1045185/build/test/security/resources/serialization/org/apache/harmony/security/tests/java/security/serialization/KeyPairTest.golden.ser
longer than 100 characters.
      [tar] Entry: harmony-5.0-hdk-1045185/build/test/security/resources/serialization/org/apache/harmony/security/tests/java/security/serialization/KeyStoreExceptionTest.golden.0.ser
longer than 100 characters.
      [tar] Entry: harmony-5.0-hdk-1045185/build/test/security/resources/serialization/org/apache/harmony/security/tests/java/security/serialization/KeyStoreExceptionTest.golden.1.ser
longer than 100 characters.
      [tar] Entry: harmony-5.0-hdk-1045185/build/test/security/resources/serialization/org/apache/harmony/security/tests/java/security/serialization/KeyStoreExceptionTest.golden.2.ser
longer than 100 characters.
      [tar] Entry: harmony-5.0-hdk-1045185/build/test/security/resources/serialization/org/apache/harmony/security/tests/java/security/serialization/KeyStoreExceptionTest.golden.3.ser
longer than 100 characters.
      [tar] Entry: harmony-5.0-hdk-1045185/build/test/security/resources/serialization/org/apache/harmony/security/tests/java/security/serialization/KeyStoreExceptionTest.golden.4.ser
longer than 100 characters.
      [tar] Entry: harmony-5.0-hdk-1045185/build/test/security/resources/serialization/org/apache/harmony/security/tests/java/security/serialization/KeyStoreExceptionTest.golden.5.ser
longer than 100 characters.
      [tar] Entry: harmony-5.0-hdk-1045185/build/test/security/resources/serialization/org/apache/harmony/security/tests/java/security/serialization/NoSuchAlgorithmExceptionTest.golden.0.ser
longer than 100 characters.
      [tar] Entry: harmony-5.0-hdk-1045185/build/test/security/resources/serialization/org/apache/harmony/security/tests/java/security/serialization/NoSuchAlgorithmExceptionTest.golden.1.ser
longer than 100 characters.
      [tar] Entry: harmony-5.0-hdk-1045185/build/test/security/resources/serialization/org/apache/harmony/security/tests/java/security/serialization/NoSuchAlgorithmExceptionTest.golden.2.ser
longer than 100 characters.
      [tar] Entry: harmony-5.0-hdk-1045185/build/test/security/resources/serialization/org/apache/harmony/security/tests/java/security/serialization/NoSuchAlgorithmExceptionTest.golden.3.ser
longer than 100 characters.
      [tar] Entry: harmony-5.0-hdk-1045185/build/test/security/resources/serialization/org/apache/harmony/security/tests/java/security/serialization/NoSuchAlgorithmExceptionTest.golden.4.ser
longer than 100 characters.
      [tar] Entry: harmony-5.0-hdk-1045185/build/test/security/resources/serialization/org/apache/harmony/security/tests/java/security/serialization/NoSuchAlgorithmExceptionTest.golden.5.ser
longer than 100 characters.
      [tar] Entry: harmony-5.0-hdk-1045185/build/test/security/resources/serialization/org/apache/harmony/security/tests/java/security/serialization/NoSuchProviderExceptionTest.golden.0.ser
longer than 100 characters.
      [tar] Entry: harmony-5.0-hdk-1045185/build/test/security/resources/serialization/org/apache/harmony/security/tests/java/security/serialization/NoSuchProviderExceptionTest.golden.1.ser
longer than 100 characters.
      [tar] Entry: harmony-5.0-hdk-1045185/build/test/security/resources/serialization/org/apache/harmony/security/tests/java/security/serialization/NoSuchProviderExceptionTest.golden.2.ser
longer than 100 characters.
      [tar] Entry: harmony-5.0-hdk-1045185/build/test/security/resources/serialization/org/apache/harmony/security/tests/java/security/serialization/PermissionCollectionTest.golden.0.ser
longer than 100 characters.
      [tar] Entry: harmony-5.0-hdk-1045185/build/test/security/resources/serialization/org/apache/harmony/security/tests/java/security/serialization/PermissionCollectionTest.golden.1.ser
longer than 100 characters.
      [tar] Entry: harmony-5.0-hdk-1045185/build/test/security/resources/serialization/org/apache/harmony/security/tests/java/security/serialization/PermissionTest.golden.0.ser
longer than 100 characters.
      [tar] Entry: harmony-5.0-hdk-1045185/build/test/security/resources/serialization/org/apache/harmony/security/tests/java/security/serialization/PermissionTest.golden.1.ser
longer than 100 characters.
      [tar] Entry: harmony-5.0-hdk-1045185/build/test/security/resources/serialization/org/apache/harmony/security/tests/java/security/serialization/PermissionsTest.golden.0.ser
longer than 100 characters.
      [tar] Entry: harmony-5.0-hdk-1045185/build/test/security/resources/serialization/org/apache/harmony/security/tests/java/security/serialization/PermissionsTest.golden.1.ser
longer than 100 characters.
      [tar] Entry: harmony-5.0-hdk-1045185/build/test/security/resources/serialization/org/apache/harmony/security/tests/java/security/serialization/PrivilegedActionExceptionTest.golden.0.ser
longer than 100 characters.
      [tar] Entry: harmony-5.0-hdk-1045185/build/test/security/resources/serialization/org/apache/harmony/security/tests/java/security/serialization/PrivilegedActionExceptionTest.golden.1.ser
longer than 100 characters.
      [tar] Entry: harmony-5.0-hdk-1045185/build/test/security/resources/serialization/org/apache/harmony/security/tests/java/security/serialization/PrivilegedActionExceptionTest.golden.2.ser
longer than 100 characters.
      [tar] Entry: harmony-5.0-hdk-1045185/build/test/security/resources/serialization/org/apache/harmony/security/tests/java/security/serialization/ProviderExceptionTest.golden.0.ser
longer than 100 characters.
      [tar] Entry: harmony-5.0-hdk-1045185/build/test/security/resources/serialization/org/apache/harmony/security/tests/java/security/serialization/ProviderExceptionTest.golden.1.ser
longer than 100 characters.
      [tar] Entry: harmony-5.0-hdk-1045185/build/test/security/resources/serialization/org/apache/harmony/security/tests/java/security/serialization/ProviderExceptionTest.golden.2.ser
longer than 100 characters.
      [tar] Entry: harmony-5.0-hdk-1045185/build/test/security/resources/serialization/org/apache/harmony/security/tests/java/security/serialization/ProviderExceptionTest.golden.3.ser
longer than 100 characters.
      [tar] Entry: harmony-5.0-hdk-1045185/build/test/security/resources/serialization/org/apache/harmony/security/tests/java/security/serialization/ProviderExceptionTest.golden.4.ser
longer than 100 characters.
      [tar] Entry: harmony-5.0-hdk-1045185/build/test/security/resources/serialization/org/apache/harmony/security/tests/java/security/serialization/ProviderExceptionTest.golden.5.ser
longer than 100 characters.
      [tar] Entry: harmony-5.0-hdk-1045185/build/test/security/resources/serialization/org/apache/harmony/security/tests/java/security/serialization/SecurityPermissionTest.golden.0.ser
longer than 100 characters.
      [tar] Entry: harmony-5.0-hdk-1045185/build/test/security/resources/serialization/org/apache/harmony/security/tests/java/security/serialization/SecurityPermissionTest.golden.1.ser
longer than 100 characters.
      [tar] Entry: harmony-5.0-hdk-1045185/build/test/security/resources/serialization/org/apache/harmony/security/tests/java/security/serialization/SignatureExceptionTest.golden.0.ser
longer than 100 characters.
      [tar] Entry: harmony-5.0-hdk-1045185/build/test/security/resources/serialization/org/apache/harmony/security/tests/java/security/serialization/SignatureExceptionTest.golden.1.ser
longer than 100 characters.
      [tar] Entry: harmony-5.0-hdk-1045185/build/test/security/resources/serialization/org/apache/harmony/security/tests/java/security/serialization/SignatureExceptionTest.golden.2.ser
longer than 100 characters.
      [tar] Entry: harmony-5.0-hdk-1045185/build/test/security/resources/serialization/org/apache/harmony/security/tests/java/security/serialization/SignatureExceptionTest.golden.3.ser
longer than 100 characters.
      [tar] Entry: harmony-5.0-hdk-1045185/build/test/security/resources/serialization/org/apache/harmony/security/tests/java/security/serialization/SignatureExceptionTest.golden.4.ser
longer than 100 characters.
      [tar] Entry: harmony-5.0-hdk-1045185/build/test/security/resources/serialization/org/apache/harmony/security/tests/java/security/serialization/SignatureExceptionTest.golden.5.ser
longer than 100 characters.
      [tar] Entry: harmony-5.0-hdk-1045185/build/test/security/resources/serialization/org/apache/harmony/security/tests/java/security/serialization/SignedObjectTest.golden.0.ser
longer than 100 characters.
      [tar] Entry: harmony-5.0-hdk-1045185/build/test/security/resources/serialization/org/apache/harmony/security/tests/java/security/serialization/TimestampTest.golden.0.ser
longer than 100 characters.
      [tar] Entry: harmony-5.0-hdk-1045185/build/test/security/resources/serialization/org/apache/harmony/security/tests/java/security/serialization/UnrecoverableEntryExceptionTest.golden.0.ser
longer than 100 characters.
      [tar] Entry: harmony-5.0-hdk-1045185/build/test/security/resources/serialization/org/apache/harmony/security/tests/java/security/serialization/UnrecoverableEntryExceptionTest.golden.1.ser
longer than 100 characters.
      [tar] Entry: harmony-5.0-hdk-1045185/build/test/security/resources/serialization/org/apache/harmony/security/tests/java/security/serialization/UnrecoverableEntryExceptionTest.golden.2.ser
longer than 100 characters.
      [tar] Entry: harmony-5.0-hdk-1045185/build/test/security/resources/serialization/org/apache/harmony/security/tests/java/security/serialization/UnrecoverableKeyExceptionTest.golden.0.ser
longer than 100 characters.
      [tar] Entry: harmony-5.0-hdk-1045185/build/test/security/resources/serialization/org/apache/harmony/security/tests/java/security/serialization/UnrecoverableKeyExceptionTest.golden.1.ser
longer than 100 characters.
      [tar] Entry: harmony-5.0-hdk-1045185/build/test/security/resources/serialization/org/apache/harmony/security/tests/java/security/serialization/UnrecoverableKeyExceptionTest.golden.2.ser
longer than 100 characters.
      [tar] Entry: harmony-5.0-hdk-1045185/build/test/security/resources/serialization/org/apache/harmony/security/tests/java/security/serialization/UnresolvedPermissionCollectionTest.golden.0.ser
longer than 100 characters.
      [tar] Entry: harmony-5.0-hdk-1045185/build/test/security/resources/serialization/org/apache/harmony/security/tests/java/security/serialization/UnresolvedPermissionCollectionTest.golden.1.ser
longer than 100 characters.
      [tar] Entry: harmony-5.0-hdk-1045185/build/test/security/resources/serialization/org/apache/harmony/security/tests/java/security/serialization/UnresolvedPermissionCollectionTest.golden.2.ser
longer than 100 characters.
      [tar] Entry: harmony-5.0-hdk-1045185/build/test/security/resources/serialization/org/apache/harmony/security/tests/java/security/serialization/UnresolvedPermissionTest.golden.0.ser
longer than 100 characters.
      [tar] Entry: harmony-5.0-hdk-1045185/build/test/security/resources/serialization/org/apache/harmony/security/tests/java/security/serialization/UnresolvedPermissionTest.golden.1.ser
longer than 100 characters.
      [tar] Entry: harmony-5.0-hdk-1045185/build/test/security/resources/serialization/org/apache/harmony/security/tests/java/security/serialization/UnresolvedPermissionTest.golden.ser
longer than 100 characters.
      [tar] Entry: harmony-5.0-hdk-1045185/build/test/security/resources/serialization/org/apache/harmony/security/tests/java/security/spec/serialization/InvalidKeySpecExceptionTest.golden.0.ser
longer than 100 characters.
      [tar] Entry: harmony-5.0-hdk-1045185/build/test/security/resources/serialization/org/apache/harmony/security/tests/java/security/spec/serialization/InvalidKeySpecExceptionTest.golden.1.ser
longer than 100 characters.
      [tar] Entry: harmony-5.0-hdk-1045185/build/test/security/resources/serialization/org/apache/harmony/security/tests/java/security/spec/serialization/InvalidKeySpecExceptionTest.golden.2.ser
longer than 100 characters.
      [tar] Entry: harmony-5.0-hdk-1045185/build/test/security/resources/serialization/org/apache/harmony/security/tests/java/security/spec/serialization/InvalidKeySpecExceptionTest.golden.3.ser
longer than 100 characters.
      [tar] Entry: harmony-5.0-hdk-1045185/build/test/security/resources/serialization/org/apache/harmony/security/tests/java/security/spec/serialization/InvalidKeySpecExceptionTest.golden.4.ser
longer than 100 characters.
      [tar] Entry: harmony-5.0-hdk-1045185/build/test/security/resources/serialization/org/apache/harmony/security/tests/java/security/spec/serialization/InvalidKeySpecExceptionTest.golden.5.ser
longer than 100 characters.
      [tar] Entry: harmony-5.0-hdk-1045185/build/test/security/resources/serialization/org/apache/harmony/security/tests/java/security/spec/serialization/InvalidParameterSpecExceptionTest.golden.0.ser
longer than 100 characters.
      [tar] Entry: harmony-5.0-hdk-1045185/build/test/security/resources/serialization/org/apache/harmony/security/tests/java/security/spec/serialization/InvalidParameterSpecExceptionTest.golden.1.ser
longer than 100 characters.
      [tar] Entry: harmony-5.0-hdk-1045185/build/test/security/resources/serialization/org/apache/harmony/security/tests/java/security/spec/serialization/InvalidParameterSpecExceptionTest.golden.2.ser
longer than 100 characters.
      [tar] Entry: harmony-5.0-hdk-1045185/build/test/security/resources/serialization/org/apache/harmony/security/tests/javax/security/cert/serialization/CertificateEncodingExceptionTest.golden.0.ser
longer than 100 characters.
      [tar] Entry: harmony-5.0-hdk-1045185/build/test/security/resources/serialization/org/apache/harmony/security/tests/javax/security/cert/serialization/CertificateEncodingExceptionTest.golden.1.ser
longer than 100 characters.
      [tar] Entry: harmony-5.0-hdk-1045185/build/test/security/resources/serialization/org/apache/harmony/security/tests/javax/security/cert/serialization/CertificateEncodingExceptionTest.golden.2.ser
longer than 100 characters.
      [tar] Entry: harmony-5.0-hdk-1045185/build/test/security/resources/serialization/org/apache/harmony/security/tests/javax/security/cert/serialization/CertificateEncodingExceptionTest.golden.3.ser
longer than 100 characters.
      [tar] Entry: harmony-5.0-hdk-1045185/build/test/security/resources/serialization/org/apache/harmony/security/tests/javax/security/cert/serialization/CertificateExceptionTest.golden.0.ser
longer than 100 characters.
      [tar] Entry: harmony-5.0-hdk-1045185/build/test/security/resources/serialization/org/apache/harmony/security/tests/javax/security/cert/serialization/CertificateExceptionTest.golden.1.ser
longer than 100 characters.
      [tar] Entry: harmony-5.0-hdk-1045185/build/test/security/resources/serialization/org/apache/harmony/security/tests/javax/security/cert/serialization/CertificateExceptionTest.golden.2.ser
longer than 100 characters.
      [tar] Entry: harmony-5.0-hdk-1045185/build/test/security/resources/serialization/org/apache/harmony/security/tests/javax/security/cert/serialization/CertificateExceptionTest.golden.3.ser
longer than 100 characters.
      [tar] Entry: harmony-5.0-hdk-1045185/build/test/security/resources/serialization/org/apache/harmony/security/tests/javax/security/cert/serialization/CertificateExpiredExceptionTest.golden.0.ser
longer than 100 characters.
      [tar] Entry: harmony-5.0-hdk-1045185/build/test/security/resources/serialization/org/apache/harmony/security/tests/javax/security/cert/serialization/CertificateExpiredExceptionTest.golden.1.ser
longer than 100 characters.
      [tar] Entry: harmony-5.0-hdk-1045185/build/test/security/resources/serialization/org/apache/harmony/security/tests/javax/security/cert/serialization/CertificateExpiredExceptionTest.golden.2.ser
longer than 100 characters.
      [tar] Entry: harmony-5.0-hdk-1045185/build/test/security/resources/serialization/org/apache/harmony/security/tests/javax/security/cert/serialization/CertificateNotYetValidExceptionTest.golden.0.ser
longer than 100 characters.
      [tar] Entry: harmony-5.0-hdk-1045185/build/test/security/resources/serialization/org/apache/harmony/security/tests/javax/security/cert/serialization/CertificateNotYetValidExceptionTest.golden.1.ser
longer than 100 characters.
      [tar] Entry: harmony-5.0-hdk-1045185/build/test/security/resources/serialization/org/apache/harmony/security/tests/javax/security/cert/serialization/CertificateNotYetValidExceptionTest.golden.2.ser
longer than 100 characters.
      [tar] Entry: harmony-5.0-hdk-1045185/build/test/security/resources/serialization/org/apache/harmony/security/tests/javax/security/cert/serialization/CertificateParsingExceptionTest.golden.0.ser
longer than 100 characters.
      [tar] Entry: harmony-5.0-hdk-1045185/build/test/security/resources/serialization/org/apache/harmony/security/tests/javax/security/cert/serialization/CertificateParsingExceptionTest.golden.1.ser
longer than 100 characters.
      [tar] Entry: harmony-5.0-hdk-1045185/build/test/security/resources/serialization/org/apache/harmony/security/tests/javax/security/cert/serialization/CertificateParsingExceptionTest.golden.2.ser
longer than 100 characters.
      [tar] Entry: harmony-5.0-hdk-1045185/build/test/security/resources/serialization/org/apache/harmony/security/tests/javax/security/cert/serialization/CertificateParsingExceptionTest.golden.3.ser
longer than 100 characters.
      [tar] Entry: harmony-5.0-hdk-1045185/build/test/security/resources/serialization/org/apache/harmony/security/tests/provider/crypto/serialization/SHA1PRNG_SecureRandomTest.golden.0.ser
longer than 100 characters.
      [tar] Entry: harmony-5.0-hdk-1045185/build/test/security/resources/serialization/org/apache/harmony/security/tests/provider/crypto/serialization/SHA1PRNG_SecureRandomTest.golden.1.ser
longer than 100 characters.
      [tar] Entry: harmony-5.0-hdk-1045185/build/test/security/resources/serialization/org/apache/harmony/security/tests/provider/crypto/serialization/SHA1PRNG_SecureRandomTest.golden.2.ser
longer than 100 characters.
      [tar] Entry: harmony-5.0-hdk-1045185/build/test/security/resources/serialization/org/apache/harmony/security/tests/provider/crypto/serialization/SHA1PRNG_SecureRandomTest.golden.3.ser
longer than 100 characters.
      [tar] Entry: harmony-5.0-hdk-1045185/build/test/security/resources/serialization/org/apache/harmony/security/tests/provider/crypto/serialization/SHA1PRNG_SecureRandomTest.golden.4.ser
longer than 100 characters.
      [tar] Entry: harmony-5.0-hdk-1045185/build/test/sound/resources/org/apache/harmony/sound/tests/javax/sound/sampled/soundProvider.jar
longer than 100 characters.
      [tar] Entry: harmony-5.0-hdk-1045185/build/test/sql/resources/org/apache/harmony/sql/internal/rowset/XmlFile_InvalidHeader.xml
longer than 100 characters.
      [tar] Entry: harmony-5.0-hdk-1045185/build/test/sql/resources/org/apache/harmony/sql/internal/rowset/XmlReaderTest_HY.xml
longer than 100 characters.
      [tar] Entry: harmony-5.0-hdk-1045185/build/test/sql/resources/org/apache/harmony/sql/internal/rowset/XmlReaderTest_RI.xml
longer than 100 characters.
      [tar] Entry: harmony-5.0-hdk-1045185/build/test/sql/resources/serialization/org/apache/harmony/sql/tests/java/sql/BatchUpdateExceptionTest.golden.ser
longer than 100 characters.
      [tar] Entry: harmony-5.0-hdk-1045185/build/test/sql/resources/serialization/org/apache/harmony/sql/tests/java/sql/DataTruncationTest.golden.ser
longer than 100 characters.
      [tar] Entry: harmony-5.0-hdk-1045185/build/test/sql/resources/serialization/org/apache/harmony/sql/tests/java/sql/SQLExceptionTest.golden.ser
longer than 100 characters.
      [tar] Entry: harmony-5.0-hdk-1045185/build/test/sql/resources/serialization/org/apache/harmony/sql/tests/java/sql/SQLWarningTest.golden.ser
longer than 100 characters.
      [tar] Entry: harmony-5.0-hdk-1045185/build/test/sql/resources/serialization/org/apache/harmony/sql/tests/java/sql/TimestampTest.golden.ser
longer than 100 characters.
      [tar] Entry: harmony-5.0-hdk-1045185/build/test/sql/resources/serialization/org/apache/harmony/sql/tests/javax/sql/ConnectionEventTest.golden.ser
longer than 100 characters.
      [tar] Entry: harmony-5.0-hdk-1045185/build/test/sql/resources/serialization/org/apache/harmony/sql/tests/javax/sql/rowset/RowSetMetaDataImplTest.golden.ser
longer than 100 characters.
      [tar] Entry: harmony-5.0-hdk-1045185/build/test/sql/resources/serialization/org/apache/harmony/sql/tests/javax/sql/rowset/serial/SerialExceptionTest.golden.ser
longer than 100 characters.
      [tar] Entry: harmony-5.0-hdk-1045185/build/test/x-net/resources/serialization/org/apache/harmony/xnet/tests/javax/net/ssl/serialization/HandshakeCompletedEventTest.golden.0.ser
longer than 100 characters.
      [tar] Entry: harmony-5.0-hdk-1045185/build/test/x-net/resources/serialization/org/apache/harmony/xnet/tests/javax/net/ssl/serialization/SSLExceptionTest.golden.0.ser
longer than 100 characters.
      [tar] Entry: harmony-5.0-hdk-1045185/build/test/x-net/resources/serialization/org/apache/harmony/xnet/tests/javax/net/ssl/serialization/SSLExceptionTest.golden.1.ser
longer than 100 characters.
      [tar] Entry: harmony-5.0-hdk-1045185/build/test/x-net/resources/serialization/org/apache/harmony/xnet/tests/javax/net/ssl/serialization/SSLExceptionTest.golden.2.ser
longer than 100 characters.
      [tar] Entry: harmony-5.0-hdk-1045185/build/test/x-net/resources/serialization/org/apache/harmony/xnet/tests/javax/net/ssl/serialization/SSLExceptionTest.golden.3.ser
longer than 100 characters.
      [tar] Entry: harmony-5.0-hdk-1045185/build/test/x-net/resources/serialization/org/apache/harmony/xnet/tests/javax/net/ssl/serialization/SSLExceptionTest.golden.4.ser
longer than 100 characters.
      [tar] Entry: harmony-5.0-hdk-1045185/build/test/x-net/resources/serialization/org/apache/harmony/xnet/tests/javax/net/ssl/serialization/SSLHandshakeExceptionTest.golden.0.ser
longer than 100 characters.
      [tar] Entry: harmony-5.0-hdk-1045185/build/test/x-net/resources/serialization/org/apache/harmony/xnet/tests/javax/net/ssl/serialization/SSLHandshakeExceptionTest.golden.1.ser
longer than 100 characters.
      [tar] Entry: harmony-5.0-hdk-1045185/build/test/x-net/resources/serialization/org/apache/harmony/xnet/tests/javax/net/ssl/serialization/SSLHandshakeExceptionTest.golden.2.ser
longer than 100 characters.
      [tar] Entry: harmony-5.0-hdk-1045185/build/test/x-net/resources/serialization/org/apache/harmony/xnet/tests/javax/net/ssl/serialization/SSLKeyExceptionTest.golden.0.ser
longer than 100 characters.
      [tar] Entry: harmony-5.0-hdk-1045185/build/test/x-net/resources/serialization/org/apache/harmony/xnet/tests/javax/net/ssl/serialization/SSLKeyExceptionTest.golden.1.ser
longer than 100 characters.
      [tar] Entry: harmony-5.0-hdk-1045185/build/test/x-net/resources/serialization/org/apache/harmony/xnet/tests/javax/net/ssl/serialization/SSLKeyExceptionTest.golden.2.ser
longer than 100 characters.
      [tar] Entry: harmony-5.0-hdk-1045185/build/test/x-net/resources/serialization/org/apache/harmony/xnet/tests/javax/net/ssl/serialization/SSLPeerUnverifiedExceptionTest.golden.0.ser
longer than 100 characters.
      [tar] Entry: harmony-5.0-hdk-1045185/build/test/x-net/resources/serialization/org/apache/harmony/xnet/tests/javax/net/ssl/serialization/SSLPeerUnverifiedExceptionTest.golden.1.ser
longer than 100 characters.
      [tar] Entry: harmony-5.0-hdk-1045185/build/test/x-net/resources/serialization/org/apache/harmony/xnet/tests/javax/net/ssl/serialization/SSLPeerUnverifiedExceptionTest.golden.2.ser
longer than 100 characters.
      [tar] Entry: harmony-5.0-hdk-1045185/build/test/x-net/resources/serialization/org/apache/harmony/xnet/tests/javax/net/ssl/serialization/SSLProtocolExceptionTest.golden.0.ser
longer than 100 characters.
      [tar] Entry: harmony-5.0-hdk-1045185/build/test/x-net/resources/serialization/org/apache/harmony/xnet/tests/javax/net/ssl/serialization/SSLProtocolExceptionTest.golden.1.ser
longer than 100 characters.
      [tar] Entry: harmony-5.0-hdk-1045185/build/test/x-net/resources/serialization/org/apache/harmony/xnet/tests/javax/net/ssl/serialization/SSLProtocolExceptionTest.golden.2.ser
longer than 100 characters.
      [tar] Entry: harmony-5.0-hdk-1045185/build/test/x-net/resources/serialization/org/apache/harmony/xnet/tests/javax/net/ssl/serialization/SSLSessionBindingEventTest.golden.0.ser
longer than 100 characters.

bundle-hdk-zip:

bundle-hdk:

assemble-jdk-doc:
     [copy] Copying 2 files to <https://hudson.apache.org/hudson/job/Harmony-1.5-head-linux-x86_64/ws/harmony/target/hdk/jdk>

bundle-jdk-tgz:
      [tar] Building tar: <https://hudson.apache.org/hudson/job/Harmony-1.5-head-linux-x86_64/1023/artifact/harmony/target/apache-harmony-5.0-jdk-r1045185-linux-x86_64-snapshot.tar.gz>

bundle-jdk-zip:

bundle-jdk:

assemble-jre-doc:
     [copy] Copying 2 files to <https://hudson.apache.org/hudson/job/Harmony-1.5-head-linux-x86_64/ws/harmony/target/hdk/jdk/jre>

bundle-jre-tgz:
      [tar] Building tar: <https://hudson.apache.org/hudson/job/Harmony-1.5-head-linux-x86_64/1023/artifact/harmony/target/apache-harmony-5.0-jre-r1045185-linux-x86_64-snapshot.tar.gz>

bundle-jre-zip:

bundle-jre:

snapshot:

BUILD SUCCESSFUL
Total time: 11 minutes 50 seconds
[harmony] $ /home/hudson/tools/ant/latest/bin/ant -Dbuild.module=pack200 -lib target/depends/jars/ecj_3.6.1/ecj-3.6.1.jar
test
Unable to locate tools.jar. Expected to find it in /usr/lib/jvm/java-6-openjdk/lib/tools.jar
Buildfile: <https://hudson.apache.org/hudson/job/Harmony-1.5-head-linux-x86_64/ws/harmony/build.xml>
     [copy] Copying 20 files to <https://hudson.apache.org/hudson/job/Harmony-1.5-head-linux-x86_64/ws/harmony/target/hdk/build/make>

clean-tests:

test:

-get-test-vm-output:

test-jre-vm-info:
     [echo] hy.test.vm.name = drl

-test:
     [echo] Test Work Dir: <https://hudson.apache.org/hudson/job/Harmony-1.5-head-linux-x86_64/ws/harmony/target/hdk/build/test>
     [echo] Test Target Dir: <https://hudson.apache.org/hudson/job/Harmony-1.5-head-linux-x86_64/ws/harmony/target>
     [echo] polling pack200/*.xml

-get-test-vm-output:

test-jre-vm-info:
     [echo] hy.test.vm.name = drl

test-module:
     [echo] Running pack200 Unit Test from pack200_tests.jar
     [echo] Tested jre: <https://hudson.apache.org/hudson/job/Harmony-1.5-head-linux-x86_64/ws/harmony/target/hdk/jdk/jre/bin/java>
    [mkdir] Created dir: <https://hudson.apache.org/hudson/job/Harmony-1.5-head-linux-x86_64/ws/harmony/target/test_report>
    [mkdir] Created dir: <https://hudson.apache.org/hudson/job/Harmony-1.5-head-linux-x86_64/ws/harmony/target/hdk/build/test/pack200/temp/ant>
    [mkdir] Created dir: <https://hudson.apache.org/hudson/job/Harmony-1.5-head-linux-x86_64/ws/harmony/target/hdk/build/test/pack200/temp/tmpdir>
    [mkdir] Created dir: <https://hudson.apache.org/hudson/job/Harmony-1.5-head-linux-x86_64/ws/harmony/target/hdk/build/test/pack200/temp/user>
    [junit] Running org.apache.harmony.pack200.tests.ArchiveTest
    [junit] Tests FAILED
   [delete] Deleting directory <https://hudson.apache.org/hudson/job/Harmony-1.5-head-linux-x86_64/ws/harmony/target/hdk/build/test/pack200/temp>

touch-failures-file:

touch-errors-file:

-check-for-empty:

-process-empty:

-check-crashed:

-short-report:

-full-report:
    [mkdir] Created dir: <https://hudson.apache.org/hudson/job/Harmony-1.5-head-linux-x86_64/ws/harmony/target/test_report/html>
[junitreport] Processing <https://hudson.apache.org/hudson/job/Harmony-1.5-head-linux-x86_64/ws/harmony/target/test_report/html/TESTS-TestSuites.xml>
to /tmp/null1762971445
[junitreport] Loading stylesheet jar:file:/home/hudson/tools/ant/latest/lib/ant-junit.jar!/org/apache/tools/ant/taskdefs/optional/junit/xsl/junit-frames.xsl
[junitreport] Transform time: 3152ms
[junitreport] Deleting: /tmp/null1762971445

gen-report:
     [echo] The test report is in <https://hudson.apache.org/hudson/job/Harmony-1.5-head-linux-x86_64/ws/harmony/target/test_report/html/index.html>

check-test-result:

BUILD FAILED
<https://hudson.apache.org/hudson/job/Harmony-1.5-head-linux-x86_64/ws/harmony/build.xml>:852:
The following error occurred while executing this line:
<https://hudson.apache.org/hudson/job/Harmony-1.5-head-linux-x86_64/ws/harmony/target/hdk/build/test/build.xml>:62:
There were test failures.

Total time: 18 seconds
[FINDBUGS] Skipping publisher since build result is FAILURE
Archiving artifacts
Recording test results
Recording fingerprints


Mime
View raw message