harmony-alerts mailing list archives

Site index · List index
Message view « Date » · « Thread »
Top « Date » · « Thread »
From Apache Hudson Server <hud...@hudson.apache.org>
Subject Build failed in Hudson: Harmony-1.5-head-linux-x86_64 #1021
Date Mon, 13 Dec 2010 10:54:47 GMT
See <https://hudson.apache.org/hudson/job/Harmony-1.5-head-linux-x86_64/1021/>

------------------------------------------
[...truncated 2345 lines...]
     [echo] Compiling applet tests
    [mkdir] Created dir: <https://hudson.apache.org/hudson/job/Harmony-1.5-head-linux-x86_64/ws/harmony/target/build/classlib/applet/test/api>
 [hy.javac] Compiling 1 source file to <https://hudson.apache.org/hudson/job/Harmony-1.5-head-linux-x86_64/ws/harmony/target/build/classlib/applet/test/api>
 [hy.javac] Since fork is false, ignoring memoryMaximumSize setting

-test-jar:
    [mkdir] Created dir: <https://hudson.apache.org/hudson/job/Harmony-1.5-head-linux-x86_64/ws/harmony/target/hdk/build/test/applet>
     [copy] Copying 1 file to <https://hudson.apache.org/hudson/job/Harmony-1.5-head-linux-x86_64/ws/harmony/target/hdk/build/test/applet>
[hy.jar.bin] Building jar: <https://hudson.apache.org/hudson/job/Harmony-1.5-head-linux-x86_64/ws/harmony/target/hdk/build/test/applet/applet_tests.jar>
    [mkdir] Created dir: <https://hudson.apache.org/hudson/job/Harmony-1.5-head-linux-x86_64/ws/harmony/target/hdk/build/test/applet/excludes>

-build-no-check:

-svn-info:
   [delete] Deleting: <https://hudson.apache.org/hudson/job/Harmony-1.5-head-linux-x86_64/ws/harmony/classlib/modules/archive/null418769087.xml>

-compile-java:
     [echo] Compiling archive classes

-class-patternset:

-build-jar:
[hy.jar.bin] Building jar: <https://hudson.apache.org/hudson/job/Harmony-1.5-head-linux-x86_64/ws/harmony/target/hdk/jdk/jre/lib/boot/archive.jar>
[hy.jar.src] Building jar: <https://hudson.apache.org/hudson/job/Harmony-1.5-head-linux-x86_64/ws/harmony/target/hdk/jdk/jre/lib/boot/archive-src.jar>

-compile-tests:
     [echo] Compiling archive internal tests
    [mkdir] Created dir: <https://hudson.apache.org/hudson/job/Harmony-1.5-head-linux-x86_64/ws/harmony/target/build/classlib/archive/test/internal>
 [hy.javac] Compiling 1 source file to <https://hudson.apache.org/hudson/job/Harmony-1.5-head-linux-x86_64/ws/harmony/target/build/classlib/archive/test/internal>
 [hy.javac] Since fork is false, ignoring memoryMaximumSize setting
     [echo] Compiling archive api tests
    [mkdir] Created dir: <https://hudson.apache.org/hudson/job/Harmony-1.5-head-linux-x86_64/ws/harmony/target/build/classlib/archive/test/api>
 [hy.javac] Compiling 28 source files to <https://hudson.apache.org/hudson/job/Harmony-1.5-head-linux-x86_64/ws/harmony/target/build/classlib/archive/test/api>
 [hy.javac] Since fork is false, ignoring memoryMaximumSize setting

-test-jar:
    [mkdir] Created dir: <https://hudson.apache.org/hudson/job/Harmony-1.5-head-linux-x86_64/ws/harmony/target/hdk/build/test/archive>
     [copy] Copying 1 file to <https://hudson.apache.org/hudson/job/Harmony-1.5-head-linux-x86_64/ws/harmony/target/hdk/build/test/archive>
[hy.jar.bin] Building jar: <https://hudson.apache.org/hudson/job/Harmony-1.5-head-linux-x86_64/ws/harmony/target/hdk/build/test/archive/archive_tests.jar>
[hy.jar.bin] Building jar: <https://hudson.apache.org/hudson/job/Harmony-1.5-head-linux-x86_64/ws/harmony/target/hdk/build/test/archive/archive_internal_tests.jar>
    [mkdir] Created dir: <https://hudson.apache.org/hudson/job/Harmony-1.5-head-linux-x86_64/ws/harmony/target/hdk/build/test/archive/excludes>
     [copy] Copying 9 files to <https://hudson.apache.org/hudson/job/Harmony-1.5-head-linux-x86_64/ws/harmony/target/hdk/build/test/archive/excludes>

-build-no-check:

-svn-info:
   [delete] Deleting: <https://hudson.apache.org/hudson/job/Harmony-1.5-head-linux-x86_64/ws/harmony/classlib/modules/auth/null1931289808.xml>

-compile-java:
     [echo] Compiling auth classes

-class-patternset:

-build-jar:
[hy.jar.bin] Building jar: <https://hudson.apache.org/hudson/job/Harmony-1.5-head-linux-x86_64/ws/harmony/target/hdk/jdk/jre/lib/boot/auth.jar>
[hy.jar.src] Building jar: <https://hudson.apache.org/hudson/job/Harmony-1.5-head-linux-x86_64/ws/harmony/target/hdk/jdk/jre/lib/boot/auth-src.jar>

-build-native:
     [echo] Making "" in src/main/native/auth/unix
     [exec] cc -DLINUX -DLINUX_X86_64 -DHYX86_64 -DIPv6_FUNCTION_SUPPORT -D_REENTRANT -D_FILE_OFFSET_BITS=64
-I<https://hudson.apache.org/hudson/job/Harmony-1.5-head-linux-x86_64/ws/harmony/target/hdk/include>
-I<https://hudson.apache.org/hudson/job/Harmony-1.5-head-linux-x86_64/ws/harmony/target/hdk/jdk/include>
-I. -I../shared/ -O1 -DNDEBUG -DPOINTER64 -fPIC   -Werror -MD   -c -o <https://hudson.apache.org/hudson/job/Harmony-1.5-head-linux-x86_64/ws/harmony/target/build/classlib/auth/native/auth/auth_copyright.o>
../shared/auth_copyright.c
     [exec] cc -DLINUX -DLINUX_X86_64 -DHYX86_64 -DIPv6_FUNCTION_SUPPORT -D_REENTRANT -D_FILE_OFFSET_BITS=64
-I<https://hudson.apache.org/hudson/job/Harmony-1.5-head-linux-x86_64/ws/harmony/target/hdk/include>
-I<https://hudson.apache.org/hudson/job/Harmony-1.5-head-linux-x86_64/ws/harmony/target/hdk/jdk/include>
-I. -I../shared/ -O1 -DNDEBUG -DPOINTER64 -fPIC   -Werror -MD   -c -o <https://hudson.apache.org/hudson/job/Harmony-1.5-head-linux-x86_64/ws/harmony/target/build/classlib/auth/native/auth/authnix.o>
authnix.c
     [exec] echo "HYAUTH_0.1 {" ><https://hudson.apache.org/hudson/job/Harmony-1.5-head-linux-x86_64/ws/harmony/target/build/classlib/auth/native/auth/libhyauth.exp>
     [exec] echo "  global :" >><https://hudson.apache.org/hudson/job/Harmony-1.5-head-linux-x86_64/ws/harmony/target/build/classlib/auth/native/auth/libhyauth.exp>
     [exec] sed -e's/^/    /;/#/!s/$/;/' <exports.txt >><https://hudson.apache.org/hudson/job/Harmony-1.5-head-linux-x86_64/ws/harmony/target/build/classlib/auth/native/auth/libhyauth.exp>
     [exec] echo "  local : *;" >><https://hudson.apache.org/hudson/job/Harmony-1.5-head-linux-x86_64/ws/harmony/target/build/classlib/auth/native/auth/libhyauth.exp>
     [exec] echo "};" >><https://hudson.apache.org/hudson/job/Harmony-1.5-head-linux-x86_64/ws/harmony/target/build/classlib/auth/native/auth/libhyauth.exp>
     [exec] cc -shared -Wl,-soname=libhyauth.so -Wl,--version-script,<https://hudson.apache.org/hudson/job/Harmony-1.5-head-linux-x86_64/ws/harmony/target/build/classlib/auth/native/auth/libhyauth.exp>
  -o <https://hudson.apache.org/hudson/job/Harmony-1.5-head-linux-x86_64/ws/harmony/target/hdk/jdk/jre/bin/libhyauth.so>
\
     [exec] 	<https://hudson.apache.org/hudson/job/Harmony-1.5-head-linux-x86_64/ws/harmony/target/build/classlib/auth/native/auth/auth_copyright.o>
<https://hudson.apache.org/hudson/job/Harmony-1.5-head-linux-x86_64/ws/harmony/target/build/classlib/auth/native/auth/authnix.o>
-Xlinker --start-group -L<https://hudson.apache.org/hudson/job/Harmony-1.5-head-linux-x86_64/ws/harmony/target/hdk/lib/>
-L<https://hudson.apache.org/hudson/job/Harmony-1.5-head-linux-x86_64/ws/harmony/target/hdk/jdk/jre/bin/>
<https://hudson.apache.org/hudson/job/Harmony-1.5-head-linux-x86_64/ws/harmony/target/hdk/lib/libhycommon.a>
-lhythr -lvmi -Xlinker --end-group -lc -ldl
     [exec] objcopy --only-keep-debug <https://hudson.apache.org/hudson/job/Harmony-1.5-head-linux-x86_64/ws/harmony/target/hdk/jdk/jre/bin/libhyauth.so>
<https://hudson.apache.org/hudson/job/Harmony-1.5-head-linux-x86_64/ws/harmony/target/hdk/jdk/jre/bin/libhyauth.so.dbg>
     [exec] strip --strip-debug --strip-unneeded <https://hudson.apache.org/hudson/job/Harmony-1.5-head-linux-x86_64/ws/harmony/target/hdk/jdk/jre/bin/libhyauth.so>
     [exec] ( cd <https://hudson.apache.org/hudson/job/Harmony-1.5-head-linux-x86_64/ws/harmony/target/hdk/jdk/jre/bin>
&& objcopy --add-gnu-debuglink=libhyauth.so.dbg libhyauth.so )
     [exec] mkdir -p <https://hudson.apache.org/hudson/job/Harmony-1.5-head-linux-x86_64/ws/harmony/target/hdk/jdk/lib/>
     [exec] test "<https://hudson.apache.org/hudson/job/Harmony-1.5-head-linux-x86_64/ws/harmony/target/hdk/jdk/jre/bin/libhyauth.so.dbg">
= "<https://hudson.apache.org/hudson/job/Harmony-1.5-head-linux-x86_64/ws/harmony/target/hdk/jdk/lib/libhyauth.so.dbg">
|| \
     [exec] 		mv <https://hudson.apache.org/hudson/job/Harmony-1.5-head-linux-x86_64/ws/harmony/target/hdk/jdk/jre/bin/libhyauth.so.dbg>
<https://hudson.apache.org/hudson/job/Harmony-1.5-head-linux-x86_64/ws/harmony/target/hdk/jdk/lib/libhyauth.so.dbg>

-compile-tests:
     [echo] Compiling auth api tests
    [mkdir] Created dir: <https://hudson.apache.org/hudson/job/Harmony-1.5-head-linux-x86_64/ws/harmony/target/build/classlib/auth/test/api>
 [hy.javac] Compiling 107 source files to <https://hudson.apache.org/hudson/job/Harmony-1.5-head-linux-x86_64/ws/harmony/target/build/classlib/auth/test/api>
 [hy.javac] Since fork is false, ignoring memoryMaximumSize setting

-test-jar:
    [mkdir] Created dir: <https://hudson.apache.org/hudson/job/Harmony-1.5-head-linux-x86_64/ws/harmony/target/hdk/build/test/auth>
     [copy] Copying 1 file to <https://hudson.apache.org/hudson/job/Harmony-1.5-head-linux-x86_64/ws/harmony/target/hdk/build/test/auth>
[hy.jar.bin] Building jar: <https://hudson.apache.org/hudson/job/Harmony-1.5-head-linux-x86_64/ws/harmony/target/hdk/build/test/auth/auth_tests.jar>
     [copy] Copying 81 files to <https://hudson.apache.org/hudson/job/Harmony-1.5-head-linux-x86_64/ws/harmony/target/hdk/build/test/auth/resources>
    [mkdir] Created dir: <https://hudson.apache.org/hudson/job/Harmony-1.5-head-linux-x86_64/ws/harmony/target/hdk/build/test/auth/excludes>
     [copy] Copying 8 files to <https://hudson.apache.org/hudson/job/Harmony-1.5-head-linux-x86_64/ws/harmony/target/hdk/build/test/auth/excludes>

-build-no-check:

-copy-win-resources:

-copy-resources:
    [mkdir] Created dir: <https://hudson.apache.org/hudson/job/Harmony-1.5-head-linux-x86_64/ws/harmony/target/hdk/jdk/jre/lib/cmm>
     [copy] Copying 4 files to <https://hudson.apache.org/hudson/job/Harmony-1.5-head-linux-x86_64/ws/harmony/target/hdk/jdk/jre/lib/cmm>
    [mkdir] Created dir: <https://hudson.apache.org/hudson/job/Harmony-1.5-head-linux-x86_64/ws/harmony/target/hdk/jdk/jre/lib/fonts>
     [copy] Copying 8 files to <https://hudson.apache.org/hudson/job/Harmony-1.5-head-linux-x86_64/ws/harmony/target/hdk/jdk/jre/lib/fonts>

-svn-info:
   [delete] Deleting: <https://hudson.apache.org/hudson/job/Harmony-1.5-head-linux-x86_64/ws/harmony/classlib/modules/awt/null1015412123.xml>

-compile-java:
     [echo] Compiling awt classes

-class-patternset:

-build-jar:
[hy.jar.bin] Building jar: <https://hudson.apache.org/hudson/job/Harmony-1.5-head-linux-x86_64/ws/harmony/target/hdk/jdk/jre/lib/boot/awt.jar>
[hy.jar.src] Building jar: <https://hudson.apache.org/hudson/job/Harmony-1.5-head-linux-x86_64/ws/harmony/target/hdk/jdk/jre/lib/boot/awt-src.jar>

-build-native-common:
     [echo] Making "" in src/main/native/lcmm/unix
     [exec] cc -DLINUX -DLINUX_X86_64 -DHYX86_64 -DIPv6_FUNCTION_SUPPORT -D_REENTRANT -D_FILE_OFFSET_BITS=64
-I<https://hudson.apache.org/hudson/job/Harmony-1.5-head-linux-x86_64/ws/harmony/target/hdk/include>
-I<https://hudson.apache.org/hudson/job/Harmony-1.5-head-linux-x86_64/ws/harmony/target/hdk/jdk/include>
-I. -I../shared/ -Icommon -I../shared//include  -O1 -DNDEBUG -DPOINTER64 -fPIC   -Werror -MD
  -c -o <https://hudson.apache.org/hudson/job/Harmony-1.5-head-linux-x86_64/ws/harmony/target/build/classlib/awt/native/lcmm/cmmerror.o>
../shared/cmmerror.c
     [exec] cc -DLINUX -DLINUX_X86_64 -DHYX86_64 -DIPv6_FUNCTION_SUPPORT -D_REENTRANT -D_FILE_OFFSET_BITS=64
-I<https://hudson.apache.org/hudson/job/Harmony-1.5-head-linux-x86_64/ws/harmony/target/hdk/include>
-I<https://hudson.apache.org/hudson/job/Harmony-1.5-head-linux-x86_64/ws/harmony/target/hdk/jdk/include>
-I. -I../shared/ -Icommon -I../shared//include  -O1 -DNDEBUG -DPOINTER64 -fPIC   -Werror -MD
  -c -o <https://hudson.apache.org/hudson/job/Harmony-1.5-head-linux-x86_64/ws/harmony/target/build/classlib/awt/native/lcmm/cmmio.o>
../shared/cmmio.c
     [exec] cc -DLINUX -DLINUX_X86_64 -DHYX86_64 -DIPv6_FUNCTION_SUPPORT -D_REENTRANT -D_FILE_OFFSET_BITS=64
-I<https://hudson.apache.org/hudson/job/Harmony-1.5-head-linux-x86_64/ws/harmony/target/hdk/include>
-I<https://hudson.apache.org/hudson/job/Harmony-1.5-head-linux-x86_64/ws/harmony/target/hdk/jdk/include>
-I. -I../shared/ -Icommon -I../shared//include  -O1 -DNDEBUG -DPOINTER64 -fPIC   -Werror -MD
  -c -o <https://hudson.apache.org/hudson/job/Harmony-1.5-head-linux-x86_64/ws/harmony/target/build/classlib/awt/native/lcmm/cmmxforms.o>
../shared/cmmxforms.c
     [exec] cc -DLINUX -DLINUX_X86_64 -DHYX86_64 -DIPv6_FUNCTION_SUPPORT -D_REENTRANT -D_FILE_OFFSET_BITS=64
-I<https://hudson.apache.org/hudson/job/Harmony-1.5-head-linux-x86_64/ws/harmony/target/hdk/include>
-I<https://hudson.apache.org/hudson/job/Harmony-1.5-head-linux-x86_64/ws/harmony/target/hdk/jdk/include>
-I. -I../shared/ -Icommon -I../shared//include  -O1 -DNDEBUG -DPOINTER64 -fPIC   -Werror -MD
  -c -o <https://hudson.apache.org/hudson/job/Harmony-1.5-head-linux-x86_64/ws/harmony/target/build/classlib/awt/native/lcmm/NativeCMM.o>
../shared/NativeCMM.c
     [exec] cc -DLINUX -DLINUX_X86_64 -DHYX86_64 -DIPv6_FUNCTION_SUPPORT -D_REENTRANT -D_FILE_OFFSET_BITS=64
-I<https://hudson.apache.org/hudson/job/Harmony-1.5-head-linux-x86_64/ws/harmony/target/hdk/include>
-I<https://hudson.apache.org/hudson/job/Harmony-1.5-head-linux-x86_64/ws/harmony/target/hdk/jdk/include>
-I. -I../shared/ -Icommon -I../shared//include  -O1 -DNDEBUG -DPOINTER64 -fPIC   -Werror -MD
  -c -o <https://hudson.apache.org/hudson/job/Harmony-1.5-head-linux-x86_64/ws/harmony/target/build/classlib/awt/native/lcmm/NativeImageFormat.o>
../shared/NativeImageFormat.c
     [exec] echo "HYLCMM_0.1 {" ><https://hudson.apache.org/hudson/job/Harmony-1.5-head-linux-x86_64/ws/harmony/target/build/classlib/awt/native/lcmm/liblcmm.exp>
     [exec] echo "  global :" >><https://hudson.apache.org/hudson/job/Harmony-1.5-head-linux-x86_64/ws/harmony/target/build/classlib/awt/native/lcmm/liblcmm.exp>
     [exec] sed -e's/^/    /;/#/!s/$/;/' <exports.txt >><https://hudson.apache.org/hudson/job/Harmony-1.5-head-linux-x86_64/ws/harmony/target/build/classlib/awt/native/lcmm/liblcmm.exp>
     [exec] echo "  local : *;" >><https://hudson.apache.org/hudson/job/Harmony-1.5-head-linux-x86_64/ws/harmony/target/build/classlib/awt/native/lcmm/liblcmm.exp>
     [exec] echo "};" >><https://hudson.apache.org/hudson/job/Harmony-1.5-head-linux-x86_64/ws/harmony/target/build/classlib/awt/native/lcmm/liblcmm.exp>
     [exec] cc -shared -Wl,-soname=liblcmm.so -Wl,--version-script,<https://hudson.apache.org/hudson/job/Harmony-1.5-head-linux-x86_64/ws/harmony/target/build/classlib/awt/native/lcmm/liblcmm.exp>
  -o <https://hudson.apache.org/hudson/job/Harmony-1.5-head-linux-x86_64/ws/harmony/target/hdk/jdk/jre/bin/liblcmm.so>
\
     [exec] 	<https://hudson.apache.org/hudson/job/Harmony-1.5-head-linux-x86_64/ws/harmony/target/build/classlib/awt/native/lcmm/cmmerror.o>
<https://hudson.apache.org/hudson/job/Harmony-1.5-head-linux-x86_64/ws/harmony/target/build/classlib/awt/native/lcmm/cmmio.o>
<https://hudson.apache.org/hudson/job/Harmony-1.5-head-linux-x86_64/ws/harmony/target/build/classlib/awt/native/lcmm/cmmxforms.o>
<https://hudson.apache.org/hudson/job/Harmony-1.5-head-linux-x86_64/ws/harmony/target/build/classlib/awt/native/lcmm/NativeCMM.o>
<https://hudson.apache.org/hudson/job/Harmony-1.5-head-linux-x86_64/ws/harmony/target/build/classlib/awt/native/lcmm/NativeImageFormat.o>
-Xlinker --start-group -L<https://hudson.apache.org/hudson/job/Harmony-1.5-head-linux-x86_64/ws/harmony/target/hdk/lib/>
-L<https://hudson.apache.org/hudson/job/Harmony-1.5-head-linux-x86_64/ws/harmony/target/hdk/jdk/jre/bin/>
<https://hudson.apache.org/hudson/job/Harmony-1.5-head-linux-x86_64/ws/harmony/target/hdk/lib/libhycommon.a>
-lhythr -Xlinker --end-group -lc -ldl -llcms
     [exec] objcopy --only-keep-debug <https://hudson.apache.org/hudson/job/Harmony-1.5-head-linux-x86_64/ws/harmony/target/hdk/jdk/jre/bin/liblcmm.so>
<https://hudson.apache.org/hudson/job/Harmony-1.5-head-linux-x86_64/ws/harmony/target/hdk/jdk/jre/bin/liblcmm.so.dbg>
     [exec] strip --strip-debug --strip-unneeded <https://hudson.apache.org/hudson/job/Harmony-1.5-head-linux-x86_64/ws/harmony/target/hdk/jdk/jre/bin/liblcmm.so>
     [exec] ( cd <https://hudson.apache.org/hudson/job/Harmony-1.5-head-linux-x86_64/ws/harmony/target/hdk/jdk/jre/bin>
&& objcopy --add-gnu-debuglink=liblcmm.so.dbg liblcmm.so )
     [exec] mkdir -p <https://hudson.apache.org/hudson/job/Harmony-1.5-head-linux-x86_64/ws/harmony/target/hdk/jdk/lib/>
     [exec] test "<https://hudson.apache.org/hudson/job/Harmony-1.5-head-linux-x86_64/ws/harmony/target/hdk/jdk/jre/bin/liblcmm.so.dbg">
= "<https://hudson.apache.org/hudson/job/Harmony-1.5-head-linux-x86_64/ws/harmony/target/hdk/jdk/lib/liblcmm.so.dbg">
|| \
     [exec] 		mv <https://hudson.apache.org/hudson/job/Harmony-1.5-head-linux-x86_64/ws/harmony/target/hdk/jdk/jre/bin/liblcmm.so.dbg>
<https://hudson.apache.org/hudson/job/Harmony-1.5-head-linux-x86_64/ws/harmony/target/hdk/jdk/lib/liblcmm.so.dbg>
     [echo] Making "" in src/main/native/jpegdecoder/unix
     [exec] cc -DLINUX -DLINUX_X86_64 -DHYX86_64 -DIPv6_FUNCTION_SUPPORT -D_REENTRANT -D_FILE_OFFSET_BITS=64
-I<https://hudson.apache.org/hudson/job/Harmony-1.5-head-linux-x86_64/ws/harmony/target/hdk/include>
-I<https://hudson.apache.org/hudson/job/Harmony-1.5-head-linux-x86_64/ws/harmony/target/hdk/jdk/include>
-I. -I../shared/ -Icommon -I../shared/include -O1 -DNDEBUG -DPOINTER64 -fPIC   -Werror -MD
  -c -o <https://hudson.apache.org/hudson/job/Harmony-1.5-head-linux-x86_64/ws/harmony/target/build/classlib/awt/native/jpegdecoder/JpegDecoder.o>
../shared/JpegDecoder.c
     [exec] echo "HYJPEGDECODER_0.1 {" ><https://hudson.apache.org/hudson/job/Harmony-1.5-head-linux-x86_64/ws/harmony/target/build/classlib/awt/native/jpegdecoder/libjpegdecoder.exp>
     [exec] echo "  global :" >><https://hudson.apache.org/hudson/job/Harmony-1.5-head-linux-x86_64/ws/harmony/target/build/classlib/awt/native/jpegdecoder/libjpegdecoder.exp>
     [exec] sed -e's/^/    /;/#/!s/$/;/' <exports.txt >><https://hudson.apache.org/hudson/job/Harmony-1.5-head-linux-x86_64/ws/harmony/target/build/classlib/awt/native/jpegdecoder/libjpegdecoder.exp>
     [exec] echo "  local : *;" >><https://hudson.apache.org/hudson/job/Harmony-1.5-head-linux-x86_64/ws/harmony/target/build/classlib/awt/native/jpegdecoder/libjpegdecoder.exp>
     [exec] echo "};" >><https://hudson.apache.org/hudson/job/Harmony-1.5-head-linux-x86_64/ws/harmony/target/build/classlib/awt/native/jpegdecoder/libjpegdecoder.exp>
     [exec] cc -shared -Wl,-soname=libjpegdecoder.so -Wl,--version-script,<https://hudson.apache.org/hudson/job/Harmony-1.5-head-linux-x86_64/ws/harmony/target/build/classlib/awt/native/jpegdecoder/libjpegdecoder.exp>
  -o <https://hudson.apache.org/hudson/job/Harmony-1.5-head-linux-x86_64/ws/harmony/target/hdk/jdk/jre/bin/libjpegdecoder.so>
\
     [exec] 	<https://hudson.apache.org/hudson/job/Harmony-1.5-head-linux-x86_64/ws/harmony/target/build/classlib/awt/native/jpegdecoder/JpegDecoder.o>
-Xlinker --start-group -L<https://hudson.apache.org/hudson/job/Harmony-1.5-head-linux-x86_64/ws/harmony/target/hdk/lib/>
-L<https://hudson.apache.org/hudson/job/Harmony-1.5-head-linux-x86_64/ws/harmony/target/hdk/jdk/jre/bin/>
<https://hudson.apache.org/hudson/job/Harmony-1.5-head-linux-x86_64/ws/harmony/target/hdk/lib/libhycommon.a>
-lhythr -Xlinker --end-group -lc -ldl -ljpeg
     [exec] objcopy --only-keep-debug <https://hudson.apache.org/hudson/job/Harmony-1.5-head-linux-x86_64/ws/harmony/target/hdk/jdk/jre/bin/libjpegdecoder.so>
<https://hudson.apache.org/hudson/job/Harmony-1.5-head-linux-x86_64/ws/harmony/target/hdk/jdk/jre/bin/libjpegdecoder.so.dbg>
     [exec] strip --strip-debug --strip-unneeded <https://hudson.apache.org/hudson/job/Harmony-1.5-head-linux-x86_64/ws/harmony/target/hdk/jdk/jre/bin/libjpegdecoder.so>
     [exec] ( cd <https://hudson.apache.org/hudson/job/Harmony-1.5-head-linux-x86_64/ws/harmony/target/hdk/jdk/jre/bin>
&& objcopy --add-gnu-debuglink=libjpegdecoder.so.dbg libjpegdecoder.so )
     [exec] mkdir -p <https://hudson.apache.org/hudson/job/Harmony-1.5-head-linux-x86_64/ws/harmony/target/hdk/jdk/lib/>
     [exec] test "<https://hudson.apache.org/hudson/job/Harmony-1.5-head-linux-x86_64/ws/harmony/target/hdk/jdk/jre/bin/libjpegdecoder.so.dbg">
= "<https://hudson.apache.org/hudson/job/Harmony-1.5-head-linux-x86_64/ws/harmony/target/hdk/jdk/lib/libjpegdecoder.so.dbg">
|| \
     [exec] 		mv <https://hudson.apache.org/hudson/job/Harmony-1.5-head-linux-x86_64/ws/harmony/target/hdk/jdk/jre/bin/libjpegdecoder.so.dbg>
<https://hudson.apache.org/hudson/job/Harmony-1.5-head-linux-x86_64/ws/harmony/target/hdk/jdk/lib/libjpegdecoder.so.dbg>
     [echo] Making "" in src/main/native/gl/unix
     [exec] cc -DLINUX -DLINUX_X86_64 -DHYX86_64 -DIPv6_FUNCTION_SUPPORT -D_REENTRANT -D_FILE_OFFSET_BITS=64
-I<https://hudson.apache.org/hudson/job/Harmony-1.5-head-linux-x86_64/ws/harmony/target/hdk/include>
-I<https://hudson.apache.org/hudson/job/Harmony-1.5-head-linux-x86_64/ws/harmony/target/hdk/jdk/include>
-I. -I../shared/ -Icommon -I../shared/include -I/usr/X11R6/include -I/usr/include -Iinclude
-O1 -DNDEBUG -DPOINTER64 -fPIC    -MD   -c -o <https://hudson.apache.org/hudson/job/Harmony-1.5-head-linux-x86_64/ws/harmony/target/build/classlib/awt/native/gl/blitter.o>
../shared/blitter.cpp
     [exec] In file included from ../shared/SurfaceDataStructure.h:33,
     [exec]                  from ../shared/blitter.h:25,
     [exec]                  from ../shared/blitter.cpp:27:
     [exec] include/XSurfaceInfo.h:23:36: error: X11/extensions/Xrender.h: No such file or
directory
     [exec] include/XSurfaceInfo.h:24:33: error: X11/extensions/XShm.h: No such file or directory
     [exec] include/XSurfaceInfo.h:34:22: error: X11/Xlib.h: No such file or directory
     [exec] include/XSurfaceInfo.h:35:23: error: X11/Xutil.h: No such file or directory
     [exec] include/XSurfaceInfo.h:36:21: error: X11/Xos.h: No such file or directory
     [exec] In file included from ../shared/SurfaceDataStructure.h:33,
     [exec]                  from ../shared/blitter.h:25,
     [exec]                  from ../shared/blitter.cpp:27:
     [exec] include/XSurfaceInfo.h:38: error: ‘Bool’ does not name a type
     [exec] include/XSurfaceInfo.h:39: error: ‘Bool’ does not name a type
     [exec] include/XSurfaceInfo.h:40: error: ‘Bool’ does not name a type
     [exec] include/XSurfaceInfo.h:42: error: expected initializer before ‘*’ token
     [exec] include/XSurfaceInfo.h:44: error: ‘Display’ was not declared in this scope
     [exec] include/XSurfaceInfo.h:44: error: expected primary-expression before ‘,’ token
     [exec] include/XSurfaceInfo.h:44: error: ‘XErrorEvent’ was not declared in this scope
     [exec] include/XSurfaceInfo.h:44: error: expected primary-expression before ‘)’ token
     [exec] include/XSurfaceInfo.h:44: error: initializer expression list treated as compound
expression
     [exec] In file included from ../shared/blitter.h:25,
     [exec]                  from ../shared/blitter.cpp:27:
     [exec] ../shared/SurfaceDataStructure.h:162: error: ISO C++ forbids declaration of ‘XImage’
with no type
     [exec] ../shared/SurfaceDataStructure.h:162: error: expected ‘;’ before ‘*’ token
     [exec] ../shared/SurfaceDataStructure.h:164: error: ISO C++ forbids declaration of ‘Display’
with no type
     [exec] ../shared/SurfaceDataStructure.h:164: error: expected ‘;’ before ‘*’ token
     [exec] ../shared/SurfaceDataStructure.h:165: error: ‘Drawable’ does not name a type
     [exec] ../shared/SurfaceDataStructure.h:166: error: ‘GC’ does not name a type
     [exec] ../shared/SurfaceDataStructure.h:167: error: ISO C++ forbids declaration of ‘XVisualInfo’
with no type
     [exec] ../shared/SurfaceDataStructure.h:167: error: expected ‘;’ before ‘*’ token
     [exec] ../shared/blitter.cpp: In function ‘void Java_org_apache_harmony_awt_gl_render_NativeImageBlitter_blt(JNIEnv*,
_jobject*, jint, jint, jlong, _jobject*, jint, jint, jlong, _jobject*, jint, jint, jint, jfloat,
_jobject*, jboolean)’:
     [exec] ../shared/blitter.cpp:1492: error: ‘struct _SURFACE_STRUCTURE’ has no member
named ‘ximage’
     [exec] ../shared/blitter.cpp:1493: error: ‘struct _SURFACE_STRUCTURE’ has no member
named ‘display’
     [exec] ../shared/blitter.cpp:1493: error: ‘XImageByteOrder’ was not declared in this
scope
     [exec] ../shared/blitter.cpp:1493: error: ‘LSBFirst’ was not declared in this scope
     [exec] ../shared/blitter.cpp:1494: error: ‘struct _SURFACE_STRUCTURE’ has no member
named ‘ximage’
     [exec] ../shared/blitter.cpp:1494: error: ‘struct _SURFACE_STRUCTURE’ has no member
named ‘display’
     [exec] ../shared/blitter.cpp:1494: error: ‘struct _SURFACE_STRUCTURE’ has no member
named ‘drawable’
     [exec] ../shared/blitter.cpp:1495: error: ‘ZPixmap’ was not declared in this scope
     [exec] ../shared/blitter.cpp:1495: error: ‘XGetImage’ was not declared in this scope
     [exec] ../shared/blitter.cpp:1497: error: ‘XImage’ was not declared in this scope
     [exec] ../shared/blitter.cpp:1497: error: ‘tmp’ was not declared in this scope
     [exec] ../shared/blitter.cpp:1497: error: ‘struct _SURFACE_STRUCTURE’ has no member
named ‘display’
     [exec] ../shared/blitter.cpp:1497: error: ‘struct _SURFACE_STRUCTURE’ has no member
named ‘drawable’
     [exec] ../shared/blitter.cpp:1498: error: ‘ZPixmap’ was not declared in this scope
     [exec] ../shared/blitter.cpp:1498: error: ‘XGetImage’ was not declared in this scope
     [exec] ../shared/blitter.cpp:1500: error: ‘struct _SURFACE_STRUCTURE’ has no member
named ‘ximage’
     [exec] ../shared/blitter.cpp:1500: error: ‘struct _SURFACE_STRUCTURE’ has no member
named ‘display’
     [exec] ../shared/blitter.cpp:1500: error: ‘struct _SURFACE_STRUCTURE’ has no member
named ‘visual_info’
     [exec] ../shared/blitter.cpp:1502: error: ‘XCreateImage’ was not declared in this
scope
     [exec] ../shared/blitter.cpp:1504: error: ‘XDestroyImage’ was not declared in this
scope
     [exec] ../shared/blitter.cpp:1506: error: ‘struct _SURFACE_STRUCTURE’ has no member
named ‘ximage’
     [exec] ../shared/blitter.cpp:1508: error: ‘struct _SURFACE_STRUCTURE’ has no member
named ‘display’
     [exec] ../shared/blitter.cpp:1508: error: ‘struct _SURFACE_STRUCTURE’ has no member
named ‘drawable’
     [exec] ../shared/blitter.cpp:1509: error: ‘struct _SURFACE_STRUCTURE’ has no member
named ‘ximage’
     [exec] ../shared/blitter.cpp:1509: error: ‘XGetSubImage’ was not declared in this
scope
     [exec] ../shared/blitter.cpp:1511: error: ‘struct _SURFACE_STRUCTURE’ has no member
named ‘ximage’
     [exec] ../shared/blitter.cpp:1513: error: ‘struct _SURFACE_STRUCTURE’ has no member
named ‘visual_info’
     [exec] ../shared/blitter.cpp:1514: error: ‘Visual’ was not declared in this scope
     [exec] ../shared/blitter.cpp:1514: error: expected primary-expression before ‘)’
token
     [exec] ../shared/blitter.cpp:1514: error: ‘VisualID’ was not declared in this scope
     [exec] ../shared/blitter.cpp:1515: error: ‘struct _SURFACE_STRUCTURE’ has no member
named ‘ximage’
     [exec] ../shared/blitter.cpp:1518: error: ‘TrueColor’ was not declared in this scope
     [exec] ../shared/blitter.cpp:1519: error: ‘DirectColor’ was not declared in this
scope
     [exec] ../shared/blitter.cpp:1522: error: ‘struct _SURFACE_STRUCTURE’ has no member
named ‘visual_info’
     [exec] ../shared/blitter.cpp:1522: error: ‘struct _SURFACE_STRUCTURE’ has no member
named ‘visual_info’
     [exec] ../shared/blitter.cpp:1523: error: ‘struct _SURFACE_STRUCTURE’ has no member
named ‘visual_info’
     [exec] ../shared/blitter.cpp:1529: error: ‘struct _SURFACE_STRUCTURE’ has no member
named ‘visual_info’
     [exec] ../shared/blitter.cpp:1529: error: ‘struct _SURFACE_STRUCTURE’ has no member
named ‘visual_info’
     [exec] ../shared/blitter.cpp:1530: error: ‘struct _SURFACE_STRUCTURE’ has no member
named ‘visual_info’
     [exec] ../shared/blitter.cpp:1541: error: ‘struct _SURFACE_STRUCTURE’ has no member
named ‘visual_info’
     [exec] ../shared/blitter.cpp:1541: error: ‘struct _SURFACE_STRUCTURE’ has no member
named ‘visual_info’
     [exec] ../shared/blitter.cpp:1542: error: ‘struct _SURFACE_STRUCTURE’ has no member
named ‘visual_info’
     [exec] ../shared/blitter.cpp:1548: error: ‘struct _SURFACE_STRUCTURE’ has no member
named ‘visual_info’
     [exec] ../shared/blitter.cpp:1548: error: ‘struct _SURFACE_STRUCTURE’ has no member
named ‘visual_info’
     [exec] ../shared/blitter.cpp:1549: error: ‘struct _SURFACE_STRUCTURE’ has no member
named ‘visual_info’
     [exec] ../shared/blitter.cpp:1562: error: ‘StaticGray’ was not declared in this scope
     [exec] ../shared/blitter.cpp:1563: error: ‘PseudoColor’ was not declared in this
scope
     [exec] ../shared/blitter.cpp:1564: error: ‘GrayScale’ was not declared in this scope
     [exec] ../shared/blitter.cpp:1565: error: ‘StaticColor’ was not declared in this
scope
     [exec] ../shared/blitter.cpp:1573: error: ‘struct _SURFACE_STRUCTURE’ has no member
named ‘display’
     [exec] ../shared/blitter.cpp:1573: error: ‘struct _SURFACE_STRUCTURE’ has no member
named ‘drawable’
     [exec] ../shared/blitter.cpp:1574: error: ‘ZPixmap’ was not declared in this scope
     [exec] ../shared/blitter.cpp:1574: error: ‘struct _SURFACE_STRUCTURE’ has no member
named ‘ximage’
     [exec] ../shared/blitter.cpp:1574: error: ‘XGetSubImage’ was not declared in this
scope
     [exec] ../shared/blitter.cpp:1576: error: ‘struct _SURFACE_STRUCTURE’ has no member
named ‘ximage’
     [exec] make: *** [<https://hudson.apache.org/hudson/job/Harmony-1.5-head-linux-x86_64/ws/harmony/target/build/classlib/awt/native/gl/blitter.o]>
Error 1

BUILD FAILED
<https://hudson.apache.org/hudson/job/Harmony-1.5-head-linux-x86_64/ws/harmony/build.xml>:480:
The following error occurred while executing this line:
<https://hudson.apache.org/hudson/job/Harmony-1.5-head-linux-x86_64/ws/harmony/classlib/build.xml>:204:
The following error occurred while executing this line:
<https://hudson.apache.org/hudson/job/Harmony-1.5-head-linux-x86_64/ws/harmony/target/hdk/build/ant/properties.xml>:366:
The following error occurred while executing this line:
<https://hudson.apache.org/hudson/job/Harmony-1.5-head-linux-x86_64/ws/harmony/target/hdk/build/ant/properties.xml>:378:
The following error occurred while executing this line:
<https://hudson.apache.org/hudson/job/Harmony-1.5-head-linux-x86_64/ws/harmony/classlib/modules/awt/build.xml>:245:
The following error occurred while executing this line:
<https://hudson.apache.org/hudson/job/Harmony-1.5-head-linux-x86_64/ws/harmony/target/hdk/build/ant/properties.xml>:412:
exec returned: 2

Total time: 2 minutes 8 seconds
[FINDBUGS] Skipping publisher since build result is FAILURE
Archiving artifacts
Recording test results
Recording fingerprints


Mime
View raw message