harmony-alerts mailing list archives

Site index · List index
Message view « Date » · « Thread »
Top « Date » · « Thread »
From Apache Hudson Server <hud...@hudson.apache.org>
Subject Build failed in Hudson: Harmony-1.5-head-linux-x86_64 #1014
Date Wed, 08 Dec 2010 14:49:34 GMT
See <https://hudson.apache.org/hudson/job/Harmony-1.5-head-linux-x86_64/1014/>

------------------------------------------
[...truncated 565 lines...]
-clean-java:
   [delete] Deleting: <https://hudson.apache.org/hudson/job/Harmony-1.5-head-linux-x86_64/ws/harmony/target/hdk/build/ant/patternsets/swing.txt>

-clean-test:

clean:

-class-patternset:

-clean-java:
   [delete] Deleting: <https://hudson.apache.org/hudson/job/Harmony-1.5-head-linux-x86_64/ws/harmony/target/hdk/build/ant/patternsets/text.txt>

-clean-test:

clean:

-class-patternset:

-clean-java:
   [delete] Deleting: <https://hudson.apache.org/hudson/job/Harmony-1.5-head-linux-x86_64/ws/harmony/target/hdk/build/ant/patternsets/x-net.txt>

-clean-test:

clean:

-clean-java:

clean:

-clean-java-catch-all-test:

-clean-java-catch-all:

-clean-java-layout:

-clean-check:

-clean-native:

-clean-test:

clean:

clean-vm:
     [copy] Copying 20 files to <https://hudson.apache.org/hudson/job/Harmony-1.5-head-linux-x86_64/ws/harmony/target/hdk/build/make>

clean:

clean-tests:

clean:

-init-hdk:
    [mkdir] Created dir: <https://hudson.apache.org/hudson/job/Harmony-1.5-head-linux-x86_64/ws/harmony/target/hdk/build/ant>
     [copy] Copying 5 files to <https://hudson.apache.org/hudson/job/Harmony-1.5-head-linux-x86_64/ws/harmony/target/hdk/build/ant>
     [copy] Copying 1 file to <https://hudson.apache.org/hudson/job/Harmony-1.5-head-linux-x86_64/ws/harmony/target/hdk/build/ant>
    [mkdir] Created dir: <https://hudson.apache.org/hudson/job/Harmony-1.5-head-linux-x86_64/ws/harmony/target/hdk/build/make>
     [copy] Copying 20 files to <https://hudson.apache.org/hudson/job/Harmony-1.5-head-linux-x86_64/ws/harmony/target/hdk/build/make>

-init-hdk:
     [copy] Copying 4 files to <https://hudson.apache.org/hudson/job/Harmony-1.5-head-linux-x86_64/ws/harmony/target/hdk/jdk/include>

fetch-depends-classlib:
     [copy] Copying 20 files to <https://hudson.apache.org/hudson/job/Harmony-1.5-head-linux-x86_64/ws/harmony/target/hdk/build/make>
Trying to override old definition of task chksum

-init-hdk:
     [copy] Copying 20 files to <https://hudson.apache.org/hudson/job/Harmony-1.5-head-linux-x86_64/ws/harmony/target/hdk/build/make>

fetch-depends:

-download:
     [echo] Checking <https://hudson.apache.org/hudson/job/Harmony-1.5-head-linux-x86_64/ws/harmony/target/depends/jars/junit_4.6/junit-4.6.jar>

-really-download:

-remove-file-if-bad:
     [echo] Checksum verified (true)
     [echo] Checking <https://hudson.apache.org/hudson/job/Harmony-1.5-head-linux-x86_64/ws/harmony/target/depends/jars/hamcrest-library_1.1/hamcrest-library-1.1.jar>

-really-download:

-remove-file-if-bad:
     [echo] Checksum verified (true)
     [echo] Checking <https://hudson.apache.org/hudson/job/Harmony-1.5-head-linux-x86_64/ws/harmony/target/depends/oss/findbugs-1.3.9/findbugs-1.3.9.zip>

-really-download:

-remove-file-if-bad:
     [echo] Checksum verified (true)
     [echo] Checking <https://hudson.apache.org/hudson/job/Harmony-1.5-head-linux-x86_64/ws/harmony/target/depends/jars/bcprov-jdk15-145/bcprov.jar>

-really-download:

-remove-file-if-bad:
     [echo] Checksum verified (true)
     [echo] Checking <https://hudson.apache.org/hudson/job/Harmony-1.5-head-linux-x86_64/ws/harmony/target/depends/jars/jetty/jetty-6.0.0.jar>

-really-download:

-remove-file-if-bad:
     [echo] Checksum verified (true)
     [echo] Checking <https://hudson.apache.org/hudson/job/Harmony-1.5-head-linux-x86_64/ws/harmony/target/depends/jars/jetty/jetty-util-6.0.0.jar>

-really-download:

-remove-file-if-bad:
     [echo] Checksum verified (true)
     [echo] Checking <https://hudson.apache.org/hudson/job/Harmony-1.5-head-linux-x86_64/ws/harmony/target/depends/jars/jetty/servlet-api-2.5-6.0.0.jar>

-really-download:

-remove-file-if-bad:
     [echo] Checksum verified (true)
     [echo] Checking <https://hudson.apache.org/hudson/job/Harmony-1.5-head-linux-x86_64/ws/harmony/target/depends/jars/icu4j_4.4.1.1/icu4j-4_4_1_1.jar>

-really-download:

-remove-file-if-bad:
     [echo] Checksum verified (true)
     [echo] Checking <https://hudson.apache.org/hudson/job/Harmony-1.5-head-linux-x86_64/ws/harmony/target/depends/jars/icu4j_4.4.1.1/icu4j-charsets-4_4_1_1.jar>

-really-download:

-remove-file-if-bad:
     [echo] Checksum verified (true)

-download-win:

download:
     [echo] polling accessibility/*.xml,annotation/*.xml,applet/*.xml,archive/*.xml,auth/*.xml,awt/*.xml,beans/*.xml,concurrent/*.xml,crypto/*.xml,imageio/*.xml,instrument/*.xml,jmx/*.xml,jndi/*.xml,lang-management/*.xml,logging/*.xml,luni/*.xml,luni-kernel/*.xml,math/*.xml,misc/*.xml,nio/*.xml,nio_char/*.xml,orb/*.xml,pack200/*.xml,portlib/*.xml,prefs/*.xml,print/*.xml,regex/*.xml,rmi/*.xml,security/*.xml,security-kernel/*.xml,sound/*.xml,sql/*.xml,suncompat/*.xml,swing/*.xml,text/*.xml,x-net/*.xml,xml/*.xml

fetch-depends:
     [echo] Checking <https://hudson.apache.org/hudson/job/Harmony-1.5-head-linux-x86_64/ws/harmony/target/depends/oss/zlib-1.2.5/zlib-1.2.5.tar.gz>

-really-download:

-remove-file-if-bad:
     [echo] Checksum verified (true)

-fetch-win-depends:

fetch-depends:
     [echo] Checking <https://hudson.apache.org/hudson/job/Harmony-1.5-head-linux-x86_64/ws/harmony/target/depends/dejavu-fonts/dejavu-ttf-2.18-1.zip>

-really-download:

-remove-file-if-bad:
     [echo] Checksum verified (true)

fetch-depends:

fetch-depends:
     [echo] Checking <https://hudson.apache.org/hudson/job/Harmony-1.5-head-linux-x86_64/ws/harmony/target/depends/jars/mx4j_3.0.2/mx4j.zip>

-really-download:

-remove-file-if-bad:
     [echo] Checksum verified (true)

fetch-depends:
     [echo] Checking <https://hudson.apache.org/hudson/job/Harmony-1.5-head-linux-x86_64/ws/harmony/target/depends/oss/fdlibm-5.3/fdlibm53.tar.gz>

-really-download:

-remove-file-if-bad:
     [echo] Checksum verified (true)

fetch-depends:
     [echo] Checking <https://hudson.apache.org/hudson/job/Harmony-1.5-head-linux-x86_64/ws/harmony/target/depends/jars/yoko-1.0/yoko.jar>

-really-download:

-remove-file-if-bad:
     [echo] Checksum verified (true)
     [echo] Checking <https://hudson.apache.org/hudson/job/Harmony-1.5-head-linux-x86_64/ws/harmony/target/depends/jars/yoko-1.0/yoko-core.jar>

-really-download:

-remove-file-if-bad:
     [echo] Checksum verified (true)
     [echo] Checking <https://hudson.apache.org/hudson/job/Harmony-1.5-head-linux-x86_64/ws/harmony/target/depends/jars/yoko-1.0/yoko-rmi-impl.jar>

-really-download:

-remove-file-if-bad:
     [echo] Checksum verified (true)
     [echo] Checking <https://hudson.apache.org/hudson/job/Harmony-1.5-head-linux-x86_64/ws/harmony/target/depends/jars/yoko-1.0/yoko-rmi-spec.jar>

-really-download:

-remove-file-if-bad:
     [echo] Checksum verified (true)
     [echo] Checking <https://hudson.apache.org/hudson/job/Harmony-1.5-head-linux-x86_64/ws/harmony/target/depends/jars/bcel-5.2/bcel-5.2.jar>

-really-download:

-remove-file-if-bad:
     [echo] Checksum verified (true)

fetch-depends:
     [echo] Checking <https://hudson.apache.org/hudson/job/Harmony-1.5-head-linux-x86_64/ws/harmony/target/depends/jars/asm-3.1/asm-3.1.jar>

-really-download:

-remove-file-if-bad:
     [echo] Checksum verified (true)

fetch-depends:
     [echo] Checking <https://hudson.apache.org/hudson/job/Harmony-1.5-head-linux-x86_64/ws/harmony/target/depends/jars/derby-10.3.1.4/derby.jar>

-really-download:

-remove-file-if-bad:
     [echo] Checksum verified (true)

fetch-depends:
     [echo] Checking <https://hudson.apache.org/hudson/job/Harmony-1.5-head-linux-x86_64/ws/harmony/target/depends/jars/xalan-j_2.7.0/xalan.orig.jar>

-really-download:

-remove-file-if-bad:
     [echo] Checksum verified (true)
     [echo] Checking <https://hudson.apache.org/hudson/job/Harmony-1.5-head-linux-x86_64/ws/harmony/target/depends/jars/xerces_2.10.0/xerces.zip>

-really-download:
     [echo] Fetching <https://hudson.apache.org/hudson/job/Harmony-1.5-head-linux-x86_64/ws/harmony/target/depends/jars/xerces_2.10.0/xerces.zip>
      [get] Getting: http://www.apache.org/dist/xml/xerces-j/Xerces-J-bin.2.10.0.zip
      [get] To: <https://hudson.apache.org/hudson/job/Harmony-1.5-head-linux-x86_64/ws/harmony/target/depends/jars/xerces_2.10.0/xerces.zip>
      [get] http://www.apache.org/dist/xml/xerces-j/Xerces-J-bin.2.10.0.zip permanently moved
to http://www.apache.org/dist/xerces/j/Xerces-J-bin.2.10.0.zip
      [get] Error opening connection java.io.FileNotFoundException: http://www.apache.org/dist/xerces/j/Xerces-J-bin.2.10.0.zip
      [get] Error opening connection java.io.FileNotFoundException: http://www.apache.org/dist/xerces/j/Xerces-J-bin.2.10.0.zip
      [get] Error opening connection java.io.FileNotFoundException: http://www.apache.org/dist/xerces/j/Xerces-J-bin.2.10.0.zip
      [get] Can't get http://www.apache.org/dist/xml/xerces-j/Xerces-J-bin.2.10.0.zip to <https://hudson.apache.org/hudson/job/Harmony-1.5-head-linux-x86_64/ws/harmony/target/depends/jars/xerces_2.10.0/xerces.zip>

BUILD FAILED
<https://hudson.apache.org/hudson/job/Harmony-1.5-head-linux-x86_64/ws/harmony/build.xml>:512:
The following error occurred while executing this line:
<https://hudson.apache.org/hudson/job/Harmony-1.5-head-linux-x86_64/ws/harmony/classlib/build.xml>:578:
The following error occurred while executing this line:
<https://hudson.apache.org/hudson/job/Harmony-1.5-head-linux-x86_64/ws/harmony/target/hdk/build/ant/properties.xml>:366:
The following error occurred while executing this line:
<https://hudson.apache.org/hudson/job/Harmony-1.5-head-linux-x86_64/ws/harmony/target/hdk/build/ant/properties.xml>:378:
The following error occurred while executing this line:
<https://hudson.apache.org/hudson/job/Harmony-1.5-head-linux-x86_64/ws/harmony/classlib/modules/xml/build.xml>:83:
The following error occurred while executing this line:
<https://hudson.apache.org/hudson/job/Harmony-1.5-head-linux-x86_64/ws/harmony/target/hdk/build/ant/depends.xml>:63:
The following error occurred while executing this line:
<https://hudson.apache.org/hudson/job/Harmony-1.5-head-linux-x86_64/ws/harmony/target/hdk/build/ant/depends.xml>:97:
Can't get http://www.apache.org/dist/xml/xerces-j/Xerces-J-bin.2.10.0.zip to <https://hudson.apache.org/hudson/job/Harmony-1.5-head-linux-x86_64/ws/harmony/target/depends/jars/xerces_2.10.0/xerces.zip>

Total time: 46 seconds
[FINDBUGS] Skipping publisher since build result is FAILURE
Archiving artifacts
Recording test results
Recording fingerprints


Mime
View raw message