harmony-alerts mailing list archives

Site index · List index
Message view « Date » · « Thread »
Top « Date » · « Thread »
From Apache Hudson Server <hud...@hudson.zones.apache.org>
Subject Build failed in Hudson: Harmony-1.5-head-linux-x86_64 #907
Date Tue, 27 Jul 2010 12:05:54 GMT
See <http://hudson.zones.apache.org/hudson/job/Harmony-1.5-head-linux-x86_64/907/changes>

Changes:

[tellison] Apply modified patches for 
HARMONY-6590 ([classlib][luni]A issue about CharsetEncoder.flush() in the OutputStreamWriter.close())
HARMONY-6594 ([classlib][nio_char] CharsetEncoder.flush(Bytebuffer) doesn't follow the spec
and RI's behavior)

------------------------------------------
[...truncated 5047 lines...]
      [tar] Entry: harmony-5.0-hdk-979647/build/test/auth/resources/serialization/org/apache/harmony/auth/tests/javax/security/auth/x500/serialization/
longer than 100 characters.
      [tar] Entry: harmony-5.0-hdk-979647/build/test/auth/resources/serialization/org/apache/harmony/auth/tests/javax/security/sasl/
longer than 100 characters.
      [tar] Entry: harmony-5.0-hdk-979647/build/test/auth/resources/serialization/org/apache/harmony/auth/tests/javax/security/sasl/serialization/
longer than 100 characters.
      [tar] Entry: harmony-5.0-hdk-979647/build/test/beans/resources/org/apache/harmony/beans/tests/support/beancontext/
longer than 100 characters.
      [tar] Entry: harmony-5.0-hdk-979647/build/test/beans/resources/org/apache/harmony/beans/tests/support/beancontext/mock/
longer than 100 characters.
      [tar] Entry: harmony-5.0-hdk-979647/build/test/beans/resources/serialization/org/apache/harmony/beans/tests/java/
longer than 100 characters.
      [tar] Entry: harmony-5.0-hdk-979647/build/test/beans/resources/serialization/org/apache/harmony/beans/tests/java/beans/
longer than 100 characters.
      [tar] Entry: harmony-5.0-hdk-979647/build/test/beans/resources/serialization/org/apache/harmony/beans/tests/java/beans/beancontext/
longer than 100 characters.
      [tar] Entry: harmony-5.0-hdk-979647/build/test/crypto/resources/serialization/org/apache/harmony/crypto/tests/javax/
longer than 100 characters.
      [tar] Entry: harmony-5.0-hdk-979647/build/test/crypto/resources/serialization/org/apache/harmony/crypto/tests/javax/crypto/
longer than 100 characters.
      [tar] Entry: harmony-5.0-hdk-979647/build/test/crypto/resources/serialization/org/apache/harmony/crypto/tests/javax/crypto/serialization/
longer than 100 characters.
      [tar] Entry: harmony-5.0-hdk-979647/build/test/instrument/resources/serialization/org/apache/harmony/tests/java/lang/
longer than 100 characters.
      [tar] Entry: harmony-5.0-hdk-979647/build/test/instrument/resources/serialization/org/apache/harmony/tests/java/lang/instrument/
longer than 100 characters.
      [tar] Entry: harmony-5.0-hdk-979647/build/test/jndi/resources/serialization/org/apache/harmony/jndi/tests/javax/naming/
longer than 100 characters.
      [tar] Entry: harmony-5.0-hdk-979647/build/test/jndi/resources/serialization/org/apache/harmony/jndi/tests/javax/naming/ldap/
longer than 100 characters.
      [tar] Entry: harmony-5.0-hdk-979647/build/test/logging/resources/serialization/org/apache/harmony/logging/tests/java/
longer than 100 characters.
      [tar] Entry: harmony-5.0-hdk-979647/build/test/logging/resources/serialization/org/apache/harmony/logging/tests/java/util/
longer than 100 characters.
      [tar] Entry: harmony-5.0-hdk-979647/build/test/logging/resources/serialization/org/apache/harmony/logging/tests/java/util/logging/
longer than 100 characters.
      [tar] Entry: harmony-5.0-hdk-979647/build/test/luni/resources/net.resources/HTTP/html/testres231/URLConnectionTest/
longer than 100 characters.
      [tar] Entry: harmony-5.0-hdk-979647/build/test/luni/resources/serialization/org/apache/harmony/luni/tests/java/io/
longer than 100 characters.
      [tar] Entry: harmony-5.0-hdk-979647/build/test/luni/resources/serialization/org/apache/harmony/luni/tests/java/lang/
longer than 100 characters.
      [tar] Entry: harmony-5.0-hdk-979647/build/test/luni/resources/serialization/org/apache/harmony/luni/tests/java/net/
longer than 100 characters.
      [tar] Entry: harmony-5.0-hdk-979647/build/test/luni/resources/serialization/org/apache/harmony/luni/tests/java/util/
longer than 100 characters.
      [tar] Entry: harmony-5.0-hdk-979647/build/test/nio/resources/serialization/org/apache/harmony/nio/tests/java/nio/
longer than 100 characters.
      [tar] Entry: harmony-5.0-hdk-979647/build/test/nio/resources/serialization/org/apache/harmony/nio/tests/java/nio/channels/
longer than 100 characters.
      [tar] Entry: harmony-5.0-hdk-979647/build/test/nio_char/resources/serialization/org/apache/harmony/nio_char/tests/
longer than 100 characters.
      [tar] Entry: harmony-5.0-hdk-979647/build/test/nio_char/resources/serialization/org/apache/harmony/nio_char/tests/java/
longer than 100 characters.
      [tar] Entry: harmony-5.0-hdk-979647/build/test/nio_char/resources/serialization/org/apache/harmony/nio_char/tests/java/nio/
longer than 100 characters.
      [tar] Entry: harmony-5.0-hdk-979647/build/test/nio_char/resources/serialization/org/apache/harmony/nio_char/tests/java/nio/charset/
longer than 100 characters.
      [tar] Entry: harmony-5.0-hdk-979647/build/test/prefs/resources/serialization/org/apache/harmony/prefs/tests/java/
longer than 100 characters.
      [tar] Entry: harmony-5.0-hdk-979647/build/test/prefs/resources/serialization/org/apache/harmony/prefs/tests/java/util/
longer than 100 characters.
      [tar] Entry: harmony-5.0-hdk-979647/build/test/prefs/resources/serialization/org/apache/harmony/prefs/tests/java/util/prefs/
longer than 100 characters.
      [tar] Entry: harmony-5.0-hdk-979647/build/test/regex/resources/serialization/org/apache/harmony/tests/java/util/regex/
longer than 100 characters.
      [tar] Entry: harmony-5.0-hdk-979647/build/test/security/resources/serialization/org/apache/harmony/security/tests/
longer than 100 characters.
      [tar] Entry: harmony-5.0-hdk-979647/build/test/security/resources/serialization/org/apache/harmony/security/tests/java/
longer than 100 characters.
      [tar] Entry: harmony-5.0-hdk-979647/build/test/security/resources/serialization/org/apache/harmony/security/tests/java/security/
longer than 100 characters.
      [tar] Entry: harmony-5.0-hdk-979647/build/test/security/resources/serialization/org/apache/harmony/security/tests/java/security/cert/
longer than 100 characters.
      [tar] Entry: harmony-5.0-hdk-979647/build/test/security/resources/serialization/org/apache/harmony/security/tests/java/security/cert/serialization/
longer than 100 characters.
      [tar] Entry: harmony-5.0-hdk-979647/build/test/security/resources/serialization/org/apache/harmony/security/tests/java/security/serialization/
longer than 100 characters.
      [tar] Entry: harmony-5.0-hdk-979647/build/test/security/resources/serialization/org/apache/harmony/security/tests/java/security/spec/
longer than 100 characters.
      [tar] Entry: harmony-5.0-hdk-979647/build/test/security/resources/serialization/org/apache/harmony/security/tests/java/security/spec/serialization/
longer than 100 characters.
      [tar] Entry: harmony-5.0-hdk-979647/build/test/security/resources/serialization/org/apache/harmony/security/tests/javax/
longer than 100 characters.
      [tar] Entry: harmony-5.0-hdk-979647/build/test/security/resources/serialization/org/apache/harmony/security/tests/javax/security/
longer than 100 characters.
      [tar] Entry: harmony-5.0-hdk-979647/build/test/security/resources/serialization/org/apache/harmony/security/tests/javax/security/cert/
longer than 100 characters.
      [tar] Entry: harmony-5.0-hdk-979647/build/test/security/resources/serialization/org/apache/harmony/security/tests/javax/security/cert/serialization/
longer than 100 characters.
      [tar] Entry: harmony-5.0-hdk-979647/build/test/security/resources/serialization/org/apache/harmony/security/tests/provider/
longer than 100 characters.
      [tar] Entry: harmony-5.0-hdk-979647/build/test/security/resources/serialization/org/apache/harmony/security/tests/provider/crypto/
longer than 100 characters.
      [tar] Entry: harmony-5.0-hdk-979647/build/test/security/resources/serialization/org/apache/harmony/security/tests/provider/crypto/serialization/
longer than 100 characters.
      [tar] Entry: harmony-5.0-hdk-979647/build/test/sound/resources/org/apache/harmony/sound/tests/javax/sound/sampled/
longer than 100 characters.
      [tar] Entry: harmony-5.0-hdk-979647/build/test/sql/resources/serialization/org/apache/harmony/sql/tests/java/sql/
longer than 100 characters.
      [tar] Entry: harmony-5.0-hdk-979647/build/test/sql/resources/serialization/org/apache/harmony/sql/tests/javax/sql/
longer than 100 characters.
      [tar] Entry: harmony-5.0-hdk-979647/build/test/sql/resources/serialization/org/apache/harmony/sql/tests/javax/sql/rowset/
longer than 100 characters.
      [tar] Entry: harmony-5.0-hdk-979647/build/test/sql/resources/serialization/org/apache/harmony/sql/tests/javax/sql/rowset/serial/
longer than 100 characters.
      [tar] Entry: harmony-5.0-hdk-979647/build/test/x-net/resources/serialization/org/apache/harmony/xnet/tests/javax/
longer than 100 characters.
      [tar] Entry: harmony-5.0-hdk-979647/build/test/x-net/resources/serialization/org/apache/harmony/xnet/tests/javax/net/
longer than 100 characters.
      [tar] Entry: harmony-5.0-hdk-979647/build/test/x-net/resources/serialization/org/apache/harmony/xnet/tests/javax/net/ssl/
longer than 100 characters.
      [tar] Entry: harmony-5.0-hdk-979647/build/test/x-net/resources/serialization/org/apache/harmony/xnet/tests/javax/net/ssl/serialization/
longer than 100 characters.
      [tar] Entry: harmony-5.0-hdk-979647/build/test/auth/resources/serialization/org/apache/harmony/auth/tests/javax/security/auth/callback/serialization/ChoiceCallbackTest.golden.0.ser
longer than 100 characters.
      [tar] Entry: harmony-5.0-hdk-979647/build/test/auth/resources/serialization/org/apache/harmony/auth/tests/javax/security/auth/callback/serialization/ConfirmationCallbackTest.golden.0.ser
longer than 100 characters.
      [tar] Entry: harmony-5.0-hdk-979647/build/test/auth/resources/serialization/org/apache/harmony/auth/tests/javax/security/auth/callback/serialization/LanguageCallbackTest.golden.0.ser
longer than 100 characters.
      [tar] Entry: harmony-5.0-hdk-979647/build/test/auth/resources/serialization/org/apache/harmony/auth/tests/javax/security/auth/callback/serialization/NameCallbackTest.golden.0.ser
longer than 100 characters.
      [tar] Entry: harmony-5.0-hdk-979647/build/test/auth/resources/serialization/org/apache/harmony/auth/tests/javax/security/auth/callback/serialization/NameCallbackTest.golden.1.ser
longer than 100 characters.
      [tar] Entry: harmony-5.0-hdk-979647/build/test/auth/resources/serialization/org/apache/harmony/auth/tests/javax/security/auth/callback/serialization/PasswordCallbackTest.golden.0.ser
longer than 100 characters.
      [tar] Entry: harmony-5.0-hdk-979647/build/test/auth/resources/serialization/org/apache/harmony/auth/tests/javax/security/auth/callback/serialization/PasswordCallbackTest.golden.1.ser
longer than 100 characters.
      [tar] Entry: harmony-5.0-hdk-979647/build/test/auth/resources/serialization/org/apache/harmony/auth/tests/javax/security/auth/callback/serialization/TextInputCallbackTest.golden.0.ser
longer than 100 characters.
      [tar] Entry: harmony-5.0-hdk-979647/build/test/auth/resources/serialization/org/apache/harmony/auth/tests/javax/security/auth/callback/serialization/TextInputCallbackTest.golden.1.ser
longer than 100 characters.
      [tar] Entry: harmony-5.0-hdk-979647/build/test/auth/resources/serialization/org/apache/harmony/auth/tests/javax/security/auth/callback/serialization/TextOutputCallbackTest.golden.0.ser
longer than 100 characters.
      [tar] Entry: harmony-5.0-hdk-979647/build/test/auth/resources/serialization/org/apache/harmony/auth/tests/javax/security/auth/callback/serialization/UnsupportedCallbackExceptionTest.golden.0.ser
longer than 100 characters.
      [tar] Entry: harmony-5.0-hdk-979647/build/test/auth/resources/serialization/org/apache/harmony/auth/tests/javax/security/auth/kerberos/serialization/DelegationPermissionTest.golden.0.ser
longer than 100 characters.
      [tar] Entry: harmony-5.0-hdk-979647/build/test/auth/resources/serialization/org/apache/harmony/auth/tests/javax/security/auth/kerberos/serialization/DelegationPermissionTest.golden.1.ser
longer than 100 characters.
      [tar] Entry: harmony-5.0-hdk-979647/build/test/auth/resources/serialization/org/apache/harmony/auth/tests/javax/security/auth/kerberos/serialization/KerberosKeyTest.golden.ser
longer than 100 characters.
      [tar] Entry: harmony-5.0-hdk-979647/build/test/auth/resources/serialization/org/apache/harmony/auth/tests/javax/security/auth/kerberos/serialization/KerberosPrincipalTest.golden.0.ser
longer than 100 characters.
      [tar] Entry: harmony-5.0-hdk-979647/build/test/auth/resources/serialization/org/apache/harmony/auth/tests/javax/security/auth/kerberos/serialization/KerberosPrincipalTest.golden.1.ser
longer than 100 characters.
      [tar] Entry: harmony-5.0-hdk-979647/build/test/auth/resources/serialization/org/apache/harmony/auth/tests/javax/security/auth/kerberos/serialization/KerberosTicketTest.golden.ser
longer than 100 characters.
      [tar] Entry: harmony-5.0-hdk-979647/build/test/auth/resources/serialization/org/apache/harmony/auth/tests/javax/security/auth/kerberos/serialization/KrbDelegationPermissionCollectionTest.golden.0.ser
longer than 100 characters.
      [tar] Entry: harmony-5.0-hdk-979647/build/test/auth/resources/serialization/org/apache/harmony/auth/tests/javax/security/auth/kerberos/serialization/KrbDelegationPermissionCollectionTest.golden.1.ser
longer than 100 characters.
      [tar] Entry: harmony-5.0-hdk-979647/build/test/auth/resources/serialization/org/apache/harmony/auth/tests/javax/security/auth/kerberos/serialization/KrbDelegationPermissionCollectionTest.golden.2.ser
longer than 100 characters.
      [tar] Entry: harmony-5.0-hdk-979647/build/test/auth/resources/serialization/org/apache/harmony/auth/tests/javax/security/auth/kerberos/serialization/KrbServicePermissionCollectionTest.golden.0.ser
longer than 100 characters.
      [tar] Entry: harmony-5.0-hdk-979647/build/test/auth/resources/serialization/org/apache/harmony/auth/tests/javax/security/auth/kerberos/serialization/KrbServicePermissionCollectionTest.golden.1.ser
longer than 100 characters.
      [tar] Entry: harmony-5.0-hdk-979647/build/test/auth/resources/serialization/org/apache/harmony/auth/tests/javax/security/auth/kerberos/serialization/KrbServicePermissionCollectionTest.golden.2.ser
longer than 100 characters.
      [tar] Entry: harmony-5.0-hdk-979647/build/test/auth/resources/serialization/org/apache/harmony/auth/tests/javax/security/auth/kerberos/serialization/ServicePermissionTest.golden.0.ser
longer than 100 characters.
      [tar] Entry: harmony-5.0-hdk-979647/build/test/auth/resources/serialization/org/apache/harmony/auth/tests/javax/security/auth/kerberos/serialization/ServicePermissionTest.golden.1.ser
longer than 100 characters.
      [tar] Entry: harmony-5.0-hdk-979647/build/test/auth/resources/serialization/org/apache/harmony/auth/tests/javax/security/auth/kerberos/serialization/ServicePermissionTest.golden.2.ser
longer than 100 characters.
      [tar] Entry: harmony-5.0-hdk-979647/build/test/auth/resources/serialization/org/apache/harmony/auth/tests/javax/security/auth/kerberos/serialization/ServicePermissionTest.golden.3.ser
longer than 100 characters.
      [tar] Entry: harmony-5.0-hdk-979647/build/test/auth/resources/serialization/org/apache/harmony/auth/tests/javax/security/auth/login/serialization/AccountExceptionTest.golden.0.ser
longer than 100 characters.
      [tar] Entry: harmony-5.0-hdk-979647/build/test/auth/resources/serialization/org/apache/harmony/auth/tests/javax/security/auth/login/serialization/AccountExpiredExceptionTest.golden.0.ser
longer than 100 characters.
      [tar] Entry: harmony-5.0-hdk-979647/build/test/auth/resources/serialization/org/apache/harmony/auth/tests/javax/security/auth/login/serialization/AccountLockedExceptionTest.golden.0.ser
longer than 100 characters.
      [tar] Entry: harmony-5.0-hdk-979647/build/test/auth/resources/serialization/org/apache/harmony/auth/tests/javax/security/auth/login/serialization/AccountNotFoundExceptionTest.golden.0.ser
longer than 100 characters.
      [tar] Entry: harmony-5.0-hdk-979647/build/test/auth/resources/serialization/org/apache/harmony/auth/tests/javax/security/auth/login/serialization/CredentialExceptionTest.golden.0.ser
longer than 100 characters.
      [tar] Entry: harmony-5.0-hdk-979647/build/test/auth/resources/serialization/org/apache/harmony/auth/tests/javax/security/auth/login/serialization/CredentialExpiredExceptionTest.golden.0.ser
longer than 100 characters.
      [tar] Entry: harmony-5.0-hdk-979647/build/test/auth/resources/serialization/org/apache/harmony/auth/tests/javax/security/auth/login/serialization/CredentialNotFoundExceptionTest.golden.0.ser
longer than 100 characters.
      [tar] Entry: harmony-5.0-hdk-979647/build/test/auth/resources/serialization/org/apache/harmony/auth/tests/javax/security/auth/login/serialization/FailedLoginExceptionTest.golden.0.ser
longer than 100 characters.
      [tar] Entry: harmony-5.0-hdk-979647/build/test/auth/resources/serialization/org/apache/harmony/auth/tests/javax/security/auth/login/serialization/LoginExceptionTest.golden.0.ser
longer than 100 characters.
      [tar] Entry: harmony-5.0-hdk-979647/build/test/auth/resources/serialization/org/apache/harmony/auth/tests/javax/security/auth/serialization/AuthPermissionTest.golden.0.ser
longer than 100 characters.
      [tar] Entry: harmony-5.0-hdk-979647/build/test/auth/resources/serialization/org/apache/harmony/auth/tests/javax/security/auth/serialization/DestroyFailedExceptionTest.golden.0.ser
longer than 100 characters.
      [tar] Entry: harmony-5.0-hdk-979647/build/test/auth/resources/serialization/org/apache/harmony/auth/tests/javax/security/auth/serialization/PrivateCredentialPermissionTest.golden.0.ser
longer than 100 characters.
      [tar] Entry: harmony-5.0-hdk-979647/build/test/auth/resources/serialization/org/apache/harmony/auth/tests/javax/security/auth/serialization/RefreshFailedExceptionTest.golden.0.ser
longer than 100 characters.
      [tar] Entry: harmony-5.0-hdk-979647/build/test/auth/resources/serialization/org/apache/harmony/auth/tests/javax/security/auth/serialization/SubjectTest.golden.0.ser
longer than 100 characters.
      [tar] Entry: harmony-5.0-hdk-979647/build/test/auth/resources/serialization/org/apache/harmony/auth/tests/javax/security/auth/serialization/SubjectTest.golden.1.ser
longer than 100 characters.
      [tar] Entry: harmony-5.0-hdk-979647/build/test/auth/resources/serialization/org/apache/harmony/auth/tests/javax/security/auth/serialization/SubjectTest.golden.2.ser
longer than 100 characters.
      [tar] Entry: harmony-5.0-hdk-979647/build/test/auth/resources/serialization/org/apache/harmony/auth/tests/javax/security/auth/serialization/SubjectTest.golden.3.ser
longer than 100 characters.
      [tar] Entry: harmony-5.0-hdk-979647/build/test/auth/resources/serialization/org/apache/harmony/auth/tests/javax/security/auth/x500/serialization/X500PrincipalTest.golden.0.ser
longer than 100 characters.
      [tar] Entry: harmony-5.0-hdk-979647/build/test/auth/resources/serialization/org/apache/harmony/auth/tests/javax/security/auth/x500/serialization/X500PrincipalTest.golden.1.ser
longer than 100 characters.
      [tar] Entry: harmony-5.0-hdk-979647/build/test/auth/resources/serialization/org/apache/harmony/auth/tests/javax/security/auth/x500/serialization/X500PrincipalTest.golden.2.ser
longer than 100 characters.
      [tar] Entry: harmony-5.0-hdk-979647/build/test/auth/resources/serialization/org/apache/harmony/auth/tests/javax/security/sasl/serialization/AuthenticationExceptionTest.golden.0.ser
longer than 100 characters.
      [tar] Entry: harmony-5.0-hdk-979647/build/test/auth/resources/serialization/org/apache/harmony/auth/tests/javax/security/sasl/serialization/AuthenticationExceptionTest.golden.1.ser
longer than 100 characters.
      [tar] Entry: harmony-5.0-hdk-979647/build/test/auth/resources/serialization/org/apache/harmony/auth/tests/javax/security/sasl/serialization/AuthenticationExceptionTest.golden.2.ser
longer than 100 characters.
      [tar] Entry: harmony-5.0-hdk-979647/build/test/auth/resources/serialization/org/apache/harmony/auth/tests/javax/security/sasl/serialization/AuthenticationExceptionTest.golden.3.ser
longer than 100 characters.
      [tar] Entry: harmony-5.0-hdk-979647/build/test/auth/resources/serialization/org/apache/harmony/auth/tests/javax/security/sasl/serialization/AuthenticationExceptionTest.golden.4.ser
longer than 100 characters.
      [tar] Entry: harmony-5.0-hdk-979647/build/test/auth/resources/serialization/org/apache/harmony/auth/tests/javax/security/sasl/serialization/AuthenticationExceptionTest.golden.5.ser
longer than 100 characters.
      [tar] Entry: harmony-5.0-hdk-979647/build/test/auth/resources/serialization/org/apache/harmony/auth/tests/javax/security/sasl/serialization/AuthenticationExceptionTest.golden.6.ser
longer than 100 characters.
      [tar] Entry: harmony-5.0-hdk-979647/build/test/auth/resources/serialization/org/apache/harmony/auth/tests/javax/security/sasl/serialization/AuthorizeCallbackTest.golden.0.ser
longer than 100 characters.
      [tar] Entry: harmony-5.0-hdk-979647/build/test/auth/resources/serialization/org/apache/harmony/auth/tests/javax/security/sasl/serialization/AuthorizeCallbackTest.golden.1.ser
longer than 100 characters.
      [tar] Entry: harmony-5.0-hdk-979647/build/test/auth/resources/serialization/org/apache/harmony/auth/tests/javax/security/sasl/serialization/AuthorizeCallbackTest.golden.2.ser
longer than 100 characters.
      [tar] Entry: harmony-5.0-hdk-979647/build/test/auth/resources/serialization/org/apache/harmony/auth/tests/javax/security/sasl/serialization/AuthorizeCallbackTest.golden.3.ser
longer than 100 characters.
      [tar] Entry: harmony-5.0-hdk-979647/build/test/auth/resources/serialization/org/apache/harmony/auth/tests/javax/security/sasl/serialization/RealmCallbackTest.golden.0.ser
longer than 100 characters.
      [tar] Entry: harmony-5.0-hdk-979647/build/test/auth/resources/serialization/org/apache/harmony/auth/tests/javax/security/sasl/serialization/RealmCallbackTest.golden.1.ser
longer than 100 characters.
      [tar] Entry: harmony-5.0-hdk-979647/build/test/auth/resources/serialization/org/apache/harmony/auth/tests/javax/security/sasl/serialization/RealmCallbackTest.golden.2.ser
longer than 100 characters.
      [tar] Entry: harmony-5.0-hdk-979647/build/test/auth/resources/serialization/org/apache/harmony/auth/tests/javax/security/sasl/serialization/RealmChoiceCallbackTest.golden.0.ser
longer than 100 characters.
      [tar] Entry: harmony-5.0-hdk-979647/build/test/auth/resources/serialization/org/apache/harmony/auth/tests/javax/security/sasl/serialization/RealmChoiceCallbackTest.golden.1.ser
longer than 100 characters.
      [tar] Entry: harmony-5.0-hdk-979647/build/test/auth/resources/serialization/org/apache/harmony/auth/tests/javax/security/sasl/serialization/RealmChoiceCallbackTest.golden.2.ser
longer than 100 characters.
      [tar] Entry: harmony-5.0-hdk-979647/build/test/auth/resources/serialization/org/apache/harmony/auth/tests/javax/security/sasl/serialization/RealmChoiceCallbackTest.golden.3.ser
longer than 100 characters.
      [tar] Entry: harmony-5.0-hdk-979647/build/test/auth/resources/serialization/org/apache/harmony/auth/tests/javax/security/sasl/serialization/SaslExceptionTest.golden.0.ser
longer than 100 characters.
      [tar] Entry: harmony-5.0-hdk-979647/build/test/auth/resources/serialization/org/apache/harmony/auth/tests/javax/security/sasl/serialization/SaslExceptionTest.golden.1.ser
longer than 100 characters.
      [tar] Entry: harmony-5.0-hdk-979647/build/test/auth/resources/serialization/org/apache/harmony/auth/tests/javax/security/sasl/serialization/SaslExceptionTest.golden.2.ser
longer than 100 characters.
      [tar] Entry: harmony-5.0-hdk-979647/build/test/auth/resources/serialization/org/apache/harmony/auth/tests/javax/security/sasl/serialization/SaslExceptionTest.golden.3.ser
longer than 100 characters.
      [tar] Entry: harmony-5.0-hdk-979647/build/test/auth/resources/serialization/org/apache/harmony/auth/tests/javax/security/sasl/serialization/SaslExceptionTest.golden.4.ser
longer than 100 characters.
      [tar] Entry: harmony-5.0-hdk-979647/build/test/auth/resources/serialization/org/apache/harmony/auth/tests/javax/security/sasl/serialization/SaslExceptionTest.golden.5.ser
longer than 100 characters.
      [tar] Entry: harmony-5.0-hdk-979647/build/test/auth/resources/serialization/org/apache/harmony/auth/tests/javax/security/sasl/serialization/SaslExceptionTest.golden.6.ser
longer than 100 characters.
      [tar] Entry: harmony-5.0-hdk-979647/build/test/awt/resources/serialization/java/awt/geom/java.awt.geom.AffineTransform[[1.0,
0.0, 0.0], [0.0, 1.0, 0.0]].ser longer than 100 characters.
      [tar] Entry: harmony-5.0-hdk-979647/build/test/awt/resources/serialization/java/awt/geom/java.awt.geom.AffineTransform[[1.0,
3.0, 5.0], [2.0, 4.0, 6.0]].ser longer than 100 characters.
      [tar] Entry: harmony-5.0-hdk-979647/build/test/awt/resources/serialization/java/awt/java.awt.Dimension[width=0,height=0].ser
longer than 100 characters.
      [tar] Entry: harmony-5.0-hdk-979647/build/test/awt/resources/serialization/java/awt/java.awt.Dimension[width=1,height=2].ser
longer than 100 characters.
      [tar] Entry: harmony-5.0-hdk-979647/build/test/awt/resources/serialization/java/awt/java.awt.Polygon[0
[0,0,0,0] () ()].ser longer than 100 characters.
      [tar] Entry: harmony-5.0-hdk-979647/build/test/awt/resources/serialization/java/awt/java.awt.Polygon[3
[1,4,2,2] (1,2,3) (4,5,6)].ser longer than 100 characters.
      [tar] Entry: harmony-5.0-hdk-979647/build/test/awt/resources/serialization/java/awt/java.awt.Rectangle[x=0,y=0,width=0,height=0].ser
longer than 100 characters.
      [tar] Entry: harmony-5.0-hdk-979647/build/test/awt/resources/serialization/java/awt/java.awt.Rectangle[x=0,y=0,width=1,height=2].ser
longer than 100 characters.
      [tar] Entry: harmony-5.0-hdk-979647/build/test/awt/resources/serialization/java/awt/java.awt.Rectangle[x=1,y=2,width=3,height=4].ser
longer than 100 characters.
      [tar] Entry: harmony-5.0-hdk-979647/build/test/awt/resources/shapes/java/awt/geom/arc(50,50,200,200,-100,-200,OPEN).ico
longer than 100 characters.
      [tar] Entry: harmony-5.0-hdk-979647/build/test/awt/resources/shapes/java/awt/geom/arc(50,50,200,200,-100,-200,OPEN).shape
longer than 100 characters.
      [tar] Entry: harmony-5.0-hdk-979647/build/test/awt/resources/shapes/java/awt/geom/arc(50,50,200,200,-300,-361,CHORD).ico
longer than 100 characters.
      [tar] Entry: harmony-5.0-hdk-979647/build/test/awt/resources/shapes/java/awt/geom/arc(50,50,200,200,-300,-361,CHORD).shape
longer than 100 characters.
      [tar] Entry: harmony-5.0-hdk-979647/build/test/awt/resources/shapes/java/awt/geom/arc(50,50,200,200,0,60,CHORD)_flat(10).ico
longer than 100 characters.
      [tar] Entry: harmony-5.0-hdk-979647/build/test/awt/resources/shapes/java/awt/geom/arc(50,50,200,200,0,60,CHORD)_flat(10).shape
longer than 100 characters.
      [tar] Entry: harmony-5.0-hdk-979647/build/test/awt/resources/shapes/java/awt/geom/arc(50,50,200,200,0,60,OPEN).ico
longer than 100 characters.
      [tar] Entry: harmony-5.0-hdk-979647/build/test/awt/resources/shapes/java/awt/geom/arc(50,50,200,200,0,60,OPEN).shape
longer than 100 characters.
      [tar] Entry: harmony-5.0-hdk-979647/build/test/awt/resources/shapes/java/awt/geom/arc(50,50,200,200,100,200,PIE).ico
longer than 100 characters.
      [tar] Entry: harmony-5.0-hdk-979647/build/test/awt/resources/shapes/java/awt/geom/arc(50,50,200,200,100,200,PIE).shape
longer than 100 characters.
      [tar] Entry: harmony-5.0-hdk-979647/build/test/awt/resources/shapes/java/awt/geom/arc(50,50,200,200,100,200,PIE)_flat(20).ico
longer than 100 characters.
      [tar] Entry: harmony-5.0-hdk-979647/build/test/awt/resources/shapes/java/awt/geom/arc(50,50,200,200,100,200,PIE)_flat(20).shape
longer than 100 characters.
      [tar] Entry: harmony-5.0-hdk-979647/build/test/awt/resources/shapes/java/awt/geom/arc(50,50,200,200,200,359,CHORD).ico
longer than 100 characters.
      [tar] Entry: harmony-5.0-hdk-979647/build/test/awt/resources/shapes/java/awt/geom/arc(50,50,200,200,200,359,CHORD).shape
longer than 100 characters.
      [tar] Entry: harmony-5.0-hdk-979647/build/test/awt/resources/shapes/java/awt/geom/arc(50,50,200,200,400,710,PIE).ico
longer than 100 characters.
      [tar] Entry: harmony-5.0-hdk-979647/build/test/awt/resources/shapes/java/awt/geom/arc(50,50,200,200,400,710,PIE).shape
longer than 100 characters.
      [tar] Entry: harmony-5.0-hdk-979647/build/test/awt/resources/shapes/java/awt/geom/arc(50,50,200,400,-250,360,PIE).ico
longer than 100 characters.
      [tar] Entry: harmony-5.0-hdk-979647/build/test/awt/resources/shapes/java/awt/geom/arc(50,50,200,400,-250,360,PIE).shape
longer than 100 characters.
      [tar] Entry: harmony-5.0-hdk-979647/build/test/awt/resources/shapes/java/awt/geom/arc(50,50,200,400,-450,730,OPEN).ico
longer than 100 characters.
      [tar] Entry: harmony-5.0-hdk-979647/build/test/awt/resources/shapes/java/awt/geom/arc(50,50,200,400,-450,730,OPEN).shape
longer than 100 characters.
      [tar] Entry: harmony-5.0-hdk-979647/build/test/awt/resources/shapes/java/awt/geom/arc(50,50,200,400,150,-270,CHORD).ico
longer than 100 characters.
      [tar] Entry: harmony-5.0-hdk-979647/build/test/awt/resources/shapes/java/awt/geom/arc(50,50,200,400,150,-270,CHORD).shape
longer than 100 characters.
      [tar] Entry: harmony-5.0-hdk-979647/build/test/awt/resources/shapes/java/awt/geom/arc(50,50,200,400,350,-390,PIE).ico
longer than 100 characters.
      [tar] Entry: harmony-5.0-hdk-979647/build/test/awt/resources/shapes/java/awt/geom/arc(50,50,200,400,350,-390,PIE).shape
longer than 100 characters.
      [tar] Entry: harmony-5.0-hdk-979647/build/test/awt/resources/shapes/java/awt/geom/arc(50,50,200,400,40,-80,CHORD).ico
longer than 100 characters.
      [tar] Entry: harmony-5.0-hdk-979647/build/test/awt/resources/shapes/java/awt/geom/arc(50,50,200,400,40,-80,CHORD).shape
longer than 100 characters.
      [tar] Entry: harmony-5.0-hdk-979647/build/test/awt/resources/shapes/java/awt/geom/arc(50,50,200,400,40,-80,OPEN)_affine(2,0,0,2,0,0).ico
longer than 100 characters.
      [tar] Entry: harmony-5.0-hdk-979647/build/test/awt/resources/shapes/java/awt/geom/arc(50,50,200,400,40,-80,OPEN)_affine(2,0,0,2,0,0).shape
longer than 100 characters.
      [tar] Entry: harmony-5.0-hdk-979647/build/test/awt/resources/shapes/java/awt/geom/arc(50,50,200,400,40,-80,PIE)_affine(1,2,2,1,0,0).ico
longer than 100 characters.
      [tar] Entry: harmony-5.0-hdk-979647/build/test/awt/resources/shapes/java/awt/geom/arc(50,50,200,400,40,-80,PIE)_affine(1,2,2,1,0,0).shape
longer than 100 characters.
      [tar] Entry: harmony-5.0-hdk-979647/build/test/awt/resources/shapes/java/awt/geom/arc(50,50,400,200,-200,-359,PIE).ico
longer than 100 characters.
      [tar] Entry: harmony-5.0-hdk-979647/build/test/awt/resources/shapes/java/awt/geom/arc(50,50,400,200,-200,-359,PIE).shape
longer than 100 characters.
      [tar] Entry: harmony-5.0-hdk-979647/build/test/awt/resources/shapes/java/awt/geom/arc(50,50,400,200,-400,-710,OPEN).ico
longer than 100 characters.
      [tar] Entry: harmony-5.0-hdk-979647/build/test/awt/resources/shapes/java/awt/geom/arc(50,50,400,200,-400,-710,OPEN).shape
longer than 100 characters.
      [tar] Entry: harmony-5.0-hdk-979647/build/test/awt/resources/shapes/java/awt/geom/arc(50,50,400,200,0,-60,CHORD).ico
longer than 100 characters.
      [tar] Entry: harmony-5.0-hdk-979647/build/test/awt/resources/shapes/java/awt/geom/arc(50,50,400,200,0,-60,CHORD).shape
longer than 100 characters.
      [tar] Entry: harmony-5.0-hdk-979647/build/test/awt/resources/shapes/java/awt/geom/arc(50,50,400,200,300,361,OPEN).ico
longer than 100 characters.
      [tar] Entry: harmony-5.0-hdk-979647/build/test/awt/resources/shapes/java/awt/geom/arc(50,50,400,200,300,361,OPEN).shape
longer than 100 characters.
      [tar] Entry: harmony-5.0-hdk-979647/build/test/awt/resources/shapes/java/awt/geom/arc(50,50,400,400,-150,270,OPEN).ico
longer than 100 characters.
      [tar] Entry: harmony-5.0-hdk-979647/build/test/awt/resources/shapes/java/awt/geom/arc(50,50,400,400,-150,270,OPEN).shape
longer than 100 characters.
      [tar] Entry: harmony-5.0-hdk-979647/build/test/awt/resources/shapes/java/awt/geom/arc(50,50,400,400,-150,270,OPEN)_flat(30).ico
longer than 100 characters.
      [tar] Entry: harmony-5.0-hdk-979647/build/test/awt/resources/shapes/java/awt/geom/arc(50,50,400,400,-150,270,OPEN)_flat(30).shape
longer than 100 characters.
      [tar] Entry: harmony-5.0-hdk-979647/build/test/awt/resources/shapes/java/awt/geom/arc(50,50,400,400,-350,390,CHORD).ico
longer than 100 characters.
      [tar] Entry: harmony-5.0-hdk-979647/build/test/awt/resources/shapes/java/awt/geom/arc(50,50,400,400,-350,390,CHORD).shape
longer than 100 characters.
      [tar] Entry: harmony-5.0-hdk-979647/build/test/awt/resources/shapes/java/awt/geom/arc(50,50,400,400,-50,170,CHORD).ico
longer than 100 characters.
      [tar] Entry: harmony-5.0-hdk-979647/build/test/awt/resources/shapes/java/awt/geom/arc(50,50,400,400,-50,170,CHORD).shape
longer than 100 characters.
      [tar] Entry: harmony-5.0-hdk-979647/build/test/awt/resources/shapes/java/awt/geom/arc(50,50,400,400,20,-330,OPEN).ico
longer than 100 characters.
      [tar] Entry: harmony-5.0-hdk-979647/build/test/awt/resources/shapes/java/awt/geom/arc(50,50,400,400,20,-330,OPEN).shape
longer than 100 characters.
      [tar] Entry: harmony-5.0-hdk-979647/build/test/awt/resources/shapes/java/awt/geom/arc(50,50,400,400,20,330,CHORD)_flat(40).ico
longer than 100 characters.
      [tar] Entry: harmony-5.0-hdk-979647/build/test/awt/resources/shapes/java/awt/geom/arc(50,50,400,400,20,330,CHORD)_flat(40).shape
longer than 100 characters.
      [tar] Entry: harmony-5.0-hdk-979647/build/test/awt/resources/shapes/java/awt/geom/arc(50,50,400,400,20,330,PIE).ico
longer than 100 characters.
      [tar] Entry: harmony-5.0-hdk-979647/build/test/awt/resources/shapes/java/awt/geom/arc(50,50,400,400,20,330,PIE).shape
longer than 100 characters.
      [tar] Entry: harmony-5.0-hdk-979647/build/test/awt/resources/shapes/java/awt/geom/arc(50,50,400,400,20,330,PIE)_flat(10).ico
longer than 100 characters.
      [tar] Entry: harmony-5.0-hdk-979647/build/test/awt/resources/shapes/java/awt/geom/arc(50,50,400,400,20,330,PIE)_flat(10).shape
longer than 100 characters.
      [tar] Entry: harmony-5.0-hdk-979647/build/test/awt/resources/shapes/java/awt/geom/arc(50,50,400,400,250,-360,OPEN).ico
longer than 100 characters.
      [tar] Entry: harmony-5.0-hdk-979647/build/test/awt/resources/shapes/java/awt/geom/arc(50,50,400,400,250,-360,OPEN).shape
longer than 100 characters.
      [tar] Entry: harmony-5.0-hdk-979647/build/test/awt/resources/shapes/java/awt/geom/arc(50,50,400,400,450,-730,CHORD).ico
longer than 100 characters.
      [tar] Entry: harmony-5.0-hdk-979647/build/test/awt/resources/shapes/java/awt/geom/arc(50,50,400,400,450,-730,CHORD).shape
longer than 100 characters.
      [tar] Entry: harmony-5.0-hdk-979647/build/test/awt/resources/shapes/java/awt/geom/arc(50,50,400,400,50,-170,PIE).ico
longer than 100 characters.
      [tar] Entry: harmony-5.0-hdk-979647/build/test/awt/resources/shapes/java/awt/geom/arc(50,50,400,400,50,-170,PIE).shape
longer than 100 characters.
      [tar] Entry: harmony-5.0-hdk-979647/build/test/awt/resources/shapes/java/awt/geom/cubic(150,250,50,250,250,50,250,200).ico
longer than 100 characters.
      [tar] Entry: harmony-5.0-hdk-979647/build/test/awt/resources/shapes/java/awt/geom/cubic(150,250,50,250,250,50,250,200).shape
longer than 100 characters.
      [tar] Entry: harmony-5.0-hdk-979647/build/test/awt/resources/shapes/java/awt/geom/cubic(300,50,50,200,300,50,350,150).ico
longer than 100 characters.
      [tar] Entry: harmony-5.0-hdk-979647/build/test/awt/resources/shapes/java/awt/geom/cubic(300,50,50,200,300,50,350,150).shape
longer than 100 characters.
      [tar] Entry: harmony-5.0-hdk-979647/build/test/awt/resources/shapes/FATAL: command execution
failed.
hudson.util.IOException2: Failed to join the process
	at hudson.Proc$RemoteProc.join(Proc.java:355)
	at hudson.Launcher$ProcStarter.join(Launcher.java:280)
	at hudson.tasks.Ant.perform(Ant.java:212)
	at hudson.tasks.BuildStepMonitor$1.perform(BuildStepMonitor.java:19)
	at hudson.model.AbstractBuild$AbstractRunner.perform(AbstractBuild.java:601)
	at hudson.model.Build$RunnerImpl.build(Build.java:174)
	at hudson.model.Build$RunnerImpl.doRun(Build.java:138)
	at hudson.model.AbstractBuild$AbstractRunner.run(AbstractBuild.java:416)
	at hudson.model.Run.run(Run.java:1257)
	at hudson.model.FreeStyleBuild.run(FreeStyleBuild.java:46)
	at hudson.model.ResourceController.execute(ResourceController.java:88)
	at hudson.model.Executor.run(Executor.java:127)
Caused by: java.util.concurrent.ExecutionException: hudson.remoting.RequestAbortedException:
java.io.IOException: Unexpected termination of the channel
	at hudson.remoting.Request$1.get(Request.java:218)
	at hudson.remoting.Request$1.get(Request.java:172)
	at hudson.remoting.FutureAdapter.get(FutureAdapter.java:55)
	at hudson.Proc$RemoteProc.join(Proc.java:347)
	... 11 more
Caused by: hudson.remoting.RequestAbortedException: java.io.IOException: Unexpected termination
of the channel
	at hudson.remoting.Request.abort(Request.java:257)
	at hudson.remoting.Channel.terminate(Channel.java:602)
	at hudson.remoting.Channel$ReaderThread.run(Channel.java:893)
Caused by: java.io.IOException: Unexpected termination of the channel
	at hudson.remoting.Channel$ReaderThread.run(Channel.java:875)
Caused by: java.io.EOFException
	at java.io.ObjectInputStream$BlockDataInputStream.readFully(ObjectInputStream.java:2700)
	at java.io.ObjectInputStream.readArray(ObjectInputStream.java:1648)
	at java.io.ObjectInputStream.readObject0(ObjectInputStream.java:1323)
	at java.io.ObjectInputStream.defaultReadFields(ObjectInputStream.java:1947)
	at java.io.ObjectInputStream.readSerialData(ObjectInputStream.java:1871)
	at java.io.ObjectInputStream.readOrdinaryObject(ObjectInputStream.java:1753)
	at java.io.ObjectInputStream.readObject0(ObjectInputStream.java:1329)
	at java.io.ObjectInputStream.readObject(ObjectInputStream.java:351)
	at hudson.remoting.Channel$ReaderThread.run(Channel.java:869)
FATAL: channel is already closed
hudson.remoting.ChannelClosedException: channel is already closed
	at hudson.remoting.Channel.send(Channel.java:412)
	at hudson.remoting.Request.call(Request.java:105)
	at hudson.remoting.Channel.call(Channel.java:555)
	at hudson.Launcher$RemoteLauncher.kill(Launcher.java:744)
	at hudson.model.AbstractBuild$AbstractRunner.run(AbstractBuild.java:421)
	at hudson.model.Run.run(Run.java:1257)
	at hudson.model.FreeStyleBuild.run(FreeStyleBuild.java:46)
	at hudson.model.ResourceController.execute(ResourceController.java:88)
	at hudson.model.Executor.run(Executor.java:127)


Mime
View raw message