harmony-alerts mailing list archives

Site index · List index
Message view « Date » · « Thread »
Top « Date » · « Thread »
From Apache Hudson Server <hud...@hudson.zones.apache.org>
Subject Build failed in Hudson: Harmony-1.6-head-linux-x86_64 #248
Date Thu, 24 Jun 2010 22:52:26 GMT
See <http://hudson.zones.apache.org/hudson/job/Harmony-1.6-head-linux-x86_64/248/changes>

Changes:

[hindessm] Merge changes from trunk@957725.

------------------------------------------
[...truncated 5869 lines...]
      [tar] Entry: harmony-6.0-hdk-957741/build/test/security/resources/serialization/org/apache/harmony/security/tests/javax/security/cert/serialization/CertificateNotYetValidExceptionTest.golden.2.ser
longer than 100 characters.
      [tar] Entry: harmony-6.0-hdk-957741/build/test/security/resources/serialization/org/apache/harmony/security/tests/javax/security/cert/serialization/CertificateParsingExceptionTest.golden.0.ser
longer than 100 characters.
      [tar] Entry: harmony-6.0-hdk-957741/build/test/security/resources/serialization/org/apache/harmony/security/tests/javax/security/cert/serialization/CertificateParsingExceptionTest.golden.1.ser
longer than 100 characters.
      [tar] Entry: harmony-6.0-hdk-957741/build/test/security/resources/serialization/org/apache/harmony/security/tests/javax/security/cert/serialization/CertificateParsingExceptionTest.golden.2.ser
longer than 100 characters.
      [tar] Entry: harmony-6.0-hdk-957741/build/test/security/resources/serialization/org/apache/harmony/security/tests/javax/security/cert/serialization/CertificateParsingExceptionTest.golden.3.ser
longer than 100 characters.
      [tar] Entry: harmony-6.0-hdk-957741/build/test/security/resources/serialization/org/apache/harmony/security/tests/provider/crypto/serialization/SHA1PRNG_SecureRandomTest.golden.0.ser
longer than 100 characters.
      [tar] Entry: harmony-6.0-hdk-957741/build/test/security/resources/serialization/org/apache/harmony/security/tests/provider/crypto/serialization/SHA1PRNG_SecureRandomTest.golden.1.ser
longer than 100 characters.
      [tar] Entry: harmony-6.0-hdk-957741/build/test/security/resources/serialization/org/apache/harmony/security/tests/provider/crypto/serialization/SHA1PRNG_SecureRandomTest.golden.2.ser
longer than 100 characters.
      [tar] Entry: harmony-6.0-hdk-957741/build/test/security/resources/serialization/org/apache/harmony/security/tests/provider/crypto/serialization/SHA1PRNG_SecureRandomTest.golden.3.ser
longer than 100 characters.
      [tar] Entry: harmony-6.0-hdk-957741/build/test/security/resources/serialization/org/apache/harmony/security/tests/provider/crypto/serialization/SHA1PRNG_SecureRandomTest.golden.4.ser
longer than 100 characters.
      [tar] Entry: harmony-6.0-hdk-957741/build/test/sound/resources/org/apache/harmony/sound/tests/javax/sound/sampled/soundProvider.jar
longer than 100 characters.
      [tar] Entry: harmony-6.0-hdk-957741/build/test/sql/resources/org/apache/harmony/sql/internal/rowset/XmlFile_InvalidHeader.xml
longer than 100 characters.
      [tar] Entry: harmony-6.0-hdk-957741/build/test/sql/resources/org/apache/harmony/sql/internal/rowset/XmlReaderTest_HY.xml
longer than 100 characters.
      [tar] Entry: harmony-6.0-hdk-957741/build/test/sql/resources/org/apache/harmony/sql/internal/rowset/XmlReaderTest_RI.xml
longer than 100 characters.
      [tar] Entry: harmony-6.0-hdk-957741/build/test/sql/resources/serialization/org/apache/harmony/sql/tests/java/sql/BatchUpdateExceptionTest.golden.ser
longer than 100 characters.
      [tar] Entry: harmony-6.0-hdk-957741/build/test/sql/resources/serialization/org/apache/harmony/sql/tests/java/sql/DataTruncationTest.golden.ser
longer than 100 characters.
      [tar] Entry: harmony-6.0-hdk-957741/build/test/sql/resources/serialization/org/apache/harmony/sql/tests/java/sql/SQLClientInfoExceptionTest.golden.ser
longer than 100 characters.
      [tar] Entry: harmony-6.0-hdk-957741/build/test/sql/resources/serialization/org/apache/harmony/sql/tests/java/sql/SQLDataExceptionTest.golden.ser
longer than 100 characters.
      [tar] Entry: harmony-6.0-hdk-957741/build/test/sql/resources/serialization/org/apache/harmony/sql/tests/java/sql/SQLExceptionTest.golden.ser
longer than 100 characters.
      [tar] Entry: harmony-6.0-hdk-957741/build/test/sql/resources/serialization/org/apache/harmony/sql/tests/java/sql/SQLFeatureNotSupportedExceptionTest.golden.ser
longer than 100 characters.
      [tar] Entry: harmony-6.0-hdk-957741/build/test/sql/resources/serialization/org/apache/harmony/sql/tests/java/sql/SQLIntegrityConstraintViolationExceptionTest.golden.ser
longer than 100 characters.
      [tar] Entry: harmony-6.0-hdk-957741/build/test/sql/resources/serialization/org/apache/harmony/sql/tests/java/sql/SQLInvalidAuthorizationSpecExceptionTest.golden.ser
longer than 100 characters.
      [tar] Entry: harmony-6.0-hdk-957741/build/test/sql/resources/serialization/org/apache/harmony/sql/tests/java/sql/SQLNonTransientConnectionExceptionTest.golden.ser
longer than 100 characters.
      [tar] Entry: harmony-6.0-hdk-957741/build/test/sql/resources/serialization/org/apache/harmony/sql/tests/java/sql/SQLNonTransientExceptionTest.golden.ser
longer than 100 characters.
      [tar] Entry: harmony-6.0-hdk-957741/build/test/sql/resources/serialization/org/apache/harmony/sql/tests/java/sql/SQLRecoverableExceptionTest.golden.ser
longer than 100 characters.
      [tar] Entry: harmony-6.0-hdk-957741/build/test/sql/resources/serialization/org/apache/harmony/sql/tests/java/sql/SQLSyntaxErrorExceptionTest.golden.ser
longer than 100 characters.
      [tar] Entry: harmony-6.0-hdk-957741/build/test/sql/resources/serialization/org/apache/harmony/sql/tests/java/sql/SQLTimeoutExceptionTest.golden.ser
longer than 100 characters.
      [tar] Entry: harmony-6.0-hdk-957741/build/test/sql/resources/serialization/org/apache/harmony/sql/tests/java/sql/SQLTransactionRollbackExceptionTest.golden.ser
longer than 100 characters.
      [tar] Entry: harmony-6.0-hdk-957741/build/test/sql/resources/serialization/org/apache/harmony/sql/tests/java/sql/SQLTransientConnectionExceptionTest.golden.ser
longer than 100 characters.
      [tar] Entry: harmony-6.0-hdk-957741/build/test/sql/resources/serialization/org/apache/harmony/sql/tests/java/sql/SQLTransientExceptionTest.golden.ser
longer than 100 characters.
      [tar] Entry: harmony-6.0-hdk-957741/build/test/sql/resources/serialization/org/apache/harmony/sql/tests/java/sql/SQLWarningTest.golden.ser
longer than 100 characters.
      [tar] Entry: harmony-6.0-hdk-957741/build/test/sql/resources/serialization/org/apache/harmony/sql/tests/java/sql/TimestampTest.golden.ser
longer than 100 characters.
      [tar] Entry: harmony-6.0-hdk-957741/build/test/sql/resources/serialization/org/apache/harmony/sql/tests/javax/sql/ConnectionEventTest.golden.ser
longer than 100 characters.
      [tar] Entry: harmony-6.0-hdk-957741/build/test/sql/resources/serialization/org/apache/harmony/sql/tests/javax/sql/StatementEventTest.golden.ser
longer than 100 characters.
      [tar] Entry: harmony-6.0-hdk-957741/build/test/sql/resources/serialization/org/apache/harmony/sql/tests/javax/sql/rowset/RowSetMetaDataImplTest.golden.ser
longer than 100 characters.
      [tar] Entry: harmony-6.0-hdk-957741/build/test/sql/resources/serialization/org/apache/harmony/sql/tests/javax/sql/rowset/serial/SerialExceptionTest.golden.ser
longer than 100 characters.
      [tar] Entry: harmony-6.0-hdk-957741/build/test/text/resources/provider/correct/META-INF/services/java.text.spi.DateFormatSymbolsProvider
longer than 100 characters.
      [tar] Entry: harmony-6.0-hdk-957741/build/test/text/resources/provider/correct/META-INF/services/java.text.spi.DecimalFormatSymbolsProvider
longer than 100 characters.
      [tar] Entry: harmony-6.0-hdk-957741/build/test/text/resources/provider/wrong/META-INF/services/java.text.spi.DateFormatSymbolsProvider
longer than 100 characters.
      [tar] Entry: harmony-6.0-hdk-957741/build/test/text/resources/provider/wrong/META-INF/services/java.text.spi.DecimalFormatSymbolsProvider
longer than 100 characters.
      [tar] Entry: harmony-6.0-hdk-957741/build/test/text/resources/serialization/org/apache/harmony/text/tests/java/text/DecimalFormatSymbolsTest.golden.ser
longer than 100 characters.
      [tar] Entry: harmony-6.0-hdk-957741/build/test/x-net/resources/serialization/org/apache/harmony/xnet/tests/javax/net/ssl/serialization/HandshakeCompletedEventTest.golden.0.ser
longer than 100 characters.
      [tar] Entry: harmony-6.0-hdk-957741/build/test/x-net/resources/serialization/org/apache/harmony/xnet/tests/javax/net/ssl/serialization/SSLExceptionTest.golden.0.ser
longer than 100 characters.
      [tar] Entry: harmony-6.0-hdk-957741/build/test/x-net/resources/serialization/org/apache/harmony/xnet/tests/javax/net/ssl/serialization/SSLExceptionTest.golden.1.ser
longer than 100 characters.
      [tar] Entry: harmony-6.0-hdk-957741/build/test/x-net/resources/serialization/org/apache/harmony/xnet/tests/javax/net/ssl/serialization/SSLExceptionTest.golden.2.ser
longer than 100 characters.
      [tar] Entry: harmony-6.0-hdk-957741/build/test/x-net/resources/serialization/org/apache/harmony/xnet/tests/javax/net/ssl/serialization/SSLExceptionTest.golden.3.ser
longer than 100 characters.
      [tar] Entry: harmony-6.0-hdk-957741/build/test/x-net/resources/serialization/org/apache/harmony/xnet/tests/javax/net/ssl/serialization/SSLExceptionTest.golden.4.ser
longer than 100 characters.
      [tar] Entry: harmony-6.0-hdk-957741/build/test/x-net/resources/serialization/org/apache/harmony/xnet/tests/javax/net/ssl/serialization/SSLHandshakeExceptionTest.golden.0.ser
longer than 100 characters.
      [tar] Entry: harmony-6.0-hdk-957741/build/test/x-net/resources/serialization/org/apache/harmony/xnet/tests/javax/net/ssl/serialization/SSLHandshakeExceptionTest.golden.1.ser
longer than 100 characters.
      [tar] Entry: harmony-6.0-hdk-957741/build/test/x-net/resources/serialization/org/apache/harmony/xnet/tests/javax/net/ssl/serialization/SSLHandshakeExceptionTest.golden.2.ser
longer than 100 characters.
      [tar] Entry: harmony-6.0-hdk-957741/build/test/x-net/resources/serialization/org/apache/harmony/xnet/tests/javax/net/ssl/serialization/SSLKeyExceptionTest.golden.0.ser
longer than 100 characters.
      [tar] Entry: harmony-6.0-hdk-957741/build/test/x-net/resources/serialization/org/apache/harmony/xnet/tests/javax/net/ssl/serialization/SSLKeyExceptionTest.golden.1.ser
longer than 100 characters.
      [tar] Entry: harmony-6.0-hdk-957741/build/test/x-net/resources/serialization/org/apache/harmony/xnet/tests/javax/net/ssl/serialization/SSLKeyExceptionTest.golden.2.ser
longer than 100 characters.
      [tar] Entry: harmony-6.0-hdk-957741/build/test/x-net/resources/serialization/org/apache/harmony/xnet/tests/javax/net/ssl/serialization/SSLPeerUnverifiedExceptionTest.golden.0.ser
longer than 100 characters.
      [tar] Entry: harmony-6.0-hdk-957741/build/test/x-net/resources/serialization/org/apache/harmony/xnet/tests/javax/net/ssl/serialization/SSLPeerUnverifiedExceptionTest.golden.1.ser
longer than 100 characters.
      [tar] Entry: harmony-6.0-hdk-957741/build/test/x-net/resources/serialization/org/apache/harmony/xnet/tests/javax/net/ssl/serialization/SSLPeerUnverifiedExceptionTest.golden.2.ser
longer than 100 characters.
      [tar] Entry: harmony-6.0-hdk-957741/build/test/x-net/resources/serialization/org/apache/harmony/xnet/tests/javax/net/ssl/serialization/SSLProtocolExceptionTest.golden.0.ser
longer than 100 characters.
      [tar] Entry: harmony-6.0-hdk-957741/build/test/x-net/resources/serialization/org/apache/harmony/xnet/tests/javax/net/ssl/serialization/SSLProtocolExceptionTest.golden.1.ser
longer than 100 characters.
      [tar] Entry: harmony-6.0-hdk-957741/build/test/x-net/resources/serialization/org/apache/harmony/xnet/tests/javax/net/ssl/serialization/SSLProtocolExceptionTest.golden.2.ser
longer than 100 characters.
      [tar] Entry: harmony-6.0-hdk-957741/build/test/x-net/resources/serialization/org/apache/harmony/xnet/tests/javax/net/ssl/serialization/SSLSessionBindingEventTest.golden.0.ser
longer than 100 characters.
      [tar] Entry: harmony-6.0-hdk-957741/jdk/jre/lib/boot/geronimo-activation_1.1_spec-1.0.2/geronimo-activation_1.1_spec-1.0.2.jar
longer than 100 characters.
      [tar] Entry: harmony-6.0-hdk-957741/jdk/jre/lib/boot/geronimo-stax-api_1.0_spec-1.0.1/geronimo-stax-api_1.0_spec-1.0.1.jar
longer than 100 characters.
      [tar] Entry: harmony-6.0-hdk-957741/jdk/jre/lib/boot/geronimo-ws-metadata_2.0_spec-1.1.2/geronimo-ws-metadata_2.0_spec-1.1.2.jar
longer than 100 characters.

bundle-hdk-zip:

bundle-hdk:

assemble-jdk-doc:
     [copy] Copying 2 files to <http://hudson.zones.apache.org/hudson/job/Harmony-1.6-head-linux-x86_64/ws/harmony/target/hdk/jdk>

bundle-jdk-tgz:
      [tar] Building tar: <http://hudson.zones.apache.org/hudson/job/Harmony-1.6-head-linux-x86_64/248/artifact/harmony/target/apache-harmony-6.0-jdk-r957741-linux-x86_64-snapshot.tar.gz>
      [tar] Entry: harmony-6.0-jdk-957741/jre/lib/boot/geronimo-activation_1.1_spec-1.0.2/geronimo-activation_1.1_spec-1.0.2.jar
longer than 100 characters.
      [tar] Resulting tar file can only be processed successfully by GNU compatible tar commands
      [tar] Entry: harmony-6.0-jdk-957741/jre/lib/boot/geronimo-stax-api_1.0_spec-1.0.1/geronimo-stax-api_1.0_spec-1.0.1.jar
longer than 100 characters.
      [tar] Entry: harmony-6.0-jdk-957741/jre/lib/boot/geronimo-ws-metadata_2.0_spec-1.1.2/geronimo-ws-metadata_2.0_spec-1.1.2.jar
longer than 100 characters.

bundle-jdk-zip:

bundle-jdk:

assemble-jre-doc:
     [copy] Copying 2 files to <http://hudson.zones.apache.org/hudson/job/Harmony-1.6-head-linux-x86_64/ws/harmony/target/hdk/jdk/jre>

bundle-jre-tgz:
      [tar] Building tar: <http://hudson.zones.apache.org/hudson/job/Harmony-1.6-head-linux-x86_64/248/artifact/harmony/target/apache-harmony-6.0-jre-r957741-linux-x86_64-snapshot.tar.gz>
      [tar] Entry: harmony-6.0-jre-957741/lib/boot/geronimo-activation_1.1_spec-1.0.2/geronimo-activation_1.1_spec-1.0.2.jar
longer than 100 characters.
      [tar] Resulting tar file can only be processed successfully by GNU compatible tar commands
      [tar] Entry: harmony-6.0-jre-957741/lib/boot/geronimo-stax-api_1.0_spec-1.0.1/geronimo-stax-api_1.0_spec-1.0.1.jar
longer than 100 characters.
      [tar] Entry: harmony-6.0-jre-957741/lib/boot/geronimo-ws-metadata_2.0_spec-1.1.2/geronimo-ws-metadata_2.0_spec-1.1.2.jar
longer than 100 characters.

bundle-jre-zip:

bundle-jre:

snapshot:

BUILD SUCCESSFUL
Total time: 12 minutes 42 seconds
[harmony] $ ant -Dbuild.module=pack200 test
Buildfile: build.xml

clean-tests:

test:
Trying to override old definition of task make
Trying to override old definition of task prepare-exclude-list
Trying to override old definition of task hy.jar.src

-get-test-vm-output:

test-jre-vm-info:
     [echo] java -version
     [echo] Apache Harmony Launcher : (c) Copyright 1991, 2010 The Apache Software Foundation
or its licensors, as applicable.
     [echo] java version "1.6.0"
     [echo] Apache Harmony (1.6.0)
     [echo] DRLVM (1.6.0-r957741)
     [echo] pre-alpha : not complete or compatible
     [echo] svn = r957741, (Jun 24 2010), Linux/em64t/gcc 4.3.2, release build
     [echo] http://harmony.apache.org
     [echo] hy.test.vm.name = drl

-test:
     [echo] Test Work Dir: .
     [echo] Test Target Dir: .
     [echo] polling pack200/*.xml

-get-test-vm-output:

test-jre-vm-info:
     [echo] java -version
     [echo] Apache Harmony Launcher : (c) Copyright 1991, 2010 The Apache Software Foundation
or its licensors, as applicable.
     [echo] java version "1.6.0"
     [echo] Apache Harmony (1.6.0)
     [echo] DRLVM (1.6.0-r957741)
     [echo] pre-alpha : not complete or compatible
     [echo] svn = r957741, (Jun 24 2010), Linux/em64t/gcc 4.3.2, release build
     [echo] http://harmony.apache.org
     [echo] hy.test.vm.name = drl

test-module:
     [echo] Running pack200 Unit Test from pack200_tests.jar
     [echo] Tested jre: <http://hudson.zones.apache.org/hudson/job/Harmony-1.6-head-linux-x86_64/ws/harmony/target/hdk/jdk/jre/bin/java>
    [mkdir] Created dir: <http://hudson.zones.apache.org/hudson/job/Harmony-1.6-head-linux-x86_64/ws/harmony/target/test_report>
    [mkdir] Created dir: <http://hudson.zones.apache.org/hudson/job/Harmony-1.6-head-linux-x86_64/ws/harmony/target/hdk/build/test/pack200/temp/ant>
    [mkdir] Created dir: <http://hudson.zones.apache.org/hudson/job/Harmony-1.6-head-linux-x86_64/ws/harmony/target/hdk/build/test/pack200/temp/tmpdir>
    [mkdir] Created dir: <http://hudson.zones.apache.org/hudson/job/Harmony-1.6-head-linux-x86_64/ws/harmony/target/hdk/build/test/pack200/temp/user>
    [junit] Running org.apache.harmony.pack200.tests.ArchiveTest
    [junit] Tests run: 10, Failures: 0, Errors: 0, Time elapsed: 5.626 sec
    [junit] Running org.apache.harmony.pack200.tests.BHSDCodecTest
    [junit] Tests run: 2, Failures: 0, Errors: 0, Time elapsed: 0.009 sec
    [junit] Running org.apache.harmony.pack200.tests.CodecEncodingTest
    [junit] Tests run: 5, Failures: 0, Errors: 0, Time elapsed: 0.01 sec
    [junit] Running org.apache.harmony.pack200.tests.CodecTest
    [junit] Tests run: 10, Failures: 0, Errors: 0, Time elapsed: 0.015 sec
    [junit] Running org.apache.harmony.pack200.tests.NewAttributeBandsTest
    [junit] Tests run: 8, Failures: 0, Errors: 0, Time elapsed: 0.019 sec
    [junit] Running org.apache.harmony.pack200.tests.PopulationCodecTest
    [junit] Tests run: 1, Failures: 0, Errors: 0, Time elapsed: 0.005 sec
    [junit] Running org.apache.harmony.unpack200.tests.ArchiveTest
    [junit] Tests run: 9, Failures: 0, Errors: 0, Time elapsed: 0.646 sec
    [junit] Running org.apache.harmony.unpack200.tests.AttributeLayoutMapTest
    [junit] Tests run: 1, Failures: 0, Errors: 0, Time elapsed: 0.005 sec
    [junit] Running org.apache.harmony.unpack200.tests.AttributeLayoutTest
    [junit] Tests run: 6, Failures: 0, Errors: 0, Time elapsed: 0.009 sec
    [junit] Running org.apache.harmony.unpack200.tests.BandSetTest
    [junit] Tests run: 6, Failures: 0, Errors: 0, Time elapsed: 0.006 sec
    [junit] Running org.apache.harmony.unpack200.tests.BcBandsTest
    [junit] Tests run: 25, Failures: 0, Errors: 0, Time elapsed: 0.049 sec
    [junit] Running org.apache.harmony.unpack200.tests.CPUTF8Test
    [junit] Tests run: 1, Failures: 0, Errors: 0, Time elapsed: 0.004 sec
    [junit] Running org.apache.harmony.unpack200.tests.ClassBandsTest
    [junit] Tests run: 2, Failures: 0, Errors: 0, Time elapsed: 0.008 sec
    [junit] Running org.apache.harmony.unpack200.tests.ClassVersionTest
    [junit] Tests run: 3, Failures: 0, Errors: 0, Time elapsed: 0.006 sec
    [junit] Running org.apache.harmony.unpack200.tests.CodeAttributeTest
    [junit] Tests run: 3, Failures: 0, Errors: 0, Time elapsed: 0.007 sec
    [junit] Running org.apache.harmony.unpack200.tests.ICTupleTest
    [junit] Tests run: 2, Failures: 0, Errors: 0, Time elapsed: 0.004 sec
    [junit] Running org.apache.harmony.unpack200.tests.SegmentConstantPoolArrayCacheTest
    [junit] Tests run: 3, Failures: 0, Errors: 0, Time elapsed: 0.006 sec
    [junit] Running org.apache.harmony.unpack200.tests.SegmentConstantPoolTest
    [junit] Tests run: 3, Failures: 0, Errors: 0, Time elapsed: 0.006 sec
    [junit] Running org.apache.harmony.unpack200.tests.SegmentOptionsTest
    [junit] Tests run: 1, Failures: 0, Errors: 0, Time elapsed: 0.004 sec
    [junit] Running org.apache.harmony.unpack200.tests.SegmentTest
    [junit] Tests run: 3, Failures: 0, Errors: 0, Time elapsed: 0.012 sec
    [junit] Running org.apache.harmony.unpack200.tests.SegmentUtilsTest
    [junit] Tests run: 3, Failures: 0, Errors: 0, Time elapsed: 0.005 sec
    [junit] Running org.apache.harmony.unpack200.tests.bytecode.ByteCodeTest
    [junit] Tests run: 1, Failures: 0, Errors: 0, Time elapsed: 0.004 sec
    [junit] Running org.apache.harmony.unpack200.tests.bytecode.ClassFileEntryTest
    [junit] Tests run: 8, Failures: 0, Errors: 0, Time elapsed: 0.01 sec
    [junit] Running org.apache.harmony.unpack200.tests.bytecode.ConstantPoolTest
    [junit] Tests run: 4, Failures: 0, Errors: 0, Time elapsed: 0.006 sec
   [delete] Deleting directory <http://hudson.zones.apache.org/hudson/job/Harmony-1.6-head-linux-x86_64/ws/harmony/target/hdk/build/test/pack200/temp>

touch-failures-file:

touch-errors-file:

-check-for-empty:

-process-empty:

-check-crashed:

-short-report:

-full-report:
    [mkdir] Created dir: <http://hudson.zones.apache.org/hudson/job/Harmony-1.6-head-linux-x86_64/ws/harmony/target/test_report/html>
[junitreport] Processing <http://hudson.zones.apache.org/hudson/job/Harmony-1.6-head-linux-x86_64/ws/harmony/target/test_report/html/TESTS-TestSuites.xml>
to /tmp/null211112090
[junitreport] Loading stylesheet jar:file:/usr/share/ant/lib/ant-junit.jar!/org/apache/tools/ant/taskdefs/optional/junit/xsl/junit-frames.xsl
[junitreport] Transform time: 3154ms
[junitreport] Deleting: /tmp/null211112090

gen-report:
     [echo] The test report is in <http://hudson.zones.apache.org/hudson/job/Harmony-1.6-head-linux-x86_64/ws/harmony/target/test_report/html/index.html>

check-test-result:

test:

BUILD SUCCESSFUL
Total time: 12 seconds
FATAL: hudson.remoting.RequestAbortedException: java.io.EOFException
hudson.remoting.RequestAbortedException: hudson.remoting.RequestAbortedException: java.io.EOFException
	at hudson.remoting.Request.call(Request.java:137)
	at hudson.remoting.Channel.call(Channel.java:551)
	at hudson.Launcher$RemoteLauncher.kill(Launcher.java:735)
	at hudson.model.AbstractBuild$AbstractRunner.run(AbstractBuild.java:421)
	at hudson.model.Run.run(Run.java:1243)
	at hudson.model.FreeStyleBuild.run(FreeStyleBuild.java:46)
	at hudson.model.ResourceController.execute(ResourceController.java:88)
	at hudson.model.Executor.run(Executor.java:122)
Caused by: hudson.remoting.RequestAbortedException: java.io.EOFException
	at hudson.remoting.Request.abort(Request.java:257)
	at hudson.remoting.Channel.terminate(Channel.java:598)
	at hudson.remoting.Channel$ReaderThread.run(Channel.java:876)
Caused by: java.io.EOFException
	at java.io.ObjectInputStream$BlockDataInputStream.peekByte(ObjectInputStream.java:2554)
	at java.io.ObjectInputStream.readObject0(ObjectInputStream.java:1297)
	at java.io.ObjectInputStream.defaultReadFields(ObjectInputStream.java:1947)
	at java.io.ObjectInputStream.readSerialData(ObjectInputStream.java:1871)
	at java.io.ObjectInputStream.readOrdinaryObject(ObjectInputStream.java:1753)
	at java.io.ObjectInputStream.readObject0(ObjectInputStream.java:1329)
	at java.io.ObjectInputStream.readObject(ObjectInputStream.java:351)
	at hudson.remoting.Channel$ReaderThread.run(Channel.java:856)


Mime
View raw message