harmony-alerts mailing list archives

Site index · List index
Message view « Date » · « Thread »
Top « Date » · « Thread »
From nom...@intel.com
Subject [build-test alert] FAILED Windows 2003 x86_64: hdk debug
Date Wed, 12 Aug 2009 01:38:25 GMT

BUILD FAILED:
	Ant Error Message:
C:\harmony.cc\infra\scripts\cc-exec-adaptor.xml:68: The following error occurred while executing
this line: C:\harmony.cc\infra\adaptors\hdk\adaptor.xml:39: The following error occurred while
executing this line: C:\harmony.cc\infra\scripts\framework.xml:163: Java returned: 1

Date of build:	2009-08-11 18:30:38 -0700
Time to build:	7 minutes 8 seconds
Last changed:	08/11/2009 03:39:52
Last log entry:	Use new ant 1.7.0 service element for jar task to automatically specify the
CharsetProvider in the nio_char jars and remove previously used file.

***********************************************************
Errors/Warnings:	(9)
            
BUILD FAILED
C:\harmony.cc\infra\build\checkouts\hdk\build.xml:415: The following error occurred while
executing this line:
C:\harmony.cc\infra\build\checkouts\hdk\working_classlib\build.xml:120: The following error
occurred while executing this line:
C:\harmony.cc\infra\build\checkouts\hdk\working_classlib\make\build-java.xml:181: The following
error occurred while executing this line:
C:\harmony.cc\infra\build\checkouts\hdk\working_classlib\make\properties.xml:545: The following
error occurred while executing this line:
C:\harmony.cc\infra\build\checkouts\hdk\working_classlib\make\properties.xml:557: The following
error occurred while executing this line:
C:\harmony.cc\infra\build\checkouts\hdk\working_classlib\modules\nio_char\build.xml:113: The
<jar> type doesn't support the nested "service" element.
Total time: 6 minutes 22 seconds
The execution FAILED with the following exception:
The following error occurred while executing this line:
C:\harmony.cc\infra\adaptors\hdk\adaptor.xml:39: The following error occurred while executing
this line:
C:\harmony.cc\infra\scripts\framework.xml:163: Java returned: 1

***********************************************************
Unit Tests: (0)
        
No Tests Run: This project doesn't have any tests

***********************************************************
Modifications since last successful build:	(2)
            
modified odeakin  /harmony/enhanced/classlib/trunk/modules/nio_char/build.xml 08/11/2009 03:39:52
Use new ant 1.7.0 service element for jar task to automatically specify the CharsetProvider
in the nio_char jars and remove previously used file.
deleted odeakin  /harmony/enhanced/classlib/trunk/modules/nio_char/src/main/java/org/apache/harmony/niochar/java.nio.charset.spi.CharsetProvider
08/11/2009 03:39:52 Use new ant 1.7.0 service element for jar task to automatically specify
the CharsetProvider in the nio_char jars and remove previously used file.


Mime
  • Unnamed multipart/mixed (inline, None, 0 bytes)
View raw message