harmony-alerts mailing list archives: July 2009

Site index · List index
Message listThread · Author · Date
Apache Hudson Server Build failed in Hudson: Harmony-1.5-head-linux-x86_64 #239 Wed, 01 Jul, 04:05
Apache Hudson Server   Hudson build is back to normal: Harmony-1.5-head-linux-x86_64 #240 Wed, 01 Jul, 10:19
[build-test alert] FAILED Linux x86_64: drlvm-test debug
nom...@intel.com   [build-test alert] FAILED Linux x86_64: drlvm-test debug Wed, 08 Jul, 16:00
nom...@intel.com   [build-test alert] FAILED Linux x86_64: drlvm-test debug Fri, 10 Jul, 21:08
nom...@intel.com   [build-test alert] FAILED Linux x86_64: drlvm-test debug Mon, 13 Jul, 08:12
nom...@intel.com   [build-test alert] FAILED Linux x86_64: drlvm-test debug Thu, 16 Jul, 04:38
nom...@intel.com   [build-test alert] FAILED Linux x86_64: drlvm-test debug Sun, 19 Jul, 01:01
nom...@intel.com   [build-test alert] FAILED Linux x86_64: drlvm-test debug Sun, 19 Jul, 19:06
nom...@intel.com   [build-test alert] FAILED Linux x86_64: drlvm-test debug Fri, 24 Jul, 15:22
nom...@intel.com   [build-test alert] FAILED Linux x86_64: drlvm-test debug Sun, 26 Jul, 20:36
nom...@intel.com   [build-test alert] FAILED Linux x86_64: drlvm-test debug Thu, 30 Jul, 21:27
[build-test alert] PASSED Linux x86_64: drlvm-test debug
nom...@intel.com   [build-test alert] PASSED Linux x86_64: drlvm-test debug Thu, 09 Jul, 00:58
nom...@intel.com   [build-test alert] PASSED Linux x86_64: drlvm-test debug Sun, 12 Jul, 02:26
nom...@intel.com   [build-test alert] PASSED Linux x86_64: drlvm-test debug Mon, 13 Jul, 23:09
nom...@intel.com   [build-test alert] PASSED Linux x86_64: drlvm-test debug Thu, 16 Jul, 16:20
nom...@intel.com   [build-test alert] PASSED Linux x86_64: drlvm-test debug Sun, 19 Jul, 10:14
nom...@intel.com   [build-test alert] PASSED Linux x86_64: drlvm-test debug Mon, 20 Jul, 03:31
nom...@intel.com   [build-test alert] PASSED Linux x86_64: drlvm-test debug Sun, 26 Jul, 02:33
nom...@intel.com   [build-test alert] PASSED Linux x86_64: drlvm-test debug Mon, 27 Jul, 17:33
nom...@intel.com   [build-test alert] PASSED Linux x86_64: drlvm-test debug Fri, 31 Jul, 15:39
nom...@intel.com [build-test alert] PASSED Windows 2003 x86_64: drlvm-test debug Fri, 10 Jul, 04:04
Apache Hudson Server Build failed in Hudson: Harmony-1.6-head-linux-x86_64 #58 Thu, 16 Jul, 18:02
Apache Hudson Server   Hudson build is back to normal: Harmony-1.6-head-linux-x86_64 #59 Fri, 17 Jul, 10:09
nom...@intel.com [build-test alert] FAILED Linux x86_64: drlvm-reg-test debug Sun, 19 Jul, 16:36
nom...@intel.com [build-test alert] PASSED Linux x86_64: drlvm-reg-test debug Mon, 20 Jul, 01:00
Apache Hudson Server Build failed in Hudson: Harmony-1.5-head-linux-x86_64 #318 Tue, 21 Jul, 10:05
Apache Hudson Server   Build failed in Hudson: Harmony-1.5-head-linux-x86_64 #319 Tue, 21 Jul, 11:05
Apache Hudson Server     Build failed in Hudson: Harmony-1.5-head-linux-x86_64 #320 Tue, 21 Jul, 12:05
Apache Hudson Server       Build failed in Hudson: Harmony-1.5-head-linux-x86_64 #321 Tue, 21 Jul, 14:04
Apache Hudson Server         Build failed in Hudson: Harmony-1.5-head-linux-x86_64 #322 Tue, 21 Jul, 15:04
Apache Hudson Server           Build failed in Hudson: Harmony-1.5-head-linux-x86_64 #323 Tue, 21 Jul, 16:04
Apache Hudson Server             Build failed in Hudson: Harmony-1.5-head-linux-x86_64 #324 Tue, 21 Jul, 17:04
Apache Hudson Server               Build failed in Hudson: Harmony-1.5-head-linux-x86_64 #325 Tue, 21 Jul, 18:05
Apache Hudson Server                 Build failed in Hudson: Harmony-1.5-head-linux-x86_64 #326 Tue, 21 Jul, 19:04
Apache Hudson Server                   Build failed in Hudson: Harmony-1.5-head-linux-x86_64 #327 Tue, 21 Jul, 20:04
Apache Hudson Server                     Build failed in Hudson: Harmony-1.5-head-linux-x86_64 #328 Tue, 21 Jul, 21:04
Apache Hudson Server                       Build failed in Hudson: Harmony-1.5-head-linux-x86_64 #329 Tue, 21 Jul, 22:04
Apache Hudson Server                         Build failed in Hudson: Harmony-1.5-head-linux-x86_64 #330 Tue, 21 Jul, 23:04
Apache Hudson Server                           Build failed in Hudson: Harmony-1.5-head-linux-x86_64 #331 Wed, 22 Jul, 00:04
Apache Hudson Server                             Build failed in Hudson: Harmony-1.5-head-linux-x86_64 #332 Wed, 22 Jul, 01:04
Apache Hudson Server                               Build failed in Hudson: Harmony-1.5-head-linux-x86_64 #333 Wed, 22 Jul, 02:05
Apache Hudson Server                                 Build failed in Hudson: Harmony-1.5-head-linux-x86_64 #334 Wed, 22 Jul, 03:05
Apache Hudson Server                                   Build failed in Hudson: Harmony-1.5-head-linux-x86_64 #335 Wed, 22 Jul, 04:04
Apache Hudson Server                                     Build failed in Hudson: Harmony-1.5-head-linux-x86_64 #336 Wed, 22 Jul, 05:05
Apache Hudson Server                                       Build failed in Hudson: Harmony-1.5-head-linux-x86_64 #337 Wed, 22 Jul, 06:05
Apache Hudson Server                                         Build failed in Hudson: Harmony-1.5-head-linux-x86_64 #338 Wed, 22 Jul, 07:05
Apache Hudson Server                                           Build failed in Hudson: Harmony-1.5-head-linux-x86_64 #339 Wed, 22 Jul, 08:05
Apache Hudson Server                                             Hudson build is back to normal: Harmony-1.5-head-linux-x86_64 #340 Fri, 24 Jul, 18:17
Apache Hudson Server Build failed in Hudson: Harmony-1.6-head-linux-x86_64 #60 Wed, 22 Jul, 15:04
Apache Hudson Server   Build failed in Hudson: Harmony-1.6-head-linux-x86_64 #61 Wed, 22 Jul, 16:05
Apache Hudson Server     Build failed in Hudson: Harmony-1.6-head-linux-x86_64 #62 Wed, 22 Jul, 17:04
Apache Hudson Server       Build failed in Hudson: Harmony-1.6-head-linux-x86_64 #63 Wed, 22 Jul, 18:04
Apache Hudson Server         Hudson build is back to normal: Harmony-1.6-head-linux-x86_64 #64 Fri, 24 Jul, 18:42
[build-test alert] FAILED Windows 2003 x86_64: jdktools-test debug
nom...@intel.com   [build-test alert] FAILED Windows 2003 x86_64: jdktools-test debug Sun, 26 Jul, 05:50
nom...@intel.com   [build-test alert] FAILED Windows 2003 x86_64: jdktools-test debug Wed, 29 Jul, 03:10
[build-test alert] PASSED Windows 2003 x86_64: jdktools-test debug
nom...@intel.com   [build-test alert] PASSED Windows 2003 x86_64: jdktools-test debug Sun, 26 Jul, 22:31
nom...@intel.com   [build-test alert] PASSED Windows 2003 x86_64: jdktools-test debug Wed, 29 Jul, 21:53
nom...@intel.com [build-test alert] FAILED Linux x86_64: jdktools-test debug Mon, 27 Jul, 13:30
nom...@intel.com [build-test alert] PASSED Linux x86_64: jdktools-test debug Wed, 29 Jul, 00:02
Message listThread · Author · Date
Box list
Jul 20113
Dec 201029
Nov 20106
Oct 201046
Sep 201035
Aug 201017
Jul 201029
Jun 201041
May 201020
Apr 201040
Mar 2010102
Feb 201043
Jan 201014
Dec 200911
Nov 20099
Oct 200912
Sep 20093
Aug 200915
Jul 200959
Jun 200916
May 200930
Apr 200960
Mar 200919
Feb 200945
Jan 200957
Dec 200827
Nov 200815
Oct 200824
Sep 200854
Aug 200834
Jul 200841
Jun 200899
May 200862
Apr 2008113
Mar 2008133
Feb 2008164
Jan 2008291
Dec 2007335
Nov 2007454
Oct 2007405
Sep 2007259
Aug 2007368
Jul 2007618
Jun 2007607
May 2007672
Apr 2007455
Mar 20071104
Feb 2007389
Jan 2007418
Dec 200692