harmony-alerts mailing list archives

Site index · List index
Message view « Date » · « Thread »
Top « Date » · « Thread »
From nom...@intel.com
Subject [build-test alert] FAILED Linux x86_64: jdktools-test debug
Date Mon, 27 Jul 2009 13:30:34 GMT

BUILD FAILED:
	Ant Error Message:
/home/laichunrong/harmony.regularcc/infra/scripts/cc-exec-adaptor.xml:68: The following error
occurred while executing this line: /home/laichunrong/harmony.regularcc/infra/adaptors/jdktools-test/adaptor.xml:50:
The following error occurred while executing this line: /home/laichunrong/harmony.regularcc/infra/scripts/framework.xml:163:
Java returned: 1

Date of build:	2009-07-27 21:11:16 +0800
Time to build:	19 minutes 11 seconds
Last changed:	07/27/2009 20:44:39
Last log entry:	hdk

***********************************************************
Errors/Warnings:	(7)
            
[junit] Tests FAILED
[exec] Result: 1
BUILD FAILED
/home/laichunrong/harmony.regularcc/infra/build/checkouts/hdk/working_jdktools/build.xml:160:
The following error occurred while executing this line:
/home/laichunrong/harmony.regularcc/infra/build/checkouts/hdk/working_jdktools/make/build-test.xml:95:
There were test errors.
Total time: 18 minutes 4 seconds
The execution FAILED with the following exception:
The following error occurred while executing this line:
/home/laichunrong/harmony.regularcc/infra/adaptors/jdktools-test/adaptor.xml:50: The following
error occurred while executing this line:
/home/laichunrong/harmony.regularcc/infra/scripts/framework.xml:163: Java returned: 1

***********************************************************
Unit Tests: (162)
        
error: testAllThreads001 org.apache.harmony.jpda.tests.jdwp.VirtualMachine.AllThreadsTest
Unit Test Error Details:	(1)
                
Test: testAllThreads001Class: org.apache.harmony.jpda.tests.jdwp.VirtualMachine.AllThreadsTestorg.apache.harmony.jpda.tests.framework.TestErrorException:
org.apache.harmony.jpda.tests.framework.TestErrorException: org.apache.harmony.jpda.tests.framework.TestErrorException:
java.net.SocketTimeoutException: The operation timed out
	at org.apache.harmony.jpda.tests.jdwp.share.JDWPRawTestCase.setUp(JDWPRawTestCase.java:101)
Caused by: org.apache.harmony.jpda.tests.framework.TestErrorException: org.apache.harmony.jpda.tests.framework.TestErrorException:
java.net.SocketTimeoutException: The operation timed out
	at org.apache.harmony.jpda.tests.jdwp.share.JDWPUnitDebuggeeWrapper.start(JDWPUnitDebuggeeWrapper.java:98)
	at org.apache.harmony.jpda.tests.jdwp.share.JDWPTestCase.startDebuggeeWrapper(JDWPTestCase.java:87)
	at org.apache.harmony.jpda.tests.jdwp.share.JDWPTestCase.internalSetUp(JDWPTestCase.java:62)
	at org.apache.harmony.jpda.tests.jdwp.share.JDWPSyncTestCase.internalSetUp(JDWPSyncTestCase.java:63)
	at org.apache.harmony.jpda.tests.jdwp.share.JDWPRawTestCase.setUp(JDWPRawTestCase.java:95)
	... 9 more
Caused by: org.apache.harmony.jpda.tests.framework.TestErrorException: java.net.SocketTimeoutException:
The operation timed out
	at org.apache.harmony.jpda.tests.jdwp.share.JDWPUnitDebuggeeWrapper.openConnection(JDWPUnitDebuggeeWrapper.java:137)
	at org.apache.harmony.jpda.tests.jdwp.share.JDWPUnitDebuggeeWrapper.start(JDWPUnitDebuggeeWrapper.java:95)
	at org.apache.harmony.jpda.tests.jdwp.share.JDWPTestCase.startDebuggeeWrapper(JDWPTestCase.java:87)
	... 13 more
Caused by: java.net.SocketTimeoutException: The operation timed out
	at org.apache.harmony.luni.net.PlainSocketImpl.accept(PlainSocketImpl.java:142)
	at java.net.ServerSocket.implAccept(ServerSocket.java:277)
	at java.net.ServerSocket.accept(ServerSocket.java:156)
	at org.apache.harmony.jpda.tests.framework.jdwp.SocketTransportWrapper.accept(SocketTransportWrapper.java:119)
	at org.apache.harmony.jpda.tests.jdwp.share.JDWPUnitDebuggeeWrapper.openConnection(JDWPUnitDebuggeeWrapper.java:128)
	at org.apache.harmony.jpda.tests.jdwp.share.JDWPUnitDebuggeeWrapper.start(JDWPUnitDebuggeeWrapper.java:95)
	... 14 more

***********************************************************
Modifications since last successful build:	(1)
            
add cc-hdk log20090727204439Lbuild.213 07/27/2009 20:44:39hdk


Mime
  • Unnamed multipart/mixed (inline, None, 0 bytes)
View raw message