harmony-alerts mailing list archives

Site index · List index
Message view « Date » · « Thread »
Top « Date » · « Thread »
From nom...@intel.com
Subject [build-test alert] FAILED Linux x86_64: drlvm-reg-test debug
Date Sun, 19 Jul 2009 16:36:49 GMT

BUILD FAILED:
	Ant Error Message:
/home/laichunrong/harmony.regularcc/infra/scripts/cc-exec-adaptor.xml:68: The following error
occurred while executing this line: /home/laichunrong/harmony.regularcc/infra/adaptors/drlvm-reg-test/adaptor.xml:80:
There were drlvm-reg-test failures

Date of build:	2009-07-19 23:55:49 +0800
Time to build:	40 minutes 34 seconds
Last changed:	07/19/2009 23:12:45
Last log entry:	hdk

***********************************************************
Errors/Warnings:	(10)
            
[java] Java Result: 1
[java] Java Result: 1
[java] Java Result: 1
[junit] Test org.apache.harmony.drlvm.tests.regression.h5692.Test FAILED
BUILD FAILED
/home/laichunrong/harmony.regularcc/infra/build/checkouts/hdk/working_vm/build.xml:352: The
following error occurred while executing this line:
/home/laichunrong/harmony.regularcc/infra/build/checkouts/hdk/working_vm/make/tests/reg-test-run.xml:108:
There were test failures
Total time: 40 minutes 8 seconds
The execution FAILED with the following exception:
The following error occurred while executing this line:
/home/laichunrong/harmony.regularcc/infra/adaptors/drlvm-reg-test/adaptor.xml:80: There were
drlvm-reg-test failures

***********************************************************
Unit Tests: (191)
        
failure: testVerboseAll org.apache.harmony.drlvm.tests.regression.h5692.Test
Unit Test Error Details:	(1)
                
Test: testVerboseAllClass: org.apache.harmony.drlvm.tests.regression.h5692.Testjunit.framework.AssertionFailedError
	at org.apache.harmony.drlvm.tests.regression.h5692.Test.validateVerboseClass(Test.java:83)
	at org.apache.harmony.drlvm.tests.regression.h5692.Test.testVerboseAll(Test.java:90)
	at java.lang.reflect.VMReflection.invokeMethod(VMReflection.java)

***********************************************************
Modifications since last successful build:	(1)
            
add cc-hdk log20090719231245Lbuild.201 07/19/2009 23:12:45hdk


Mime
  • Unnamed multipart/mixed (inline, None, 0 bytes)
View raw message