harmony-alerts mailing list archives

Site index · List index
Message view « Date » · « Thread »
Top « Date » · « Thread »
From nom...@intel.com
Subject [build-test alert] FAILED Linux x86_64: drlvm-test debug
Date Fri, 10 Jul 2009 21:08:35 GMT

BUILD FAILED:
	Ant Error Message:
/home/laichunrong/harmony.regularcc/infra/scripts/cc-exec-adaptor.xml:68: The following error
occurred while executing this line: /home/laichunrong/harmony.regularcc/infra/adaptors/drlvm-test/adaptor.xml:81:
There were drlvm-test failures

Date of build:	2009-07-11 02:16:37 +0800
Time to build:	171 minutes 13 seconds
Last changed:	07/11/2009 01:53:25
Last log entry:	hdk

***********************************************************
Errors/Warnings:	(22)
            
[java] Java Result: 1
[java] Java Result: 1
[java] Java Result: 1
[java] Java Result: 130
[java] Java Result: 1
[java] Java Result: 1
[java] Java Result: 130
[java] Java Result: 1
[java] Java Result: 1
[java] Java Result: 130
[java] Java Result: 1
[java] Java Result: 1
[java] Java Result: 130
[java] Java Result: 1
[java] Java Result: 1
[java] Java Result: 130
[junit] Tests FAILED
BUILD FAILED
/home/laichunrong/harmony.regularcc/infra/build/checkouts/hdk/working_vm/build.xml:286: Some
tests failed
Total time: 170 minutes 39 seconds
The execution FAILED with the following exception:
The following error occurred while executing this line:
/home/laichunrong/harmony.regularcc/infra/adaptors/drlvm-test/adaptor.xml:81: There were drlvm-test
failures

***********************************************************
Unit Tests: (4187)
        
failure: testUncaughtExceptionHandler_Explicit java.lang.ThreadGroupTest
failure: Client mode JIT (default) io.Integers_jit
Unit Test Error Details:	(2)
                
Test: testUncaughtExceptionHandler_ExplicitClass: java.lang.ThreadGroupTestjunit.framework.AssertionFailedError:
Thread's uncaught exception handler wasn't called
	at junit.framework.Assert.fail(Assert.java:47)
	at junit.framework.Assert.assertTrue(Assert.java:20)
	at java.lang.ThreadGroupTest.testUncaughtExceptionHandler_Explicit(ThreadGroupTest.java:1079)
	at java.lang.reflect.VMReflection.invokeMethod(VMReflection.java)
	at java.lang.reflect.Method.invoke(Method.java:317)
	at junit.framework.TestCase.runTest(TestCase.java:168)
	at junit.framework.TestCase.runBare(TestCase.java:134)
	at junit.framework.TestResult$1.protect(TestResult.java:110)
	at junit.framework.TestResult.runProtected(TestResult.java:128)
	at junit.framework.TestResult.run(TestResult.java:113)
	at junit.framework.TestCase.run(TestCase.java:124)
	at junit.framework.TestSuite.runTest(TestSuite.java:232)
	at junit.framework.TestSuite.run(TestSuite.java:227)
	at org.apache.tools.ant.taskdefs.optional.junit.JUnitTestRunner.run(JUnitTestRunner.java:297)
	at org.apache.tools.ant.taskdefs.optional.junit.JUnitTestRunner.launch(JUnitTestRunner.java:672)
	at org.apache.tools.ant.taskdefs.optional.junit.JUnitTestRunner.main(JUnitTestRunner.java:546)
Test: Client mode JIT (default)Class: io.Integers_jitExit code: 1 Err: Uncaught exception
in main:
java.lang.ExceptionInInitializerError
	at com.ibm.icu.impl.Utility.unescapeAt(Utility.java:789)
	at com.ibm.icu.impl.RuleCharacterIterator.next(RuleCharacterIterator.java:164)
	at com.ibm.icu.text.UnicodeSet.applyPattern(UnicodeSet.java:2366)
	at com.ibm.icu.text.UnicodeSet.applyPattern(UnicodeSet.java:2259)
	at com.ibm.icu.text.UnicodeSet.<init>(UnicodeSet.java:366)
	at com.ibm.icu.text.DecimalFormat.<clinit>(DecimalFormat.java:1728)
	at com.ibm.icu.text.NumberFormat.createInstance(NumberFormat.java:1214)
	at com.ibm.icu.text.NumberFormatServiceShim$NFService$1RBNumberFormatFactory.handleCreate(NumberFormatServiceShim.java:108)
	at com.ibm.icu.impl.ICULocaleService$LocaleKeyFactory.create(ICULocaleService.java:378)
	at com.ibm.icu.impl.ICUService.getKey(ICUService.java:460)
	at com.ibm.icu.impl.ICUService.getKey(ICUService.java:380)
	at com.ibm.icu.impl.ICULocaleService.get(ICULocaleService.java:72)
	at com.ibm.icu.text.NumberFormatServiceShim.createInstance(NumberFormatServiceShim.java:90)
	at com.ibm.icu.text.NumberFormat.getInstance(NumberFormat.java:1197)
	at com.ibm.icu.text.NumberFormat.getInstance(NumberFormat.java:479)
	at com.ibm.icu.impl.ZoneMeta.parseCustomID(ZoneMeta.java:669)
	at com.ibm.icu.impl.ZoneMeta.getCustomTimeZone(ZoneMeta.java:617)
	at com.ibm.icu.util.TimeZone.getTimeZone(TimeZone.java:681)
	at com.ibm.icu.util.TimeZone.getTimeZone(TimeZone.java:647)
	at java.util.SimpleTimeZone$1.run(SimpleTimeZone.java:50)
	at java.util.SimpleTimeZone$1.run(SimpleTimeZone.java:1)
	at java.security.AccessController.doPrivilegedImpl(AccessController.java:171)
	at java.security.AccessController.doPrivileged(AccessController.java:53)
	at java.util.SimpleTimeZone.getICUTimeZone(SimpleTimeZone.java:48)
	at java.util.SimpleTimeZone.<init>(SimpleTimeZone.java:110)
	at java.util.TimeZone.getTimeZone(TimeZone.java:378)
	at java.util.TimeZone.setDefault(TimeZone.java:502)
	at java.util.TimeZone.getDefault(TimeZone.java:191)
	at java.util.GregorianCalendar.<init>(GregorianCalendar.java:343)
	at java.util.GregorianCalendar.<init>(GregorianCalendar.java:302)
	at java.util.Date.getYear(Date.java:342)
	at java.util.Date.<clinit>(Date.java:44)
	at com.ibm.icu.util.Calendar.<clinit>(Calendar.java:1226)
	at java.util.Calendar.<init>(Calendar.java:690)
	at java.util.GregorianCalendar.<init>(GregorianCalendar.java:338)
	at java.util.GregorianCalendar.<init>(GregorianCalendar.java:325)
	at org.apache.harmony.security.asn1.ASN1Time.getDecodedObject(ASN1Time.java:52)
	at org.apache.harmony.security.asn1.ASN1UTCTime.decode(ASN1UTCTime.java:97)
	at org.apache.harmony.security.asn1.ASN1Choice.decode(ASN1Choice.java:321)
	at org.apache.harmony.security.asn1.BerInputStream.readSequence(BerInputStream.java:666)
	at org.apache.harmony.security.asn1.DerInputStream.readSequence(DerInputStream.java:126)
	at org.apache.harmony.security.asn1.ASN1Sequence.decode(ASN1Sequence.java:49)
	at org.apache.harmony.security.asn1.BerInputStream.readSequence(BerInputStream.java:666)
	at org.apache.harmony.security.asn1.DerInputStream.readSequence(DerInputStream.java:126)
	at org.apache.harmony.security.asn1.ASN1Sequence.decode(ASN1Sequence.java:49)
	at org.apache.harmony.security.asn1.BerInputStream.readSequence(BerInputStream.java:666)
	at org.apache.harmony.security.asn1.DerInputStream.readSequence(DerInputStream.java:126)
	at org.apache.harmony.security.asn1.ASN1Sequence.decode(ASN1Sequence.java:49)
	at org.apache.harmony.security.asn1.BerInputStream.decodeValueCollection(BerInputStream.java:756)
	at org.apache.harmony.security.asn1.BerInputStream.readSetOf(BerInputStream.java:734)
	at org.apache.harmony.security.asn1.DerInputStream.readSetOf(DerInputStream.java:139)
	at org.apache.harmony.security.asn1.ASN1SetOf.decode(ASN1SetOf.java:49)
	at org.apache.harmony.security.asn1.ASN1Implicit.decode(ASN1Implicit.java:141)
	at org.apache.harmony.security.asn1.BerInputStream.readSequence(BerInputStream.java:666)
	at org.apache.harmony.security.asn1.DerInputStream.readSequence(DerInputStream.java:126)
	at org.apache.harmony.security.asn1.ASN1Sequence.decode(ASN1Sequence.java:49)
	at org.apache.harmony.security.asn1.ASN1Type.decode(ASN1Type.java:98)
	at org.apache.harmony.security.pkcs7.ContentInfo$1.getDecodedObject(ContentInfo.java:154)
	at org.apache.harmony.security.asn1.ASN1Sequence.decode(ASN1Sequence.java:54)
	at org.apache.harmony.security.utils.JarUtils.verifySignature(JarUtils.java:73)
	at java.util.jar.JarVerifier.verifyCertificate(JarVerifier.java:297)
	at java.util.jar.JarVerifier.readCertificates(JarVerifier.java:266)
	at java.util.jar.JarFile.getInputStream(JarFile.java:354)
	at java.net.URLClassLoader$URLJarHandler.createClass(URLClassLoader.java:402)
	at java.net.URLClassLoader$URLJarHandler.findClass(URLClassLoader.java:371)
	at java.net.URLClassLoader.findClassImpl(URLClassLoader.java:1216)
	at java.net.URLClassLoader$4.run(URLClassLoader.java:901)
	at java.net.URLClassLoader$4.run(URLClassLoader.java:1)
	at java.security.AccessController.doPrivilegedImpl(AccessController.java:171)
	at java.security.AccessController.doPrivileged(AccessController.java:64)
	at java.net.URLClassLoader.findClass(URLClassLoader.java:898)
	at java.lang.ClassLoader.loadClass(ClassLoader.java:489)
	at java.lang.ClassLoader$SystemClassLoader.loadClass(ClassLoader.java:871)
	at java.lang.ClassLoader.loadClass(ClassLoader.java:268)
	at java.lang.Class.forName(Class.java:130)
	at org.apache.harmony.security.fortress.Services.loadProviders(Services.java:85)
	at org.apache.harmony.security.fortress.Services.access$0(Services.java:75)
	at org.apache.harmony.security.fortress.Services$1.run(Services.java:68)
	at java.security.AccessController.doPrivilegedImpl(AccessController.java:171)
	at java.security.AccessController.doPrivileged(AccessController.java:53)
	at org.apache.harmony.security.fortress.Services.<clinit>(Services.java:66)
	at org.apache.harmony.security.fortress.Engine.getInstance(Engine.java:91)
	at java.security.MessageDigest.getInstance(MessageDigest.java:77)
	at java.io.ObjectStreamClass.computeSerialVersionUID(ObjectStreamClass.java:431)
	at java.io.ObjectStreamClass.createClassDesc(ObjectStreamClass.java:258)
	at java.io.ObjectStreamClass.lookupStreamClass(ObjectStreamClass.java:996)
	at java.io.ObjectOutputStream.writeObjectInternal(ObjectOutputStream.java:1692)
	at java.io.ObjectOutputStream.writeObject(ObjectOutputStream.java:1634)
	at java.io.ObjectOutputStream.writeObject(ObjectOutputStream.java:1598)
	at io.Integers.main(Integers.java:56)
Caused by: java.util.MissingResourceException
	at com.ibm.icu.lang.UCharacter.<clinit>(UCharacter.java:6204)
	at com.ibm.icu.impl.Utility.unescapeAt(Utility.java:789)
	... 89 more

***********************************************************
Modifications since last successful build:	(1)
            
add cc-hdk log20090711015325Lbuild.185 07/11/2009 01:53:25hdk


Mime
  • Unnamed multipart/mixed (inline, None, 0 bytes)
View raw message