harmony-alerts mailing list archives

Site index · List index
Message view « Date » · « Thread »
Top « Date » · « Thread »
From nom...@intel.com
Subject [build-test alert] FAILED Windows 2003 x86_64: drlvm-test debug
Date Tue, 12 May 2009 09:26:37 GMT

BUILD FAILED:
	Ant Error Message:
C:\harmony.cc\infra\scripts\cc-exec-adaptor.xml:68: The following error occurred while executing
this line: C:\harmony.cc\infra\adaptors\drlvm-test\adaptor.xml:81: There were drlvm-test failures

Date of build:	2009-05-11 21:19:57 -0700
Time to build:	306 minutes 31 seconds
Last changed:	05/11/2009 17:45:09
Last log entry:	hdk

***********************************************************
Errors/Warnings:	(35)
            
[cc] cl : Command line warning D9035 : option 'GZ' has been deprecated and will be removed
in a future release
[cc] cl : Command line warning D9036 : use 'RTC1' instead of 'GZ'
[cc] cl : Command line warning D9035 : option 'GZ' has been deprecated and will be removed
in a future release
[cc] cl : Command line warning D9036 : use 'RTC1' instead of 'GZ'
[cc] cl : Command line warning D9035 : option 'GZ' has been deprecated and will be removed
in a future release
[cc] cl : Command line warning D9036 : use 'RTC1' instead of 'GZ'
[cc] cl : Command line warning D9035 : option 'GZ' has been deprecated and will be removed
in a future release
[cc] cl : Command line warning D9036 : use 'RTC1' instead of 'GZ'
[cc] cl : Command line warning D9035 : option 'GZ' has been deprecated and will be removed
in a future release
[cc] cl : Command line warning D9036 : use 'RTC1' instead of 'GZ'
[cc] cl : Command line warning D9035 : option 'GZ' has been deprecated and will be removed
in a future release
[cc] cl : Command line warning D9036 : use 'RTC1' instead of 'GZ'
[cc] cl : Command line warning D9035 : option 'GZ' has been deprecated and will be removed
in a future release
[cc] cl : Command line warning D9036 : use 'RTC1' instead of 'GZ'
[java] Java Result: 1
[java] Java Result: 1
[java] Java Result: 130
[java] Java Result: 1
[java] Java Result: 1
[java] Java Result: 130
[java] Java Result: 1
[java] Java Result: 1
[java] Java Result: 130
[java] Java Result: 1
[java] Java Result: 1
[java] Java Result: 130
[java] Java Result: 1
[java] Java Result: 1
[java] Java Result: 130
[junit] Tests FAILED (timeout)
BUILD FAILED
C:\harmony.cc\infra\build\checkouts\hdk\working_vm\build.xml:286: Some tests failed
Total time: 306 minutes 10 seconds
The execution FAILED with the following exception:
The following error occurred while executing this line:
C:\harmony.cc\infra\adaptors\drlvm-test\adaptor.xml:81: There were drlvm-test failures

***********************************************************
Unit Tests: (4334)
        
All Tests Passed

***********************************************************
Modifications since last successful build:	(1)
            
add cc-hdk log20090511174509Lbuild.200 05/11/2009 17:45:09hdk


Mime
  • Unnamed multipart/mixed (inline, None, 0 bytes)
View raw message