harmony-alerts mailing list archives

Site index · List index
Message view « Date » · « Thread »
Top « Date » · « Thread »
From nom...@intel.com
Subject [build-test alert] FAILED Linux x86: drlvm-reg-test debug
Date Fri, 15 May 2009 16:37:26 GMT

BUILD FAILED:
	Ant Error Message:
/home/laichunrong/harmony.regularcc/infra/scripts/cc-exec-adaptor.xml:68: The following error
occurred while executing this line: /home/laichunrong/harmony.regularcc/infra/adaptors/drlvm-reg-test/adaptor.xml:80:
There were drlvm-reg-test failures

Date of build:	2009-05-16 00:06:15 +0800
Time to build:	31 minutes 8 seconds
Last changed:	05/15/2009 21:10:18
Last log entry:	hdk

***********************************************************
Errors/Warnings:	(10)
            
[java] Java Result: 1
[java] Java Result: 1
[java] Java Result: 1
[junit] Test org.apache.harmony.drlvm.tests.regression.h5480.LooseMathTest FAILED
BUILD FAILED
/home/laichunrong/harmony.regularcc/infra/build/checkouts/hdk/working_vm/build.xml:352: The
following error occurred while executing this line:
/home/laichunrong/harmony.regularcc/infra/build/checkouts/hdk/working_vm/make/tests/reg-test-run.xml:108:
There were test failures
Total time: 30 minutes 53 seconds
The execution FAILED with the following exception:
The following error occurred while executing this line:
/home/laichunrong/harmony.regularcc/infra/adaptors/drlvm-reg-test/adaptor.xml:80: There were
drlvm-reg-test failures

***********************************************************
Unit Tests: (199)
        
failure: testTAN org.apache.harmony.drlvm.tests.regression.h5480.LooseMathTest
Unit Test Error Details:	(1)
                
Test: testTANClass: org.apache.harmony.drlvm.tests.regression.h5480.LooseMathTestjunit.framework.AssertionFailedError:
d=-4.0089754997743976E8 ulp=1.0E-9 expected:<68.01900255482> but was:<68.0190025524316>
	at org.apache.harmony.drlvm.tests.regression.h5480.LooseMathTest.testTAN(LooseMathTest.java:79)
	at java.lang.reflect.VMReflection.invokeMethod(VMReflection.java)

***********************************************************
Modifications since last successful build:	(1)
            
add cc-hdk log20090515211018Lbuild.370 05/15/2009 21:10:18hdk


Mime
  • Unnamed multipart/mixed (inline, None, 0 bytes)
View raw message