harmony-alerts mailing list archives

Site index · List index
Message view « Date » · « Thread »
Top « Date » · « Thread »
From nom...@intel.com
Subject [build-test alert] FAILED Windows 2003 x86_64: hdk debug
Date Fri, 10 Apr 2009 00:05:12 GMT

BUILD FAILED:
	Ant Error Message:
C:\harmony.cc\infra\scripts\cc-exec-adaptor.xml:68: The following error occurred while executing
this line: C:\harmony.cc\infra\adaptors\hdk\adaptor.xml:39: The following error occurred while
executing this line: C:\harmony.cc\infra\scripts\framework.xml:163: Java returned: 1

Date of build:	2009-04-09 16:58:05 -0700
Time to build:	5 minutes 31 seconds
Last changed:	04/09/2009 02:16:54
Last log entry:	Pack200 - minor bug fixes

***********************************************************
Errors/Warnings:	(9)
            
BUILD FAILED
C:\harmony.cc\infra\build\checkouts\hdk\build.xml:401: The following error occurred while
executing this line:
C:\harmony.cc\infra\build\checkouts\hdk\working_classlib\build.xml:118: The following error
occurred while executing this line:
C:\harmony.cc\infra\build\checkouts\hdk\working_classlib\make\build-java.xml:181: The following
error occurred while executing this line:
C:\harmony.cc\infra\build\checkouts\hdk\working_classlib\make\properties.xml:498: The following
error occurred while executing this line:
C:\harmony.cc\infra\build\checkouts\hdk\working_classlib\make\properties.xml:510: The following
error occurred while executing this line:
C:\harmony.cc\infra\build\checkouts\hdk\working_classlib\modules\pack200\build.xml:106: Compile
failed; see the compiler error output for details.
Total time: 4 minutes 21 seconds
The execution FAILED with the following exception:
The following error occurred while executing this line:
C:\harmony.cc\infra\adaptors\hdk\adaptor.xml:39: The following error occurred while executing
this line:
C:\harmony.cc\infra\scripts\framework.xml:163: Java returned: 1

***********************************************************
Unit Tests: (0)
        
No Tests Run: This project doesn't have any tests

***********************************************************
Modifications since last successful build:	(4)
            
modified sjanuary  /harmony/enhanced/classlib/trunk/modules/pack200/src/main/java/org/apache/harmony/pack200/CpBands.java
04/09/2009 02:16:54 Pack200 - minor bug fixes
modified sjanuary  /harmony/enhanced/classlib/trunk/modules/pack200/src/main/java/org/apache/harmony/pack200/ClassBands.java
04/09/2009 02:16:54 Pack200 - minor bug fixes
modified sjanuary  /harmony/enhanced/classlib/trunk/modules/pack200/src/main/java/org/apache/harmony/pack200/Segment.java
04/09/2009 02:16:54 Pack200 - minor bug fixes
modified sjanuary  /harmony/enhanced/classlib/trunk/modules/pack200/src/main/java/org/apache/harmony/pack200/BcBands.java
04/09/2009 02:15:07 Pack200 - some cleanup and minor bug fixes in code for packing bytecode


Mime
  • Unnamed multipart/mixed (inline, None, 0 bytes)
View raw message