harmony-alerts mailing list archives

Site index · List index
Message view « Date » · « Thread »
Top « Date » · « Thread »
From nom...@intel.com
Subject [build-test alert] FAILED Windows 2003 x86_64: classlib-test debug
Date Sat, 25 Apr 2009 15:12:12 GMT

BUILD FAILED:
	Ant Error Message:
C:\harmony.cc\infra\scripts\cc-exec-adaptor.xml:68: The following error occurred while executing
this line: C:\harmony.cc\infra\adaptors\classlib-test\adaptor.xml:93: There were CLASSLIB
Unit Test failures.

Date of build:	2009-04-25 06:55:45 -0700
Time to build:	76 minutes 10 seconds
Last changed:	04/25/2009 03:25:51
Last log entry:	hdk

***********************************************************
Errors/Warnings:	(45)
            
Checking depends/jars/yoko-1.0/yoko.jar
Checksum verified (true)
Checking depends/jars/yoko-1.0/yoko-core.jar
Checksum verified (true)
Checking depends/jars/yoko-1.0/yoko-rmi-impl.jar
Checksum verified (true)
Checking depends/jars/yoko-1.0/yoko-rmi-spec.jar
Checksum verified (true)
Checking depends/jars/bcel-5.2/bcel-5.2.jar
Checksum verified (true)
Checking depends/jars/xalan-j_2.7.0/xalan.jar
Checksum verified (true)
Checking depends/jars/xerces_2.9.1/xerces.zip
Checksum verified (true)
Checking depends/jars/junit_4.4/junit.jar
Checksum verified (true)
Checking depends/jars/bcprov-jdk15-141/bcprov.jar
Checksum verified (true)
Checking depends/jars/mx4j_3.0.2/mx4j.zip
Checksum verified (true)
Checking depends/jars/jetty/jetty-6.0.0.jar
Checksum verified (true)
Checking depends/jars/jetty/jetty-util-6.0.0.jar
Checksum verified (true)
Checking depends/jars/jetty/servlet-api-2.5-6.0.0.jar
Checksum verified (true)
Checking depends/dejavu-fonts/dejavu-ttf-2.18-1.zip
Checksum verified (true)
Checking depends/jars/derby-10.3.1.4/derby.jar
Checksum verified (true)
Checking depends/jars/asm-3.1/asm-3.1.jar
Checksum verified (true)
Checking depends/libs/windows.x86_64/msvcr80.dll
Checksum verified (true)
Checking depends/libs/windows.x86_64/msvcp80.dll
Checksum verified (true)
Checking depends/libs/windows.x86_64/swing_awt_deps_win64_2007-02-08.tgz
Checksum verified (true)
[junit] Tests FAILED
BUILD FAILED
C:\harmony.cc\infra\build\checkouts\hdk\working_classlib\build.xml:174: The following error
occurred while executing this line:
C:\harmony.cc\infra\build\checkouts\hdk\working_classlib\make\build-test.xml:139: There were
test errors.
Total time: 69 minutes 25 seconds
The execution FAILED with the following exception:
The following error occurred while executing this line:
C:\harmony.cc\infra\adaptors\classlib-test\adaptor.xml:93: There were CLASSLIB Unit Test failures.

***********************************************************
Unit Tests: (17051)
        
Unit Test Error Details:	(1)
                

***********************************************************
Modifications since last successful build:	(1)
            
add cc-hdk log20090425032551Lbuild.198 04/25/2009 03:25:51hdk


Mime
  • Unnamed multipart/mixed (inline, None, 0 bytes)
View raw message