harmony-alerts mailing list archives

Site index · List index
Message view « Date » · « Thread »
Top « Date » · « Thread »
From Apache Hudson Server <hud...@hudson.zones.apache.org>
Subject Build failed in Hudson: Harmony-1.5-head-linux-x86_64 #48
Date Thu, 09 Apr 2009 10:18:48 GMT
See http://hudson.zones.apache.org/hudson/job/Harmony-1.5-head-linux-x86_64/48/changes

Changes:

[sjanuary] Pack200 - use extra argument for Archive constructor

[sjanuary] Remove System.out usage from a test

[sjanuary] Pack200 - new test resources

[sjanuary] Pack200 - test for a large class and two tests for zero effort pack

[sjanuary] Pack200 - add support for zero effort pack

[sjanuary] Pack200 - minor bug fixes

[sjanuary] Pack200 - some cleanup and minor bug fixes in code for packing bytecode

------------------------------------------
[...truncated 3911 lines...]
     [copy] Copying 1 file to http://hudson.zones.apache.org/hudson/job/Harmony-1.5-head-linux-x86_64/ws/harmony/working_jdktools/deploy/jdk/bin

     [copy] Copying 1 file to http://hudson.zones.apache.org/hudson/job/Harmony-1.5-head-linux-x86_64/ws/harmony/working_jdktools/deploy/jdk/bin

     [copy] Copying 1 file to http://hudson.zones.apache.org/hudson/job/Harmony-1.5-head-linux-x86_64/ws/harmony/working_jdktools/deploy/jdk/bin

     [copy] Copying 1 file to http://hudson.zones.apache.org/hudson/job/Harmony-1.5-head-linux-x86_64/ws/harmony/working_jdktools/deploy/jdk/bin

     [copy] Copying 1 file to http://hudson.zones.apache.org/hudson/job/Harmony-1.5-head-linux-x86_64/ws/harmony/working_jdktools/deploy/jdk/bin

     [copy] Copying 1 file to http://hudson.zones.apache.org/hudson/job/Harmony-1.5-head-linux-x86_64/ws/harmony/working_jdktools/deploy/jdk/bin

     [copy] Copying 1 file to http://hudson.zones.apache.org/hudson/job/Harmony-1.5-head-linux-x86_64/ws/harmony/working_jdktools/deploy/jdk/bin

     [copy] Copying 1 file to http://hudson.zones.apache.org/hudson/job/Harmony-1.5-head-linux-x86_64/ws/harmony/working_jdktools/deploy/jdk/bin

     [copy] Copying 1 file to http://hudson.zones.apache.org/hudson/job/Harmony-1.5-head-linux-x86_64/ws/harmony/working_jdktools/deploy/jdk/jre/bin

     [copy] Copying 1 file to http://hudson.zones.apache.org/hudson/job/Harmony-1.5-head-linux-x86_64/ws/harmony/working_jdktools/deploy/jdk/jre/bin

     [copy] Copying 1 file to http://hudson.zones.apache.org/hudson/job/Harmony-1.5-head-linux-x86_64/ws/harmony/working_jdktools/deploy/jdk/jre/bin

     [copy] Copying 1 file to http://hudson.zones.apache.org/hudson/job/Harmony-1.5-head-linux-x86_64/ws/harmony/working_jdktools/deploy/jdk/jre/bin


-copy-native-exe-windows:

-copy-native-progdb:

-copy-native-data:
     [copy] Copying 3 files to http://hudson.zones.apache.org/hudson/job/Harmony-1.5-head-linux-x86_64/ws/harmony/working_jdktools/deploy/jdk/bin/data


build-native:

build:

build:

assemble-stuff:
    [mkdir] Created dir: http://hudson.zones.apache.org/hudson/job/Harmony-1.5-head-linux-x86_64/ws/harmony/target/hdk

     [copy] Copying 60 files to http://hudson.zones.apache.org/hudson/job/Harmony-1.5-head-linux-x86_64/ws/harmony/target/hdk

     [copy] Copied 10 empty directories to 2 empty directories under http://hudson.zones.apache.org/hudson/job/Harmony-1.5-head-linux-x86_64/ws/harmony/target/hdk

     [copy] Copying 326 files to http://hudson.zones.apache.org/hudson/job/Harmony-1.5-head-linux-x86_64/ws/harmony/target/hdk

     [copy] Copying 28 files to http://hudson.zones.apache.org/hudson/job/Harmony-1.5-head-linux-x86_64/ws/harmony/target/hdk/jdk


chmod-stuff:

assemble-artifacts:

build:

assemble-hdk-doc:
     [copy] Copying 2 files to http://hudson.zones.apache.org/hudson/job/Harmony-1.5-head-linux-x86_64/ws/harmony/target/hdk


bundle-hdk-tgz:
      [tar] Building tar: http://hudson.zones.apache.org/hudson/job/Harmony-1.5-head-linux-x86_64/48/artifact/harmony/target/apache-harmony-hdk-r763582-linux-x86_64-64-snapshot.tar.gz


bundle-hdk-zip:

bundle-hdk:

assemble-jdk-doc:
     [copy] Copying 4 files to http://hudson.zones.apache.org/hudson/job/Harmony-1.5-head-linux-x86_64/ws/harmony/target/hdk/jdk


bundle-jdk-tgz:
      [tar] Building tar: http://hudson.zones.apache.org/hudson/job/Harmony-1.5-head-linux-x86_64/48/artifact/harmony/target/apache-harmony-jdk-r763582-linux-x86_64-64-snapshot.tar.gz


bundle-jdk-zip:

bundle-jdk:

assemble-jre-doc:
     [copy] Copying 4 files to http://hudson.zones.apache.org/hudson/job/Harmony-1.5-head-linux-x86_64/ws/harmony/target/hdk/jdk/jre


bundle-jre-tgz:
      [tar] Building tar: http://hudson.zones.apache.org/hudson/job/Harmony-1.5-head-linux-x86_64/48/artifact/harmony/target/apache-harmony-jre-r763582-linux-x86_64-64-snapshot.tar.gz


bundle-jre-zip:

bundle-jre:

snapshot:

BUILD SUCCESSFUL
Total time: 12 minutes 47 seconds
[working_classlib] $ ant -file build.xml -Dbuild.module=pack200 -Duse.libstdc++6=true -Dtest.jre.home=$WORKSPACE/harmony/target/hdk/jdk/jre
test
Buildfile: build.xml

-init-hdk:

test:
     [echo] 
     [echo] ========================================
     [echo] Testing class libraries...
     [echo] ========================================

clean-test-output:
   [delete] Deleting directory http://hudson.zones.apache.org/hudson/job/Harmony-1.5-head-linux-x86_64/ws/harmony/working_classlib/build/test_report


copy-test-resources:

check-support-jars:

-check:
     [echo] Checking for depends/jars/yoko-1.0/yoko.jar
     [echo] Checking for depends/jars/yoko-1.0/yoko-core.jar
     [echo] Checking for depends/jars/yoko-1.0/yoko-rmi-impl.jar
     [echo] Checking for depends/jars/yoko-1.0/yoko-rmi-spec.jar
     [echo] Checking for depends/jars/bcel-5.2/bcel-5.2.jar
     [echo] Checking for depends/jars/xalan-j_2.7.0/xalan.jar
     [echo] Checking for depends/jars/xerces_2.9.1/xerces.zip
     [echo] Checking for depends/jars/junit_4.4/junit.jar
     [echo] Checking for depends/jars/bcprov-jdk15-141/bcprov.jar
     [echo] Checking for depends/jars/mx4j_3.0.2/mx4j.zip
     [echo] Checking for depends/jars/jetty/jetty-6.0.0.jar
     [echo] Checking for depends/jars/jetty/jetty-util-6.0.0.jar
     [echo] Checking for depends/jars/jetty/servlet-api-2.5-6.0.0.jar
     [echo] Checking for depends/dejavu-fonts/dejavu-ttf-2.18-1.zip
     [echo] Checking for depends/jars/derby-10.3.1.4/derby.jar
     [echo] Checking for depends/jars/asm-3.1/asm-3.1.jar

-really-check-win:

-check-win:

-check-unix:
     [echo] Checking for system file /usr/include/lcms.h
     [echo] Checking for system file /usr/include/png.h
     [echo] Checking for system file /usr/include/jconfig.h

-extract-props:

-extract-mx4j:

-extract-dejavu-fonts:

-extract-xerces:

-extract:

check:

compile-support:

support-jar:

-get-test-vm-output:

test-jre-vm-info:
     [echo] hy.test.vm.name = drl

test-modules:
     [echo] polling pack200/*.xml

compile-java:
     [echo] Compiling PACK200 classes

copy-resources:

svn-info:

build-jar:
      [jar] Building jar: http://hudson.zones.apache.org/hudson/job/Harmony-1.5-head-linux-x86_64/ws/harmony/working_classlib/deploy/jdk/jre/lib/boot/pack200-src.jar


build:

copy-test-resources:
    [mkdir] Created dir: http://hudson.zones.apache.org/hudson/job/Harmony-1.5-head-linux-x86_64/ws/harmony/working_classlib/modules/pack200/bin/test

     [copy] Copying 21 files to http://hudson.zones.apache.org/hudson/job/Harmony-1.5-head-linux-x86_64/ws/harmony/working_classlib/modules/pack200/bin/test


compile-tests:
     [echo] Compiling PACK200 tests
    [javac] Compiling 25 source files to http://hudson.zones.apache.org/hudson/job/Harmony-1.5-head-linux-x86_64/ws/harmony/working_classlib/modules/pack200/bin/test

    [javac] Since fork is false, ignoring memoryMaximumSize setting

prepare-exclude:

run-tests:
    [mkdir] Created dir: http://hudson.zones.apache.org/hudson/job/Harmony-1.5-head-linux-x86_64/ws/harmony/working_classlib/build/test_report

     [echo] Running PACK200 tests
    [junit] Running org.apache.harmony.pack200.tests.ArchiveTest
    [junit] Tests run: 10, Failures: 0, Errors: 1, Time elapsed: 4.751 sec
    [junit] TEST org.apache.harmony.pack200.tests.ArchiveTest FAILED
    [junit] Running org.apache.harmony.pack200.tests.BHSDCodecTest
    [junit] Tests run: 2, Failures: 0, Errors: 0, Time elapsed: 0.444 sec
    [junit] Running org.apache.harmony.pack200.tests.CodecEncodingTest
    [junit] Tests run: 2, Failures: 0, Errors: 0, Time elapsed: 0.008 sec
    [junit] Running org.apache.harmony.pack200.tests.CodecTest
    [junit] Tests run: 9, Failures: 0, Errors: 0, Time elapsed: 0.016 sec
    [junit] Running org.apache.harmony.pack200.tests.PopulationCodecTest
    [junit] Tests run: 1, Failures: 0, Errors: 0, Time elapsed: 0.007 sec
    [junit] Running org.apache.harmony.unpack200.tests.ArchiveTest
    [junit] Tests run: 9, Failures: 0, Errors: 0, Time elapsed: 0.673 sec
    [junit] Running org.apache.harmony.unpack200.tests.AttributeLayoutMapTest
    [junit] Tests run: 1, Failures: 0, Errors: 0, Time elapsed: 0.431 sec
    [junit] Running org.apache.harmony.unpack200.tests.AttributeLayoutTest
    [junit] Tests run: 6, Failures: 0, Errors: 0, Time elapsed: 0.01 sec
    [junit] Running org.apache.harmony.unpack200.tests.BandSetTest
    [junit] Tests run: 8, Failures: 0, Errors: 0, Time elapsed: 0.027 sec
    [junit] Running org.apache.harmony.unpack200.tests.BcBandsTest
    [junit] Tests run: 25, Failures: 0, Errors: 0, Time elapsed: 0.476 sec
    [junit] Running org.apache.harmony.unpack200.tests.CPUTF8Test
    [junit] Tests run: 1, Failures: 0, Errors: 0, Time elapsed: 0.005 sec
    [junit] Running org.apache.harmony.unpack200.tests.ClassBandsTest
    [junit] Tests run: 2, Failures: 0, Errors: 0, Time elapsed: 0.008 sec
    [junit] Running org.apache.harmony.unpack200.tests.ClassVersionTest
    [junit] Tests run: 3, Failures: 0, Errors: 0, Time elapsed: 0.007 sec
    [junit] Running org.apache.harmony.unpack200.tests.CodeAttributeTest
    [junit] Tests run: 3, Failures: 0, Errors: 0, Time elapsed: 0.008 sec
    [junit] Running org.apache.harmony.unpack200.tests.ICTupleTest
    [junit] Tests run: 2, Failures: 0, Errors: 0, Time elapsed: 0.006 sec
    [junit] Running org.apache.harmony.unpack200.tests.SegmentConstantPoolArrayCacheTest
    [junit] Tests run: 3, Failures: 0, Errors: 0, Time elapsed: 0.006 sec
    [junit] Running org.apache.harmony.unpack200.tests.SegmentConstantPoolTest
    [junit] Tests run: 3, Failures: 0, Errors: 0, Time elapsed: 0.006 sec
    [junit] Running org.apache.harmony.unpack200.tests.SegmentOptionsTest
    [junit] Tests run: 1, Failures: 0, Errors: 0, Time elapsed: 0.005 sec
    [junit] Running org.apache.harmony.unpack200.tests.SegmentTest
    [junit] Tests run: 3, Failures: 0, Errors: 0, Time elapsed: 0.44 sec
    [junit] Running org.apache.harmony.unpack200.tests.SegmentUtilsTest
    [junit] Tests run: 3, Failures: 0, Errors: 0, Time elapsed: 0.006 sec
    [junit] Running org.apache.harmony.unpack200.tests.bytecode.ByteCodeTest
    [junit] Tests run: 1, Failures: 0, Errors: 0, Time elapsed: 0.004 sec
    [junit] Running org.apache.harmony.unpack200.tests.bytecode.ClassFileEntryTest
    [junit] Tests run: 8, Failures: 0, Errors: 0, Time elapsed: 0.01 sec
    [junit] Running org.apache.harmony.unpack200.tests.bytecode.ConstantPoolTest
    [junit] Tests run: 4, Failures: 0, Errors: 0, Time elapsed: 0.007 sec
    [junit] Tests FAILED

touch-failures-file:

touch-errors-file:

-test-module:

-check-for-empty:

-process-empty:

process-empty:

full-report:
[junitreport] Processing http://hudson.zones.apache.org/hudson/job/Harmony-1.5-head-linux-x86_64/ws/harmony/working_classlib/build/test_report/TESTS-TestSuites.xml
 to /tmp/null1372369324
[junitreport] Loading stylesheet jar:file:/usr/share/ant/lib/ant-junit.jar!/org/apache/tools/ant/taskdefs/optional/junit/xsl/junit-frames.xsl
[junitreport] Transform time: 3141ms
[junitreport] Deleting: /tmp/null1372369324
     [echo] The test report is in http://hudson.zones.apache.org/hudson/job/Harmony-1.5-head-linux-x86_64/ws/harmony/working_classlib/build/test_report/html/index.html


short-report:

gen-report:

check-test-result:

BUILD FAILED
http://hudson.zones.apache.org/hudson/job/Harmony-1.5-head-linux-x86_64/ws/harmony/working_classlib/build.xml
:174: The following error occurred while executing this line:
http://hudson.zones.apache.org/hudson/job/Harmony-1.5-head-linux-x86_64/ws/harmony/working_classlib/make/build-test.xml
:139: There were test errors.

Total time: 16 seconds
Recording fingerprints
Recording test results


Mime
View raw message