harmony-alerts mailing list archives

Site index · List index
Message view « Date » · « Thread »
Top « Date » · « Thread »
From nom...@intel.com
Subject [build-test alert] FAILED Windows 2003 x86_64: jdktools-test debug
Date Sat, 18 Apr 2009 08:38:05 GMT

BUILD FAILED:
	Ant Error Message:
C:\harmony.cc\infra\scripts\cc-exec-adaptor.xml:68: The following error occurred while executing
this line: C:\harmony.cc\infra\adaptors\jdktools-test\adaptor.xml:50: The following error
occurred while executing this line: C:\harmony.cc\infra\scripts\framework.xml:163: Java returned:
1

Date of build:	2009-04-17 23:25:28 -0700
Time to build:	132 minutes 31 seconds
Last changed:	04/17/2009 16:13:38
Last log entry:	hdk

***********************************************************
Errors/Warnings:	(7)
            
[junit] Tests FAILED (timeout)
[exec] Result: 1
BUILD FAILED
C:\harmony.cc\infra\build\checkouts\hdk\working_jdktools\build.xml:160: The following error
occurred while executing this line:
C:\harmony.cc\infra\build\checkouts\hdk\working_jdktools\make\build-test.xml:93: There were
test errors.
Total time: 131 minutes 51 seconds
The execution FAILED with the following exception:
The following error occurred while executing this line:
C:\harmony.cc\infra\adaptors\jdktools-test\adaptor.xml:50: The following error occurred while
executing this line:
C:\harmony.cc\infra\scripts\framework.xml:163: Java returned: 1

***********************************************************
Unit Tests: (160)
        
error: org.apache.harmony.jretools.tests.keytool.GenKeyTest vmcrash.CrashedTests
Unit Test Error Details:	(1)
                
Test: org.apache.harmony.jretools.tests.keytool.GenKeyTestClass: vmcrash.CrashedTests

***********************************************************
Modifications since last successful build:	(1)
            
add cc-hdk log20090417161338Lbuild.191 04/17/2009 16:13:38hdk


Mime
  • Unnamed multipart/mixed (inline, None, 0 bytes)
View raw message