harmony-alerts mailing list archives

Site index · List index
Message view « Date » · « Thread »
Top « Date » · « Thread »
From nom...@intel.com
Subject [build-test alert] FAILED Linux x86: ehwa-api debug
Date Sun, 12 Apr 2009 20:14:54 GMT

BUILD FAILED:
	Ant Error Message:
/home/laichunrong/harmony.regularcc/infra/scripts/cc-exec-adaptor.xml:68: The following error
occurred while executing this line: /home/laichunrong/harmony.regularcc/infra/adaptors/ehwa-api/adaptor.xml:98:
The following error occurred while executing this line: /home/laichunrong/harmony.regularcc/infra/scripts/framework.xml:163:
Java returned: 1

Date of build:	2009-04-13 03:52:09 +0800
Time to build:	22 minutes 16 seconds
Last changed:	04/13/2009 03:13:34
Last log entry:	hdk

***********************************************************
Errors/Warnings:	(5)
            
[java] Java Result: 139
BUILD FAILED
/home/laichunrong/harmony.regularcc/infra/build/checkouts/ehwa-api/tests/ehwa-test.xml:100:
Eclipse HelloWorld scenario FAILED
Total time: 22 minutes 13 seconds
The execution FAILED with the following exception:
The following error occurred while executing this line:
/home/laichunrong/harmony.regularcc/infra/adaptors/ehwa-api/adaptor.xml:98: The following
error occurred while executing this line:
/home/laichunrong/harmony.regularcc/infra/scripts/framework.xml:163: Java returned: 1

***********************************************************
Unit Tests: (0)
        
No Tests Run: This project doesn't have any tests

***********************************************************
Modifications since last successful build:	(1)
            
add cc-hdk log20090413031334Lbuild.332 04/13/2009 03:13:34hdk


Mime
  • Unnamed multipart/mixed (inline, None, 0 bytes)
View raw message