harmony-alerts mailing list archives

Site index · List index
Message view « Date » · « Thread »
Top « Date » · « Thread »
From Apache Hudson Server <hud...@hudson.zones.apache.org>
Subject Build failed in Hudson: Harmony-1.5-head-linux-x86_64 #102
Date Sat, 25 Apr 2009 17:18:17 GMT
See http://hudson.zones.apache.org/hudson/job/Harmony-1.5-head-linux-x86_64/102/changes

Changes:

[egor] nuked the ancient ABCD implementation

------------------------------------------
[...truncated 3423 lines...]
    [mkdir] Created dir: http://hudson.zones.apache.org/hudson/job/Harmony-1.5-head-linux-x86_64/ws/harmony/working_vm/build/linux_x86_64_gcc_release/semis/port_ch/bin

    [mkdir] Created dir: http://hudson.zones.apache.org/hudson/job/Harmony-1.5-head-linux-x86_64/ws/harmony/working_vm/build/linux_x86_64_gcc_release/semis/port_ch/obj

[compile-cc] 18 total files to be compiled.
[compile-cc] http://hudson.zones.apache.org/hudson/job/Harmony-1.5-head-linux-x86_64/ws/harmony/working_vm/vm/port/src/crash_handler/stack_dump.cpp
: In function ?void sd_print_vm_line(FILE*, int, Registers*, port_stack_frame_info*)?:
[compile-cc] http://hudson.zones.apache.org/hudson/job/Harmony-1.5-head-linux-x86_64/ws/harmony/working_vm/vm/port/src/crash_handler/stack_dump.cpp
:76: warning: format ?%016llx? expects type ?long long unsigned int?, but argument 3 has type
?void*?
[compile-cc] http://hudson.zones.apache.org/hudson/job/Harmony-1.5-head-linux-x86_64/ws/harmony/working_vm/vm/port/src/crash_handler/stack_dump.cpp
: In function ?void sd_print_c_line(FILE*, int, Registers*, CFunInfo*)?:
[compile-cc] http://hudson.zones.apache.org/hudson/job/Harmony-1.5-head-linux-x86_64/ws/harmony/working_vm/vm/port/src/crash_handler/stack_dump.cpp
:113: warning: format ?%016llx? expects type ?long long unsigned int?, but argument 4 has
type ?void*?
[compile-cc] http://hudson.zones.apache.org/hudson/job/Harmony-1.5-head-linux-x86_64/ws/harmony/working_vm/vm/port/src/crash_handler/linux/stack_dump_os.cpp
: In function ?void sd_get_c_method_info(CFunInfo*, native_module_t*, void*)?:
[compile-cc] http://hudson.zones.apache.org/hudson/job/Harmony-1.5-head-linux-x86_64/ws/harmony/working_vm/vm/port/src/crash_handler/linux/stack_dump_os.cpp
:75: warning: ignoring return value of ?int pipe(int*)?, declared with attribute warn_unused_result
[compile-cc] http://hudson.zones.apache.org/hudson/job/Harmony-1.5-head-linux-x86_64/ws/harmony/working_vm/vm/port/src/crash_handler/linux/stack_dump_os.cpp
: In function ?void sd_init_crash_handler()?:
[compile-cc] http://hudson.zones.apache.org/hudson/job/Harmony-1.5-head-linux-x86_64/ws/harmony/working_vm/vm/port/src/crash_handler/linux/stack_dump_os.cpp
:177: warning: ignoring return value of ?ssize_t read(int, void*, size_t)?, declared with
attribute warn_unused_result
[compile-cc] http://hudson.zones.apache.org/hudson/job/Harmony-1.5-head-linux-x86_64/ws/harmony/working_vm/vm/port/src/modules/linux/native_modules_os.c
: In function ?port_get_all_modules?:
[compile-cc] http://hudson.zones.apache.org/hudson/job/Harmony-1.5-head-linux-x86_64/ws/harmony/working_vm/vm/port/src/modules/linux/native_modules_os.c
:161: warning: use of assignment suppression and length modifier together in scanf format
[compile-cc] http://hudson.zones.apache.org/hudson/job/Harmony-1.5-head-linux-x86_64/ws/harmony/working_vm/vm/port/src/modules/native_modules.c
: In function ?port_dump_modules?:
[compile-cc] http://hudson.zones.apache.org/hudson/job/Harmony-1.5-head-linux-x86_64/ws/harmony/working_vm/vm/port/src/modules/native_modules.c
:62: warning: format ?%016llx? expects type ?long long unsigned int?, but argument 3 has type
?size_t?
[compile-cc] http://hudson.zones.apache.org/hudson/job/Harmony-1.5-head-linux-x86_64/ws/harmony/working_vm/vm/port/src/modules/native_modules.c
:62: warning: format ?%016llx? expects type ?long long unsigned int?, but argument 4 has type
?size_t?
       [cc] 0 total files to be compiled.
       [cc] Starting link
     [copy] Copying 1 file to http://hudson.zones.apache.org/hudson/job/Harmony-1.5-head-linux-x86_64/ws/harmony/working_vm/build/linux_x86_64_gcc_release/deploy/jdk/jre/bin/default


hythr:

-plugin-cpptasks:
     [echo] Checking for http://hudson.zones.apache.org/hudson/job/Harmony-1.5-head-linux-x86_64/ws/harmony/common_resources/depends/jars/cpptasks-1.0b4/cpptasks.jar


setup-native-build:

init-compression-mode:

-common-vm:

build:
     [echo] ## Building 'hythr'
    [mkdir] Created dir: http://hudson.zones.apache.org/hudson/job/Harmony-1.5-head-linux-x86_64/ws/harmony/working_vm/build/linux_x86_64_gcc_release/semis/hythr/bin

    [mkdir] Created dir: http://hudson.zones.apache.org/hudson/job/Harmony-1.5-head-linux-x86_64/ws/harmony/working_vm/build/linux_x86_64_gcc_release/semis/hythr/obj

       [cc] 17 total files to be compiled.
       [cc] http://hudson.zones.apache.org/hudson/job/Harmony-1.5-head-linux-x86_64/ws/harmony/working_vm/vm/thread/src/thread_native_basic.c
: In function ?hythread_get_thread_id_offset?:
       [cc] http://hudson.zones.apache.org/hudson/job/Harmony-1.5-head-linux-x86_64/ws/harmony/working_vm/vm/thread/src/thread_native_basic.c
:891: warning: cast from pointer to integer of different size
       [cc] Starting link
     [copy] Copying 1 file to http://hudson.zones.apache.org/hudson/job/Harmony-1.5-head-linux-x86_64/ws/harmony/working_vm/build/linux_x86_64_gcc_release/deploy/jdk/jre/bin/default


verifier:

-plugin-cpptasks:
     [echo] Checking for http://hudson.zones.apache.org/hudson/job/Harmony-1.5-head-linux-x86_64/ws/harmony/common_resources/depends/jars/cpptasks-1.0b4/cpptasks.jar


setup-native-build:

init-compression-mode:

-common-vm:

build:
     [echo] ## Building 'verifier'
    [mkdir] Created dir: http://hudson.zones.apache.org/hudson/job/Harmony-1.5-head-linux-x86_64/ws/harmony/working_vm/build/linux_x86_64_gcc_release/semis/verifier/bin

    [mkdir] Created dir: http://hudson.zones.apache.org/hudson/job/Harmony-1.5-head-linux-x86_64/ws/harmony/working_vm/build/linux_x86_64_gcc_release/semis/verifier/obj

       [cc] 10 total files to be compiled.
       [cc] Starting link
       [cc] a - ../obj/context_6.o
       [cc] ar: creating libverifier.a
       [cc] a - ../obj/context_base.o
       [cc] a - ../obj/x_verifier.o
       [cc] a - ../obj/write_attr.o
       [cc] a - ../obj/recompute.o
       [cc] a - ../obj/ver.o
       [cc] a - ../obj/context_x.o
       [cc] a - ../obj/vf_resolve.o
       [cc] a - ../obj/tpool.o
       [cc] a - ../obj/context_5.o
     [copy] Copying 1 file to http://hudson.zones.apache.org/hudson/job/Harmony-1.5-head-linux-x86_64/ws/harmony/working_vm/build/linux_x86_64_gcc_release/deploy/lib


vmcore:

-check-setup:

-check-setup-win:

-setup-win:

setup:
     [echo] Checking for http://hudson.zones.apache.org/hudson/job/Harmony-1.5-head-linux-x86_64/ws/harmony/common_resources/depends/oss/icu4c/icu4c-3.4-harmony-includes.zip

     [echo] Checking for http://hudson.zones.apache.org/hudson/job/Harmony-1.5-head-linux-x86_64/ws/harmony/common_resources/depends/libs/linux.x86_64/icu-3.4/icu-3.4.zip

    [mkdir] Created dir: http://hudson.zones.apache.org/hudson/job/Harmony-1.5-head-linux-x86_64/ws/harmony/working_vm/build/linux_x86_64_gcc_release/deploy/include/unicode

    [unzip] Expanding: http://hudson.zones.apache.org/hudson/job/Harmony-1.5-head-linux-x86_64/ws/harmony/common_resources/depends/oss/icu4c/icu4c-3.4-harmony-includes.zip
 into http://hudson.zones.apache.org/hudson/job/Harmony-1.5-head-linux-x86_64/ws/harmony/working_vm/build/linux_x86_64_gcc_release/deploy/include/unicode

    [unzip] Expanding: http://hudson.zones.apache.org/hudson/job/Harmony-1.5-head-linux-x86_64/ws/harmony/common_resources/depends/libs/linux.x86_64/icu-3.4/icu-3.4.zip
 into http://hudson.zones.apache.org/hudson/job/Harmony-1.5-head-linux-x86_64/ws/harmony/working_vm/build/linux_x86_64_gcc_release/deploy/jdk/jre/bin/default

    [unzip] Expanding: http://hudson.zones.apache.org/hudson/job/Harmony-1.5-head-linux-x86_64/ws/harmony/common_resources/depends/libs/linux.x86_64/icu-3.4/icu-3.4.zip
 into http://hudson.zones.apache.org/hudson/job/Harmony-1.5-head-linux-x86_64/ws/harmony/working_vm/build/linux_x86_64_gcc_release/deploy/lib

     [echo] Checking for http://hudson.zones.apache.org/hudson/job/Harmony-1.5-head-linux-x86_64/ws/harmony/working_vm/build/linux_x86_64_gcc_release/deploy/jdk/jre/bin/default/libicuuc.so


-really-link:
     [echo] Linking http://hudson.zones.apache.org/hudson/job/Harmony-1.5-head-linux-x86_64/ws/harmony/working_vm/build/linux_x86_64_gcc_release/deploy/jdk/jre/bin/default/libicuuc.so

  [symlink] ln -s http://hudson.zones.apache.org/hudson/job/Harmony-1.5-head-linux-x86_64/ws/harmony/working_vm/build/linux_x86_64_gcc_release/deploy/jdk/jre/bin/default/libicuuc.so.34
 http://hudson.zones.apache.org/hudson/job/Harmony-1.5-head-linux-x86_64/ws/harmony/working_vm/build/linux_x86_64_gcc_release/deploy/jdk/jre/bin/default/libicuuc.so


-check-version:

-copy-version:

stamp-version:
     [copy] Copying 1 file to http://hudson.zones.apache.org/hudson/job/Harmony-1.5-head-linux-x86_64/ws/harmony/working_vm/vm/vmcore/include


-plugin-cpptasks:
     [echo] Checking for http://hudson.zones.apache.org/hudson/job/Harmony-1.5-head-linux-x86_64/ws/harmony/common_resources/depends/jars/cpptasks-1.0b4/cpptasks.jar


setup-native-build:

init-compression-mode:

-common-vm:

build:
     [echo] ## Building 'vmcore'
    [mkdir] Created dir: http://hudson.zones.apache.org/hudson/job/Harmony-1.5-head-linux-x86_64/ws/harmony/working_vm/build/linux_x86_64_gcc_release/semis/vmcore/bin

    [mkdir] Created dir: http://hudson.zones.apache.org/hudson/job/Harmony-1.5-head-linux-x86_64/ws/harmony/working_vm/build/linux_x86_64_gcc_release/semis/vmcore/obj

[compile-cc] 173 total files to be compiled.
[compile-cc] http://hudson.zones.apache.org/hudson/job/Harmony-1.5-head-linux-x86_64/ws/harmony/working_vm/vm/vmcore/src/util/linux/crash_dump_os.cpp
: In function ?void cd_parse_module_info(native_module_t*, void*)?:
[compile-cc] http://hudson.zones.apache.org/hudson/job/Harmony-1.5-head-linux-x86_64/ws/harmony/working_vm/vm/vmcore/src/util/linux/crash_dump_os.cpp
:70: warning: format ?%016llx? expects type ?long long unsigned int?, but argument 3 has type
?size_t?
[compile-cc] http://hudson.zones.apache.org/hudson/job/Harmony-1.5-head-linux-x86_64/ws/harmony/working_vm/vm/vmcore/src/util/linux/crash_dump_os.cpp
:70: warning: format ?%016llx? expects type ?long long unsigned int?, but argument 4 has type
?long unsigned int?
[compile-cc] http://hudson.zones.apache.org/hudson/job/Harmony-1.5-head-linux-x86_64/ws/harmony/working_vm/vm/vmcore/src/util/linux/crash_dump_os.cpp
:79: warning: format ?%016llx? expects type ?long long unsigned int?, but argument 4 has type
?size_t?
[compile-cc] http://hudson.zones.apache.org/hudson/job/Harmony-1.5-head-linux-x86_64/ws/harmony/working_vm/vm/vmcore/src/util/linux/crash_dump_os.cpp
:79: warning: format ?%016llx? expects type ?long long unsigned int?, but argument 5 has type
?long unsigned int?
[compile-cc] http://hudson.zones.apache.org/hudson/job/Harmony-1.5-head-linux-x86_64/ws/harmony/working_vm/vm/vmcore/src/ncai/ncai_thread.cpp
: In function ?ncaiError ncaiGetThreadInfo(ncaiEnv*, _ncaiThread*, ncaiThreadInfo*)?:
[compile-cc] http://hudson.zones.apache.org/hudson/job/Harmony-1.5-head-linux-x86_64/ws/harmony/working_vm/vm/vmcore/src/ncai/ncai_thread.cpp
:137: warning: format ?%04X? expects type ?unsigned int?, but argument 4 has type ?IDATA?
[compile-cc] http://hudson.zones.apache.org/hudson/job/Harmony-1.5-head-linux-x86_64/ws/harmony/working_vm/vm/vmcore/src/lil/lil.cpp
: In function ?void lil_print_instruction(FILE*, LilInstruction*)?:
[compile-cc] http://hudson.zones.apache.org/hudson/job/Harmony-1.5-head-linux-x86_64/ws/harmony/working_vm/vm/vmcore/src/lil/lil.cpp
:2380: warning: format ?%p? expects type ?void*?, but argument 4 has type ?frame_type?
[compile-cc] http://hudson.zones.apache.org/hudson/job/Harmony-1.5-head-linux-x86_64/ws/harmony/working_vm/vm/vmcore/src/kernel_classes/native/Runtime_lnx.cpp
: In function ?void Java_java_lang_Runtime_00024SubProcess_createProcess0(JNIEnv*, _jobject*,
_jobject*, _jobject*, _jobject*, _jobject*)?:
[compile-cc] http://hudson.zones.apache.org/hudson/job/Harmony-1.5-head-linux-x86_64/ws/harmony/working_vm/vm/vmcore/src/kernel_classes/native/Runtime_lnx.cpp
:180: warning: ignoring return value of ?ssize_t write(int, const void*, size_t)?, declared
with attribute warn_unused_result
[compile-cc] http://hudson.zones.apache.org/hudson/job/Harmony-1.5-head-linux-x86_64/ws/harmony/working_vm/vm/vmcore/src/kernel_classes/native/Runtime_lnx.cpp
:214: warning: ignoring return value of ?ssize_t write(int, const void*, size_t)?, declared
with attribute warn_unused_result
[compile-cc] http://hudson.zones.apache.org/hudson/job/Harmony-1.5-head-linux-x86_64/ws/harmony/working_vm/vm/vmcore/src/util/crash_dump.cpp
: In function ?void cd_print_threads_info()?:
[compile-cc] http://hudson.zones.apache.org/hudson/job/Harmony-1.5-head-linux-x86_64/ws/harmony/working_vm/vm/vmcore/src/util/crash_dump.cpp
:497: warning: format ?%p? expects type ?void*?, but argument 4 has type ?pthread_t?
[compile-cc] http://hudson.zones.apache.org/hudson/job/Harmony-1.5-head-linux-x86_64/ws/harmony/working_vm/vm/vmcore/src/util/crash_dump.cpp
:505: warning: format ?%p? expects type ?void*?, but argument 4 has type ?pthread_t?
       [cc] 0 total files to be compiled.
       [cc] Starting link
     [copy] Copying 1 file to http://hudson.zones.apache.org/hudson/job/Harmony-1.5-head-linux-x86_64/ws/harmony/working_vm/build/linux_x86_64_gcc_release/deploy/jdk/jre/bin/default

     [echo] Copying files for internationalization...
     [copy] Copying 1 file to http://hudson.zones.apache.org/hudson/job/Harmony-1.5-head-linux-x86_64/ws/harmony/working_vm/build/linux_x86_64_gcc_release/deploy/jdk/jre/bin/default


interpreter:

-plugin-cpptasks:
     [echo] Checking for http://hudson.zones.apache.org/hudson/job/Harmony-1.5-head-linux-x86_64/ws/harmony/common_resources/depends/jars/cpptasks-1.0b4/cpptasks.jar


setup-native-build:

init-compression-mode:

-common-vm:

build:
     [echo] ## Building 'interpreter'
    [mkdir] Created dir: http://hudson.zones.apache.org/hudson/job/Harmony-1.5-head-linux-x86_64/ws/harmony/working_vm/build/linux_x86_64_gcc_release/semis/interpreter/bin

    [mkdir] Created dir: http://hudson.zones.apache.org/hudson/job/Harmony-1.5-head-linux-x86_64/ws/harmony/working_vm/build/linux_x86_64_gcc_release/semis/interpreter/obj

[compile-cc] 6 total files to be compiled.
       [cc] 0 total files to be compiled.
       [cc] Starting link
     [copy] Copying 1 file to http://hudson.zones.apache.org/hudson/job/Harmony-1.5-head-linux-x86_64/ws/harmony/working_vm/build/linux_x86_64_gcc_release/deploy/jdk/jre/bin/default

     [copy] Copying 1 file to http://hudson.zones.apache.org/hudson/job/Harmony-1.5-head-linux-x86_64/ws/harmony/working_vm/build/linux_x86_64_gcc_release/deploy/jdk/jre/bin/default


kernel:

check-setup:

setup:
     [echo] Checking for http://hudson.zones.apache.org/hudson/job/Harmony-1.5-head-linux-x86_64/ws/harmony/common_resources/depends/jars/antlr-2.7.5/antlr-2.7.5.jar

     [echo] Checking for http://hudson.zones.apache.org/hudson/job/Harmony-1.5-head-linux-x86_64/ws/harmony/common_resources/depends/jars/vmmagic/vmmagic-20070207.jar

     [copy] Copying 1 file to http://hudson.zones.apache.org/hudson/job/Harmony-1.5-head-linux-x86_64/ws/harmony/working_vm/build/linux_x86_64_gcc_release/deploy/jdk/jre/bin/default

     [copy] Copying 1 file to http://hudson.zones.apache.org/hudson/job/Harmony-1.5-head-linux-x86_64/ws/harmony/working_vm/build/linux_x86_64_gcc_release/deploy/jdk/jre/bin/default


build:
    [mkdir] Created dir: http://hudson.zones.apache.org/hudson/job/Harmony-1.5-head-linux-x86_64/ws/harmony/working_vm/build/linux_x86_64_gcc_release/semis/kernel/classes

 [hy.javac] Compiling 87 source files to http://hudson.zones.apache.org/hudson/job/Harmony-1.5-head-linux-x86_64/ws/harmony/working_vm/build/linux_x86_64_gcc_release/semis/kernel/classes

 [hy.javac] Since fork is false, ignoring memoryMaximumSize setting
      [jar] Building jar: http://hudson.zones.apache.org/hudson/job/Harmony-1.5-head-linux-x86_64/ws/harmony/working_vm/build/linux_x86_64_gcc_release/deploy/jdk/jre/bin/default/kernel.jar

      [jar] Building jar: http://hudson.zones.apache.org/hudson/job/Harmony-1.5-head-linux-x86_64/ws/harmony/working_vm/build/linux_x86_64_gcc_release/deploy/jdk/jre/bin/default/kernel-src.jar


em:

-plugin-cpptasks:
     [echo] Checking for http://hudson.zones.apache.org/hudson/job/Harmony-1.5-head-linux-x86_64/ws/harmony/common_resources/depends/jars/cpptasks-1.0b4/cpptasks.jar


setup-native-build:

init-compression-mode:

-common-vm:

build:
     [echo] ## Building 'em'
    [mkdir] Created dir: http://hudson.zones.apache.org/hudson/job/Harmony-1.5-head-linux-x86_64/ws/harmony/working_vm/build/linux_x86_64_gcc_release/semis/em/bin

    [mkdir] Created dir: http://hudson.zones.apache.org/hudson/job/Harmony-1.5-head-linux-x86_64/ws/harmony/working_vm/build/linux_x86_64_gcc_release/semis/em/obj

       [cc] 7 total files to be compiled.
       [cc] http://hudson.zones.apache.org/hudson/job/Harmony-1.5-head-linux-x86_64/ws/harmony/working_vm/vm/em/src/EdgeProfileCollector.cpp
: In member function ?void EdgeMethodProfile::dump(const char*)?:
       [cc] http://hudson.zones.apache.org/hudson/job/Harmony-1.5-head-linux-x86_64/ws/harmony/working_vm/vm/em/src/EdgeProfileCollector.cpp
:174: warning: format ?%d? expects type ?int?, but argument 5 has type ?size_t?
       [cc] Starting link
     [copy] Copying 1 file to http://hudson.zones.apache.org/hudson/job/Harmony-1.5-head-linux-x86_64/ws/harmony/working_vm/build/linux_x86_64_gcc_release/deploy/jdk/jre/bin/default


vmi:

-plugin-cpptasks:
     [echo] Checking for http://hudson.zones.apache.org/hudson/job/Harmony-1.5-head-linux-x86_64/ws/harmony/common_resources/depends/jars/cpptasks-1.0b4/cpptasks.jar


setup-native-build:

init-compression-mode:

-common-vm:

build:
     [echo] ## Building 'vmi'
    [mkdir] Created dir: http://hudson.zones.apache.org/hudson/job/Harmony-1.5-head-linux-x86_64/ws/harmony/working_vm/build/linux_x86_64_gcc_release/semis/vmi/bin

    [mkdir] Created dir: http://hudson.zones.apache.org/hudson/job/Harmony-1.5-head-linux-x86_64/ws/harmony/working_vm/build/linux_x86_64_gcc_release/semis/vmi/obj

       [cc] 2 total files to be compiled.
       [cc] Starting link
     [copy] Copying 1 file to http://hudson.zones.apache.org/hudson/job/Harmony-1.5-head-linux-x86_64/ws/harmony/working_vm/build/linux_x86_64_gcc_release/deploy/jdk/jre/bin/default


jitrino:

-plugin-cpptasks:
     [echo] Checking for http://hudson.zones.apache.org/hudson/job/Harmony-1.5-head-linux-x86_64/ws/harmony/common_resources/depends/jars/cpptasks-1.0b4/cpptasks.jar


setup-native-build:

init-compression-mode:

-common-vm:

-init-win:

-init-unix:

build:
     [echo] ## Building 'jitrino'
    [mkdir] Created dir: http://hudson.zones.apache.org/hudson/job/Harmony-1.5-head-linux-x86_64/ws/harmony/working_vm/build/linux_x86_64_gcc_release/semis/jitrino/bin

    [mkdir] Created dir: http://hudson.zones.apache.org/hudson/job/Harmony-1.5-head-linux-x86_64/ws/harmony/working_vm/build/linux_x86_64_gcc_release/semis/jitrino/obj

[compile-cc] 154 total files to be compiled.
[compile-cc] http://hudson.zones.apache.org/hudson/job/Harmony-1.5-head-linux-x86_64/ws/harmony/working_vm/vm/jitrino/src/optimizer/optimizer.cpp
:46:23: error: abcd/abcd.h: No such file or directory
[compile-cc] http://hudson.zones.apache.org/hudson/job/Harmony-1.5-head-linux-x86_64/ws/harmony/working_vm/vm/jitrino/src/optimizer/optimizer.cpp
: In member function ?void Jitrino::OptInitAction::readFlags()?:
[compile-cc] http://hudson.zones.apache.org/hudson/job/Harmony-1.5-head-linux-x86_64/ws/harmony/working_vm/vm/jitrino/src/optimizer/optimizer.cpp
:179: error: invalid use of incomplete type ?struct Jitrino::AbcdFlags?
[compile-cc] http://hudson.zones.apache.org/hudson/job/Harmony-1.5-head-linux-x86_64/ws/harmony/working_vm/vm/jitrino/src/optimizer/optimizer.h
:32: error: forward declaration of ?struct Jitrino::AbcdFlags?
[compile-cc] http://hudson.zones.apache.org/hudson/job/Harmony-1.5-head-linux-x86_64/ws/harmony/working_vm/vm/jitrino/src/optimizer/optimizer.cpp
:180: error: invalid application of ?sizeof? to incomplete type ?Jitrino::AbcdFlags? 
[compile-cc] http://hudson.zones.apache.org/hudson/job/Harmony-1.5-head-linux-x86_64/ws/harmony/working_vm/vm/jitrino/src/optimizer/optimizer.cpp
:197: error: ?Abcd? has not been declared
[compile-cc] http://hudson.zones.apache.org/hudson/job/Harmony-1.5-head-linux-x86_64/ws/harmony/working_vm/vm/jitrino/src/optimizer/optimizer.cpp
: In function ?void Jitrino::showFlags(std::ostream&)?:
[compile-cc] http://hudson.zones.apache.org/hudson/job/Harmony-1.5-head-linux-x86_64/ws/harmony/working_vm/vm/jitrino/src/optimizer/optimizer.cpp
:227: error: ?Abcd? has not been declared

BUILD FAILED
http://hudson.zones.apache.org/hudson/job/Harmony-1.5-head-linux-x86_64/ws/harmony/build.xml
:448: The following error occurred while executing this line:
http://hudson.zones.apache.org/hudson/job/Harmony-1.5-head-linux-x86_64/ws/harmony/working_vm/build.xml
:166: The following error occurred while executing this line:
http://hudson.zones.apache.org/hudson/job/Harmony-1.5-head-linux-x86_64/ws/harmony/working_vm/make/vm/jitrino.xml
:61: gcc failed with return code 1

Total time: 10 minutes 26 seconds
Recording fingerprints
Recording test results


Mime
View raw message