harmony-alerts mailing list archives

Site index · List index
Message view « Date » · « Thread »
Top « Date » · « Thread »
From nom...@intel.com
Subject [build-test alert] FAILED Linux x86_64: drlvm-test debug
Date Mon, 16 Feb 2009 15:34:18 GMT

BUILD FAILED:
	Ant Error Message:
/home/laichunrong/harmony.regularcc/infra/scripts/cc-exec-adaptor.xml:68: The following error
occurred while executing this line: /home/laichunrong/harmony.regularcc/infra/adaptors/drlvm-test/adaptor.xml:43:
The following error occurred while executing this line: /home/laichunrong/harmony.regularcc/infra/scripts/framework.xml:163:
Java returned: 1

Date of build:	2009-02-16 23:33:55 +0800
Time to build:	18 seconds

***********************************************************
Errors/Warnings:	(17)
            
BUILD FAILED
/home/laichunrong/harmony.regularcc/infra/build/checkouts/hdk/working_vm/build.xml:74: The
following error occurred while executing this line:
/home/laichunrong/harmony.regularcc/infra/build/checkouts/hdk/working_vm/make/depends.xml:46:
The following error occurred while executing this line:
/home/laichunrong/harmony.regularcc/infra/build/checkouts/hdk/common_resources/make/depends.xml:66:
The following error occurred while executing this line:
/home/laichunrong/harmony.regularcc/infra/build/checkouts/hdk/common_resources/make/depends.xml:78:
The following error occurred while executing this line:
/home/laichunrong/harmony.regularcc/infra/build/checkouts/hdk/working_vm/make/vm/vmcore.xml:26:
The following error occurred while executing this line:
/home/laichunrong/harmony.regularcc/infra/build/checkouts/hdk/common_resources/make/depends.xml:96:
The following error occurred while executing this line:
/home/laichunrong/harmony.regularcc/infra/build/checkouts/hdk/common_resources/make/depends.xml:181:
...
File /home/laichunrong/harmony.regularcc/infra/build/checkouts/hdk/common_resources/depends/libs/linux.x86_64/icu-3.4/icu-3.4.zip
has incorrect md5 checksum.
Expected: 6467cbcb3c6ff979c7bf9495b62081af (or )
Found:    dd65a5c4d519799607ce9463f7e5cd26
Your previous download may have failed to get the entire file. Either
delete the partial download and try again, or manually download that
file and put it in the specified directory.
Recommended URL: http://svn.apache.org/repos/asf/harmony/standard/depends/libs/linux.x86_64/icu-3.4.zip
Total time: 13 seconds
The execution FAILED with the following exception:
The following error occurred while executing this line:
/home/laichunrong/harmony.regularcc/infra/adaptors/drlvm-test/adaptor.xml:43: The following
error occurred while executing this line:
/home/laichunrong/harmony.regularcc/infra/scripts/framework.xml:163: Java returned: 1

***********************************************************
Unit Tests: (0)
        
No Tests Run: This project doesn't have any tests

***********************************************************
Modifications since last successful build:	(0)
            


Mime
  • Unnamed multipart/mixed (inline, None, 0 bytes)
View raw message