harmony-alerts mailing list archives

Site index · List index
Message view « Date » · « Thread »
Top « Date » · « Thread »
From nom...@intel.com
Subject [build-test alert] FAILED Linux x86: make-snapshot debug
Date Tue, 17 Feb 2009 09:53:08 GMT

BUILD FAILED:
	Ant Error Message:
/home/laichunrong/harmony.regularcc/infra/scripts/cc-exec-adaptor.xml:68: The following error
occurred while executing this line: /home/laichunrong/harmony.regularcc/infra/adaptors/make-snapshot/adaptor.xml:37:
exec returned: 1

Date of build:	2009-02-17 17:52:04 +0800
Time to build:	1 minute 1 second

***********************************************************
Errors/Warnings:	(4)
            
Checkout HDK trunk -r727027 into /home/laichunrong/harmony.regularcc/infra/build/checkouts/make-snapshot
svn: PROPFIND request failed on '/repos/asf/harmony/enhanced/trunk'
svn: PROPFIND of '/repos/asf/harmony/enhanced/trunk': 504 Gateway Time-out (http://svn.apache.org)
The execution FAILED with the following exception:
The following error occurred while executing this line:
/home/laichunrong/harmony.regularcc/infra/adaptors/make-snapshot/adaptor.xml:37: exec returned:
1

***********************************************************
Unit Tests: (0)
        
No Tests Run: This project doesn't have any tests

***********************************************************
Modifications since last successful build:	(0)
            


Mime
  • Unnamed multipart/mixed (inline, None, 0 bytes)
View raw message