harmony-alerts mailing list archives

Site index · List index
Message view « Date » · « Thread »
Top « Date » · « Thread »
From nom...@intel.com
Subject [build-test alert] FAILED Linux x86: hdk debug
Date Wed, 04 Feb 2009 11:40:35 GMT

BUILD FAILED:
	Ant Error Message:
/home/laichunrong/harmony.regularcc/infra/scripts/cc-exec-adaptor.xml:68: The following error
occurred while executing this line: /home/laichunrong/harmony.regularcc/infra/adaptors/hdk/adaptor.xml:39:
The following error occurred while executing this line: /home/laichunrong/harmony.regularcc/infra/scripts/framework.xml:163:
Java returned: 1

Date of build:	2009-02-04 19:28:32 +0800
Time to build:	10 minutes 57 seconds
Last changed:	02/04/2009 18:58:34
Last log entry:	Fix HARMONY-6079 ([jdktools] javac should exit with error code non-zero on
compile errors)

***********************************************************
Errors/Warnings:	(11)
            
[cc] /usr/bin/ar: creating libencoder.a
[cc] /usr/bin/ar: creating libport.a
[cc] /usr/bin/ar: creating libverifier.a
BUILD FAILED
/home/laichunrong/harmony.regularcc/infra/build/checkouts/hdk/build.xml:506: The following
error occurred while executing this line:
/home/laichunrong/harmony.regularcc/infra/build/checkouts/hdk/working_jdktools/build.xml:82:
The following error occurred while executing this line:
/home/laichunrong/harmony.regularcc/infra/build/checkouts/hdk/working_jdktools/make/build-java.xml:49:
The following error occurred while executing this line:
/home/laichunrong/harmony.regularcc/infra/build/checkouts/hdk/common_resources/make/properties.xml:243:
The following error occurred while executing this line:
/home/laichunrong/harmony.regularcc/infra/build/checkouts/hdk/working_jdktools/modules/jdktools/build.xml:92:
Compile failed; see the compiler error output for details.
Total time: 9 minutes 21 seconds
The execution FAILED with the following exception:
The following error occurred while executing this line:
/home/laichunrong/harmony.regularcc/infra/adaptors/hdk/adaptor.xml:39: The following error
occurred while executing this line:
/home/laichunrong/harmony.regularcc/infra/scripts/framework.xml:163: Java returned: 1

***********************************************************
Unit Tests: (0)
        
No Tests Run: This project doesn't have any tests

***********************************************************
Modifications since last successful build:	(1)
            
modified tellison  /harmony/enhanced/jdktools/trunk/modules/jdktools/src/main/java/org/apache/harmony/tools/javac/Main.java
02/04/2009 18:58:34 Fix HARMONY-6079 ([jdktools] javac should exit with error code non-zero
on compile errors)


Mime
  • Unnamed multipart/mixed (inline, None, 0 bytes)
View raw message