harmony-alerts mailing list archives

Site index · List index
Message view « Date » · « Thread »
Top « Date » · « Thread »
From nom...@intel.com
Subject [build-test alert] FAILED Linux x86_64: drlvm-reg-test debug
Date Wed, 11 Feb 2009 20:51:50 GMT

BUILD FAILED:
	Ant Error Message:
/home/laichunrong/harmony.regularcc/infra/scripts/cc-exec-adaptor.xml:68: The following error
occurred while executing this line: /home/laichunrong/harmony.regularcc/infra/adaptors/drlvm-reg-test/adaptor.xml:80:
There were drlvm-reg-test failures

Date of build:	2009-02-12 03:32:40 +0800
Time to build:	77 minutes 14 seconds
Last changed:	02/11/2009 21:46:55
Last log entry:	hdk

***********************************************************
Errors/Warnings:	(10)
            
[junit] Test org.apache.harmony.drlvm.tests.regression.h2084.Test FAILED (timeout)
[java] Java Result: 1
[java] Java Result: 1
[java] Java Result: 1
BUILD FAILED
/home/laichunrong/harmony.regularcc/infra/build/checkouts/hdk/working_vm/build.xml:352: The
following error occurred while executing this line:
/home/laichunrong/harmony.regularcc/infra/build/checkouts/hdk/working_vm/make/tests/reg-test-run.xml:108:
There were test failures
Total time: 74 minutes 53 seconds
The execution FAILED with the following exception:
The following error occurred while executing this line:
/home/laichunrong/harmony.regularcc/infra/adaptors/drlvm-reg-test/adaptor.xml:80: There were
drlvm-reg-test failures

***********************************************************
Unit Tests: (188)
        
error: unknown org.apache.harmony.drlvm.tests.regression.h2084.Test
Unit Test Error Details:	(1)
                
Test: unknownClass: org.apache.harmony.drlvm.tests.regression.h2084.Testjunit.framework.AssertionFailedError:
Timeout occurred
	at net.sf.antcontrib.logic.IfTask.execute(IfTask.java:197)
	at net.sf.antcontrib.logic.ForDelegate.doSequentialIteration(ForDelegate.java:228)
	at net.sf.antcontrib.logic.ForDelegate.doTheTasks(ForDelegate.java:281)
	at net.sf.antcontrib.logic.ForDelegate.execute(ForDelegate.java:213)
	at net.sf.antcontrib.logic.For.execute(For.java:166)

***********************************************************
Modifications since last successful build:	(1)
            
add cc-hdk log20090211214655Lbuild.72 02/11/2009 21:46:55hdk


Mime
  • Unnamed multipart/mixed (inline, None, 0 bytes)
View raw message