harmony-alerts mailing list archives

Site index · List index
Message view « Date » · « Thread »
Top « Date » · « Thread »
From nom...@intel.com
Subject [build-test alert] FAILED Windows 2003 x86_64: hdk debug
Date Thu, 05 Feb 2009 02:22:48 GMT

BUILD FAILED:
	Ant Error Message:
C:\harmony.cc\infra\scripts\cc-exec-adaptor.xml:68: The following error occurred while executing
this line: C:\harmony.cc\infra\adaptors\hdk\adaptor.xml:39: The following error occurred while
executing this line: C:\harmony.cc\infra\scripts\framework.xml:163: Java returned: 1

Date of build:	2009-02-04 17:53:35 -0800
Time to build:	27 minutes 46 seconds
Last changed:	02/04/2009 02:58:34
Last log entry:	Fix HARMONY-6079 ([jdktools] javac should exit with error code non-zero on
compile errors)

***********************************************************
Errors/Warnings:	(39)
            
[cc] cl : Command line warning D9035 : option 'GZ' has been deprecated and will be removed
in a future release
[cc] cl : Command line warning D9036 : use 'RTC1' instead of 'GZ'
[cc] cl : Command line warning D9035 : option 'GZ' has been deprecated and will be removed
in a future release
[cc] cl : Command line warning D9036 : use 'RTC1' instead of 'GZ'
[compile-cc] cl : Command line warning D9035 : option 'GZ' has been deprecated and will be
removed in a future release
[compile-cc] cl : Command line warning D9036 : use 'RTC1' instead of 'GZ'
[compile-cc] cl : Command line warning D9035 : option 'GZ' has been deprecated and will be
removed in a future release
[compile-cc] cl : Command line warning D9036 : use 'RTC1' instead of 'GZ'
[compile-cc] cl : Command line warning D9035 : option 'GZ' has been deprecated and will be
removed in a future release
[compile-cc] cl : Command line warning D9036 : use 'RTC1' instead of 'GZ'
[compile-cc] cl : Command line warning D9035 : option 'GZ' has been deprecated and will be
removed in a future release
[compile-cc] cl : Command line warning D9036 : use 'RTC1' instead of 'GZ'
[cc] cl : Command line warning D9035 : option 'GZ' has been deprecated and will be removed
in a future release
[cc] cl : Command line warning D9036 : use 'RTC1' instead of 'GZ'
[cc] cl : Command line warning D9035 : option 'GZ' has been deprecated and will be removed
in a future release
[cc] cl : Command line warning D9036 : use 'RTC1' instead of 'GZ'
[compile-cc] cl : Command line warning D9035 : option 'GZ' has been deprecated and will be
removed in a future release
[compile-cc] cl : Command line warning D9036 : use 'RTC1' instead of 'GZ'
[compile-cc] cl : Command line warning D9035 : option 'GZ' has been deprecated and will be
removed in a future release
[compile-cc] cl : Command line warning D9036 : use 'RTC1' instead of 'GZ'
[cc] cl : Command line warning D9035 : option 'GZ' has been deprecated and will be removed
in a future release
[cc] cl : Command line warning D9036 : use 'RTC1' instead of 'GZ'
[cc] cl : Command line warning D9035 : option 'GZ' has been deprecated and will be removed
in a future release
[cc] cl : Command line warning D9036 : use 'RTC1' instead of 'GZ'
[compile-cc] cl : Command line warning D9025 : overriding '/W3' with '/W4'
[compile-cc] cl : Command line warning D9035 : option 'GZ' has been deprecated and will be
removed in a future release
[compile-cc] cl : Command line warning D9036 : use 'RTC1' instead of 'GZ'
[compile-cc] cl : Command line warning D9035 : option 'GZ' has been deprecated and will be
removed in a future release
[compile-cc] cl : Command line warning D9036 : use 'RTC1' instead of 'GZ'
[compile-cc] cl : Command line warning D9035 : option 'GZ' has been deprecated and will be
removed in a future release
[compile-cc] cl : Command line warning D9036 : use 'RTC1' instead of 'GZ'
BUILD FAILED
C:\harmony.cc\infra\build\checkouts\hdk\build.xml:506: The following error occurred while
executing this line:
C:\harmony.cc\infra\build\checkouts\hdk\working_jdktools\build.xml:82: The following error
occurred while executing this line:
C:\harmony.cc\infra\build\checkouts\hdk\working_jdktools\make\build-java.xml:49: The following
error occurred while executing this line:
C:\harmony.cc\infra\build\checkouts\hdk\common_resources\make\properties.xml:243: The following
error occurred while executing this line:
C:\harmony.cc\infra\build\checkouts\hdk\working_jdktools\modules\jdktools\build.xml:92: Compile
failed; see the compiler error output for details.
Total time: 26 minutes 50 seconds
The execution FAILED with the following exception:
The following error occurred while executing this line:
C:\harmony.cc\infra\adaptors\hdk\adaptor.xml:39: The following error occurred while executing
this line:
C:\harmony.cc\infra\scripts\framework.xml:163: Java returned: 1

***********************************************************
Unit Tests: (0)
        
No Tests Run: This project doesn't have any tests

***********************************************************
Modifications since last successful build:	(1)
            
modified tellison  /harmony/enhanced/jdktools/trunk/modules/jdktools/src/main/java/org/apache/harmony/tools/javac/Main.java
02/04/2009 02:58:34 Fix HARMONY-6079 ([jdktools] javac should exit with error code non-zero
on compile errors)


Mime
  • Unnamed multipart/mixed (inline, None, 0 bytes)
View raw message