harmony-alerts mailing list archives

Site index · List index
Message view « Date » · « Thread »
Top « Date » · « Thread »
From nom...@intel.com
Subject [build-test alert] FAILED Linux x86: drlvm-test debug
Date Mon, 23 Feb 2009 05:43:32 GMT

BUILD FAILED:
	Ant Error Message:
/home/laichunrong/harmony.regularcc/infra/scripts/cc-exec-adaptor.xml:68: The following error
occurred while executing this line: /home/laichunrong/harmony.regularcc/infra/adaptors/drlvm-test/adaptor.xml:81:
There were drlvm-test failures

Date of build:	2009-02-23 11:09:22 +0800
Time to build:	154 minutes 3 seconds
Last changed:	02/23/2009 10:54:37
Last log entry:	hdk

***********************************************************
Errors/Warnings:	(21)
            
[exec] Result: 143
[java] Java Result: 1
[java] Java Result: 1
[java] Java Result: 130
[java] Java Result: 1
[java] Java Result: 1
[java] Java Result: 130
[java] Java Result: 1
[java] Java Result: 1
[java] Java Result: 130
[java] Java Result: 1
[java] Java Result: 1
[java] Java Result: 130
[java] Java Result: 1
[java] Java Result: 1
[java] Java Result: 130
BUILD FAILED
/home/laichunrong/harmony.regularcc/infra/build/checkouts/hdk/working_vm/build.xml:286: Some
tests failed
Total time: 153 minutes 44 seconds
The execution FAILED with the following exception:
The following error occurred while executing this line:
/home/laichunrong/harmony.regularcc/infra/adaptors/drlvm-test/adaptor.xml:81: There were drlvm-test
failures

***********************************************************
Unit Tests: (4185)
        
failure: test test_stress_suspend_5
Unit Test Error Details:	(1)
                
Test: testClass: test_stress_suspend_5Exit code: 143 Err: INFO: TEST test_java_suspend_stress_5
start
Tested thread is started
GC request thread is started
JAVA request thread is started
JAVA request thread is started
TEST start!
.
..........
..........
..........
..........
..........
..........
..........
...

***********************************************************
Modifications since last successful build:	(1)
            
add cc-hdk log20090223105437Lbuild.304 02/23/2009 10:54:37hdk


Mime
  • Unnamed multipart/mixed (inline, None, 0 bytes)
View raw message