harmony-alerts mailing list archives

Site index · List index
Message view « Date » · « Thread »
Top « Date » · « Thread »
From nom...@intel.com
Subject [build-test alert] FAILED Linux x86_64: ehwa-api debug
Date Mon, 05 Jan 2009 20:10:26 GMT

BUILD FAILED:
	Ant Error Message:
/home/laichunrong/harmony.regularcc/infra/scripts/cc-exec-adaptor.xml:68: The following error
occurred while executing this line: /home/laichunrong/harmony.regularcc/infra/adaptors/ehwa-api/adaptor.xml:98:
The following error occurred while executing this line: /home/laichunrong/harmony.regularcc/infra/scripts/framework.xml:163:
Java returned: 1

Date of build:	2009-01-06 03:42:21 +0800
Time to build:	27 minutes 37 seconds
Last changed:	01/06/2009 02:37:40
Last log entry:	hdk

***********************************************************
Errors/Warnings:	(5)
            
[java] Java Result: 1
BUILD FAILED
/home/laichunrong/harmony.regularcc/infra/build/checkouts/ehwa-api/tests/ehwa-test.xml:100:
Eclipse HelloWorld scenario FAILED
Total time: 27 minutes 23 seconds
The execution FAILED with the following exception:
The following error occurred while executing this line:
/home/laichunrong/harmony.regularcc/infra/adaptors/ehwa-api/adaptor.xml:98: The following
error occurred while executing this line:
/home/laichunrong/harmony.regularcc/infra/scripts/framework.xml:163: Java returned: 1

***********************************************************
Unit Tests: (0)
        
No Tests Run: This project doesn't have any tests

***********************************************************
Modifications since last successful build:	(1)
            
add cc-hdk log20090106023740Lbuild.48 01/06/2009 02:37:40hdk


Mime
  • Unnamed multipart/mixed (inline, None, 0 bytes)
View raw message