harmony-alerts mailing list archives

Site index · List index
Message view « Date » · « Thread »
Top « Date » · « Thread »
From nom...@intel.com
Subject [build-test alert] FAILED Windows 2003 x86_64: jdktools-test debug
Date Thu, 08 Jan 2009 08:50:13 GMT

BUILD FAILED:
	Ant Error Message:
C:\harmony.cc\infra\scripts\cc-exec-adaptor.xml:68: The following error occurred while executing
this line: C:\harmony.cc\infra\adaptors\jdktools-test\adaptor.xml:50: The following error
occurred while executing this line: C:\harmony.cc\infra\scripts\framework.xml:163: Java returned:
1

Date of build:	2009-01-07 22:44:59 -0800
Time to build:	125 minutes 7 seconds
Last changed:	01/07/2009 15:42:24
Last log entry:	hdk

***********************************************************
Errors/Warnings:	(8)
            
[junit] Tests FAILED
[junit] Tests FAILED (timeout)
[exec] Result: 1
BUILD FAILED
C:\harmony.cc\infra\build\checkouts\hdk\working_jdktools\build.xml:160: The following error
occurred while executing this line:
C:\harmony.cc\infra\build\checkouts\hdk\working_jdktools\make\build-test.xml:93: There were
test errors.
Total time: 124 minutes 24 seconds
The execution FAILED with the following exception:
The following error occurred while executing this line:
C:\harmony.cc\infra\adaptors\jdktools-test\adaptor.xml:50: The following error occurred while
executing this line:
C:\harmony.cc\infra\scripts\framework.xml:163: Java returned: 1

***********************************************************
Unit Tests: (156)
        
error: org.apache.harmony.jpda.tests.jdwp.MultiSession.ResumeTest vmcrash.CrashedTests
error: testOwnedMonitors001 org.apache.harmony.jpda.tests.jdwp.ThreadReference.OwnedMonitorsTest
Unit Test Error Details:	(2)
                
Test: org.apache.harmony.jpda.tests.jdwp.MultiSession.ResumeTestClass: vmcrash.CrashedTests
Test: testOwnedMonitors001Class: org.apache.harmony.jpda.tests.jdwp.ThreadReference.OwnedMonitorsTestorg.apache.harmony.jpda.tests.framework.jdwp.exceptions.ReplyErrorCodeException:
Error 20: INVALID_OBJECT
	at org.apache.harmony.jpda.tests.framework.jdwp.VmMirror.checkReply(VmMirror.java:95)
	at org.apache.harmony.jpda.tests.framework.jdwp.VmMirror.getThreadName(VmMirror.java:699)
	at org.apache.harmony.jpda.tests.jdwp.ThreadReference.OwnedMonitorsTest.testOwnedMonitors001(OwnedMonitorsTest.java:114)
	at java.lang.reflect.VMReflection.invokeMethod(VMReflection.java)

***********************************************************
Modifications since last successful build:	(1)
            
add cc-hdk log20090107154224Lbuild.146 01/07/2009 15:42:24hdk


Mime
  • Unnamed multipart/mixed (inline, None, 0 bytes)
View raw message