harmony-alerts mailing list archives

Site index · List index
Message view « Date » · « Thread »
Top « Date » · « Thread »
From nom...@intel.com
Subject [build-test alert] FAILED Linux x86_64: drlvm-test debug
Date Mon, 05 Jan 2009 23:47:47 GMT

BUILD FAILED:
	Ant Error Message:
/home/laichunrong/harmony.regularcc/infra/scripts/cc-exec-adaptor.xml:68: The following error
occurred while executing this line: /home/laichunrong/harmony.regularcc/infra/adaptors/drlvm-test/adaptor.xml:81:
There were drlvm-test failures

Date of build:	2009-01-06 04:12:07 +0800
Time to build:	215 minutes 15 seconds
Last changed:	01/06/2009 02:37:40
Last log entry:	hdk

***********************************************************
Errors/Warnings:	(21)
            
[java] Java Result: 1
[java] Java Result: 1
[java] Java Result: 130
[java] Java Result: 1
[java] Java Result: 1
[java] Java Result: 130
[java] Java Result: 139
[java] Java Result: 1
[java] Java Result: 1
[java] Java Result: 130
[java] Java Result: 1
[java] Java Result: 1
[java] Java Result: 130
[java] Java Result: 1
[java] Java Result: 1
[java] Java Result: 130
BUILD FAILED
/home/laichunrong/harmony.regularcc/infra/build/checkouts/hdk/working_vm/build.xml:286: Some
tests failed
Total time: 214 minutes 24 seconds
The execution FAILED with the following exception:
The following error occurred while executing this line:
/home/laichunrong/harmony.regularcc/infra/adaptors/drlvm-test/adaptor.xml:81: There were drlvm-test
failures

***********************************************************
Unit Tests: (4187)
        
failure: jitrino.JET stress.WeakHashmapTest_jet
Unit Test Error Details:	(1)
                
Test: jitrino.JETClass: stress.WeakHashmapTest_jetExit code: 139 Err: 
Signal reported: GENERAL_PROTECTION_FAULT
Registers:
    RAX: 0x0000003c5cf49cd0, RBX: 0x0000000000613d88
    RCX: 0x0000000000000017, RDX: 0x000000004b4de4d7
    RSI: 0x0000003c5cf499f0, RDI: 0x000000005cf49cc0
    RSP: 0x0000000040400e90, RBP: 0x0000000000000001
    R8 : 0x0000000040401030, R9 : 0x00002aaaaaaab2b8
    R10: 0x0000000000000000, R11: 0x0000000009691a75
    R12: 0x0000000000000014, R13: 0x00000000a8428197
    R14: 0x0000000000000000, R15: 0x0000000000000000
    RIP: 0x0000003c5bc08ffb

Command line:
/home/laichunrong/harmony.regularcc/infra/build/checkouts/hdk/target/hdk/jdk/jre/bin/java
-Xem:jet -XX:-vm.assert_dialog -Djava.library.path=/home/laichunrong/harmony.regularcc/infra/build/checkouts/hdk/working_vm/build/linux_x86_64_gcc_debug/tests/smoke.tests/natives/stress
-classpath /home/laichunrong/harmony.regularcc/infra/build/checkouts/hdk/working_vm/build/linux_x86_64_gcc_debug/tests/smoke.tests/classes
stress.WeakHashmapTest 

Working directory:
/home/laichunrong/harmony.regularcc/infra/build/checkouts/hdk/working_vm/build/linux_x86_64_gcc_debug/tests/smoke.tests

Environment variables:
JAVA_HOME=/home/laichunrong/harmony.regularcc/infra/build/checkouts/hdk/target/hdk/jdk/jre
LD_LIBRARY_PATH=/home/laichunrong/harmony.regularcc/infra/build/checkouts/hdk/target/hdk/jdk/jre/bin/default:/home/laichunrong/harmony.regularcc/infra/build/checkouts/hdk/target/hdk/jdk/jre/bin/:/home/laichunrong/harmony.regularcc/infra/build/checkouts/hdk/target/hdk/jdk/jre/bin:/jdk1.5.0_10/jre/lib/amd64/server:/jdk1.5.0_10/jre/lib/amd64:/jdk1.5.0_10/jre/../lib/amd64

Loaded modules:

/home/laichunrong/harmony.regularcc/infra/build/checkouts/hdk/target/hdk/jdk/jre/bin/java:
	0x0000000000400000:0x0000000000406000
	0x0000000000606000:0x0000000000607000
[heap]:
	0x0000000000607000:0x000000000068e000
/lib64/ld-2.5.so:
	0x0000003c5bc00000:0x0000003c5bc1a000
	0x0000003c5be19000:0x0000003c5be1a000
	0x0000003c5be1a000:0x0000003c5be1b000
/lib64/libc-2.5.so:
	0x0000003c5cc00000:0x0000003c5cd44000
	0x0000003c5cd44000:0x0000003c5cf44000
	0x0000003c5cf44000:0x0000003c5cf48000
	0x0000003c5cf48000:0x0000003c5cf49000
/lib64/libm-2.5.so:
	0x0000003c5d000000:0x0000003c5d082000
	0x0000003c5d082000:0x0000003c5d281000
	0x0000003c5d281000:0x0000003c5d282000
	0x0000003c5d282000:0x0000003c5d283000
/lib64/libdl-2.5.so:
	0x0000003c5d400000:0x0000003c5d403000
	0x0000003c5d403000:0x0000003c5d602000
	0x0000003c5d602000:0x0000003c5d603000
	0x0000003c5d603000:0x0000003c5d604000
/lib64/libpthread-2.5.so:
	0x0000003c5d800000:0x0000003c5d815000
	0x0000003c5d815000:0x0000003c5da14000
	0x0000003c5da14000:0x0000003c5da15000
	0x0000003c5da15000:0x0000003c5da16000
/usr/lib64/libz.so.1.2.3:
	0x0000003c5dc00000:0x0000003c5dc14000
	0x0000003c5dc14000:0x0000003c5de13000
	0x0000003c5de13000:0x0000003c5de14000
/lib64/librt-2.5.so:
	0x0000003c5e000000:0x0000003c5e008000
	0x0000003c5e008000:0x0000003c5e207000
	0x0000003c5e207000:0x0000003c5e208000
	0x0000003c5e208000:0x0000003c5e209000
/usr/lib64/libxml2.so.2.6.26:
	0x0000003c64a00000:0x0000003c64b33000
	0x0000003c64b33000:0x0000003c64d33000
	0x0000003c64d33000:0x0000003c64d3c000
/lib64/libgcc_s-4.1.1-20061011.so.1:
	0x0000003c6c600000:0x0000003c6c60d000
	0x0000003c6c60d000:0x0000003c6c80c000
	0x0000003c6c80c000:0x0000003c6c80d000
/usr/lib64/libstdc++.so.6.0.8:
	0x0000003c6ce00000:0x0000003c6cee7000
	0x0000003c6cee7000:0x0000003c6d0e7000
	0x0000003c6d0e7000:0x0000003c6d0ed000
	0x0000003c6d0ed000:0x0000003c6d0f0000
/home/laichunrong/harmony.regularcc/infra/build/checkouts/hdk/target/hdk/jdk/jre/bin/libhythr.so:
	0x00002aaaaaaad000:0x00002aaaaaad2000
	0x00002aaaaaad2000:0x00002aaaaacd2000
	0x00002aaaaacd2000:0x00002aaaaacd3000
/home/laichunrong/harmony.regularcc/infra/build/checkouts/hdk/target/hdk/jdk/jre/bin/libhyprt.so:
	0x00002aaaaad24000:0x00002aaaaad4c000
	0x00002aaaaad4c000:0x00002aaaaaf4c000
	0x00002aaaaaf4c000:0x00002aaaaaf53000
/home/laichunrong/harmony.regularcc/infra/build/checkouts/hdk/target/hdk/jdk/jre/bin/default/libch.so:
	0x00002aaaaaf92000:0x00002aaaaafa6000
	0x00002aaaaafa6000:0x00002aaaab1a6000
	0x00002aaaab1a6000:0x00002aaaab204000
/home/laichunrong/harmony.regularcc/infra/build/checkouts/hdk/target/hdk/jdk/jre/bin/default/libharmonyvm.so:
	0x00002aaaab43a000:0x00002aaaab650000
	0x00002aaaab650000:0x00002aaaab850000
	0x00002aaaab850000:0x00002aaaab8bb000
/home/laichunrong/harmony.regularcc/infra/build/checkouts/hdk/target/hdk/jdk/jre/bin/default/libicuuc.so.34:
	0x00002aaaabaf2000:0x00002aaaabc06000
	0x00002aaaabc06000:0x00002aaaabe05000
	0x00002aaaabe05000:0x00002aaaabe12000
/home/laichunrong/harmony.regularcc/infra/build/checkouts/hdk/target/hdk/jdk/jre/bin/default/libicudata.so.34:
	0x00002aaaabe2d000:0x00002aaaac6a1000
	0x00002aaaac6a1000:0x00002aaaac8a0000
	0x00002aaaac8a0000:0x00002aaaac8a1000
/lib64/libnss_files-2.5.so:
	0x00002aaaacaff000:0x00002aaaacb09000
	0x00002aaaacb09000:0x00002aaaacd08000
	0x00002aaaacd08000:0x00002aaaacd09000
	0x00002aaaacd09000:0x00002aaaacd0a000
/home/laichunrong/harmony.regularcc/infra/build/checkouts/hdk/target/hdk/jdk/jre/bin/default/libem.so:
	0x00002aaaecd4a000:0x00002aaaecd90000
	0x00002aaaecd90000:0x00002aaaecf8f000
	0x00002aaaecf8f000:0x00002aaaecf91000
/home/laichunrong/harmony.regularcc/infra/build/checkouts/hdk/target/hdk/jdk/jre/bin/default/libjitrino.so:
	0x00002aaaecf91000:0x00002aaaed3ea000
	0x00002aaaed3ea000:0x00002aaaed5e9000
	0x00002aaaed5e9000:0x00002aaaed601000
/home/laichunrong/harmony.regularcc/infra/build/checkouts/hdk/target/hdk/jdk/jre/bin/default/libgc_gen.so:
	0x00002aaaed66e000:0x00002aaaed72c000
	0x00002aaaed72c000:0x00002aaaed92b000
	0x00002aaaed92b000:0x00002aaaed92e000
/home/laichunrong/harmony.regularcc/infra/build/checkouts/hdk/target/hdk/jdk/jre/bin/libhyzlib.so:
	0x00002aab0dc3a000:0x00002aab0dc4c000
	0x00002aab0dc4c000:0x00002aab0de4c000
	0x00002aab0de4c000:0x00002aab0de4d000
/home/laichunrong/harmony.regularcc/infra/build/checkouts/hdk/target/hdk/jdk/jre/bin/libhynio.so:
	0x00002aab0de4d000:0x00002aab0de4f000
	0x00002aab0de4f000:0x00002aab0e04e000
	0x00002aab0e04e000:0x00002aab0e04f000
/home/laichunrong/harmony.regularcc/infra/build/checkouts/hdk/target/hdk/jdk/jre/bin/default/libvmi.so:
	0x00002aab0e04f000:0x00002aab0e055000
	0x00002aab0e055000:0x00002aab0e255000
	0x00002aab0e255000:0x00002aab0e256000
/home/laichunrong/harmony.regularcc/infra/build/checkouts/hdk/target/hdk/jdk/jre/bin/libhyluni.so:
	0x00002aab0e256000:0x00002aab0e28e000
	0x00002aab0e28e000:0x00002aab0e48d000
	0x00002aab0e48d000:0x00002aab0e48e000
/home/laichunrong/harmony.regularcc/infra/build/checkouts/hdk/target/hdk/jdk/jre/bin/libhyarchive.so:
	0x00002aab0e48f000:0x00002aab0e49c000
	0x00002aab0e49c000:0x00002aab0e69c000
	0x00002aab0e69c000:0x00002aab0e69d000
[stack]:
	0x00007fffc912f000:0x00007fffc9b1d000
[vdso]:
	0xffffffffff600000:0xffffffffffe00000
[stack]:
	0x00007fffc912f000:0x00007fffc9b1d000
[vdso]:
	0xffffffffff600000:0xffffffffffe00000

Stack trace:
  0: 0x0000003c5bc08ffb  ?? (??:-1)
  1: 0x0000003c5bc09262  ?? (??:-1)
  2: 0x0000003c5bc0cbd3  ?? (??:-1)
  3: 0x0000003c5bc12382  ?? (??:-1)
  4: 0x0000003c5cccd62d  ?? (??:-1)
<end of stack trace>

Crashed module:
/lib64/ld-2.5.so
(Unknown/system native module)

Current thread is not attached to VM, ID: 13250

VM attached threads:

    [0x2aaaaaf70500]

***********************************************************
Modifications since last successful build:	(1)
            
add cc-hdk log20090106023740Lbuild.48 01/06/2009 02:37:40hdk


Mime
  • Unnamed multipart/mixed (inline, None, 0 bytes)
View raw message