harmony-alerts mailing list archives

Site index · List index
Message view « Date » · « Thread »
Top « Date » · « Thread »
From nom...@intel.com
Subject [build-test alert] FAILED Windows 2003 x86_64: drlvm-test debug
Date Tue, 20 Jan 2009 08:32:56 GMT

BUILD FAILED:
	Ant Error Message:
C:\harmony.cc\infra\scripts\cc-exec-adaptor.xml:68: The following error occurred while executing
this line: C:\harmony.cc\infra\adaptors\drlvm-test\adaptor.xml:81: There were drlvm-test failures

Date of build:	2009-01-19 19:38:07 -0800
Time to build:	294 minutes 40 seconds
Last changed:	01/16/2009 15:21:11
Last log entry:	hdk

***********************************************************
Errors/Warnings:	(35)
            
[cc] cl : Command line warning D9035 : option 'GZ' has been deprecated and will be removed
in a future release
[cc] cl : Command line warning D9036 : use 'RTC1' instead of 'GZ'
[cc] cl : Command line warning D9035 : option 'GZ' has been deprecated and will be removed
in a future release
[cc] cl : Command line warning D9036 : use 'RTC1' instead of 'GZ'
[cc] cl : Command line warning D9035 : option 'GZ' has been deprecated and will be removed
in a future release
[cc] cl : Command line warning D9036 : use 'RTC1' instead of 'GZ'
[cc] cl : Command line warning D9035 : option 'GZ' has been deprecated and will be removed
in a future release
[cc] cl : Command line warning D9036 : use 'RTC1' instead of 'GZ'
[cc] cl : Command line warning D9035 : option 'GZ' has been deprecated and will be removed
in a future release
[cc] cl : Command line warning D9036 : use 'RTC1' instead of 'GZ'
[cc] cl : Command line warning D9035 : option 'GZ' has been deprecated and will be removed
in a future release
[cc] cl : Command line warning D9036 : use 'RTC1' instead of 'GZ'
[cc] cl : Command line warning D9035 : option 'GZ' has been deprecated and will be removed
in a future release
[cc] cl : Command line warning D9036 : use 'RTC1' instead of 'GZ'
[java] Java Result: 3
[java] Java Result: 1
[java] Java Result: 1
[java] Java Result: 130
[java] Java Result: 1
[java] Java Result: 1
[java] Java Result: 130
[java] Java Result: 1
[java] Java Result: 1
[java] Java Result: 130
[java] Java Result: 1
[java] Java Result: 1
[java] Java Result: 130
[java] Java Result: 1
[java] Java Result: 1
[java] Java Result: 130
BUILD FAILED
C:\harmony.cc\infra\build\checkouts\hdk\working_vm\build.xml:286: Some tests failed
Total time: 294 minutes 14 seconds
The execution FAILED with the following exception:
The following error occurred while executing this line:
C:\harmony.cc\infra\adaptors\drlvm-test\adaptor.xml:81: There were drlvm-test failures

***********************************************************
Unit Tests: (4342)
        
failure: Client mode JIT (default) classloader.StressLoader_jit
Unit Test Error Details:	(1)
                
Test: Client mode JIT (default)Class: classloader.StressLoader_jitExit code: 3 Err: Assertion
failed: ((HyThread_public *)hythread_self())->group == get_java_thread_group(), file C:\harmony.cc\infra\build\checkouts\hdk\working_vm\vm\include\open/hythread_ext.h,
line 628

This application has requested the Runtime to terminate it in an unusual way.
Please contact the application's support team for more information.

This application has requested the Runtime to terminate it in an unusual way.
Please contact the application's support team for more information.

Signal reported: ABORT

Registers info is absent

Command line:
C:\harmony.cc\infra\build\checkouts\hdk\target\hdk\jdk\jre\bin\java -XX:-vm.assert_dialog
-Djava.library.path=C:\harmony.cc\infra\build\checkouts\hdk\working_vm\build\windows_x86_64_msvc_debug\tests\smoke.tests\natives/classloader
-classpath C:\harmony.cc\infra\build\checkouts\hdk\working_vm\build\windows_x86_64_msvc_debug\tests\smoke.tests\classes
classloader.StressLoader

Working directory:
C:\harmony.cc\infra\build\checkouts\hdk\working_vm\build\windows_x86_64_msvc_debug\tests\smoke.tests

Environment variables:
JAVA_HOME=C:\harmony.cc\infra\build\checkouts\hdk\target\hdk\jdk\jre
LD_LIBRARY_PATH=C:\harmony.cc\infra\build\checkouts\hdk\target\hdk\jdk\jre/bin:${env.LD_LIBRARY_PATH}
PATH=C:\harmony.cc\infra\build\checkouts\hdk\target\hdk\jdk\jre\bin\default;C:\harmony.cc\infra\build\checkouts\hdk\target\hdk\jdk\jre\bin\;

Loaded modules:

c:\harmony.cc\infra\build\checkouts\hdk\target\hdk\jdk\jre\bin\java.exe:
	0x0000000000400000:0x0000000000412000
c:\windows\system32\ntdll.dll:
	0x0000000078ec0000:0x0000000078ff9000
c:\windows\system32\kernel32.dll:
	0x0000000077d40000:0x0000000077eb3000
c:\harmony.cc\infra\build\checkouts\hdk\target\hdk\jdk\jre\bin\hyprt.dll:
	0x0000000002b40000:0x0000000002b69000
c:\harmony.cc\infra\build\checkouts\hdk\target\hdk\jdk\jre\bin\hythr.dll:
	0x0000000002b80000:0x0000000002c1d000
c:\windows\winsxs\amd64_microsoft.vc80.debugcrt_1fc8b3b9a1e18e3b_8.0.50727.42_x-ww_2968974c\msvcr80d.dll:
	0x0000000010200000:0x000000001034d000
c:\windows\system32\msvcrt.dll:
	0x000007ff7fc00000:0x000007ff7fc86000
c:\windows\system32\ws2_32.dll:
	0x000007ff77150000:0x000007ff77180000
c:\windows\system32\advapi32.dll:
	0x000007ff7fee0000:0x000007ff7ffe5000
c:\windows\system32\rpcrt4.dll:
	0x000007ff7fd30000:0x000007ff7fed9000
c:\windows\system32\ws2help.dll:
	0x000007ff77140000:0x000007ff7714c000
c:\windows\winsxs\amd64_microsoft.vc80.crt_1fc8b3b9a1e18e3b_8.0.50727.762_x-ww_9d1c6ce0\msvcr80.dll:
	0x0000000078130000:0x00000000781f9000
c:\harmony.cc\infra\build\checkouts\hdk\target\hdk\jdk\jre\bin\default\harmonyvm.dll:
	0x0000000000a50000:0x00000000010aa000
c:\harmony.cc\infra\build\checkouts\hdk\target\hdk\jdk\jre\bin\default\icuuc34.dll:
	0x0000000001ac0000:0x0000000001bd0000
c:\harmony.cc\infra\build\checkouts\hdk\target\hdk\jdk\jre\bin\default\icudt34.dll:
	0x0000000001150000:0x00000000019bf000
c:\harmony.cc\infra\build\checkouts\hdk\target\hdk\jdk\jre\bin\default\ch.dll:
	0x0000000000740000:0x00000000009f3000
c:\windows\system32\user32.dll:
	0x0000000077c20000:0x0000000077d2c000
c:\windows\system32\gdi32.dll:
	0x000007ff7fc90000:0x000007ff7fd2b000
c:\windows\system32\dbghelp.dll:
	0x000007ff724e0000:0x000007ff7261e000
c:\windows\system32\version.dll:
	0x000007ff7fbf0000:0x000007ff7fbfb000
c:\windows\winsxs\amd64_microsoft.vc80.debugcrt_1fc8b3b9a1e18e3b_8.0.50727.42_x-ww_2968974c\msvcp80d.dll:
	0x0000000010480000:0x00000000105da000
c:\windows\system32\psapi.dll:
	0x000007ff7e1b0000:0x000007ff7e1c0000
c:\windows\system32\userenv.dll:
	0x000007ff7c4a0000:0x000007ff7c5a9000
c:\windows\system32\secur32.dll:
	0x000007ff7e7f0000:0x000007ff7e812000
c:\harmony.cc\infra\build\checkouts\hdk\target\hdk\jdk\jre\bin\default\em.dll:
	0x0000000002300000:0x00000000023a9000
c:\harmony.cc\infra\build\checkouts\hdk\target\hdk\jdk\jre\bin\default\jitrino.dll:
	0x0000000004020000:0x0000000004a8a000
c:\harmony.cc\infra\build\checkouts\hdk\target\hdk\jdk\jre\bin\default\gc_gen.dll:
	0x00000000023b0000:0x000000000245e000
c:\harmony.cc\infra\build\checkouts\hdk\target\hdk\jdk\jre\bin\hyzlib.dll:
	0x0000000001100000:0x000000000111f000
c:\harmony.cc\infra\build\checkouts\hdk\target\hdk\jdk\jre\bin\hynio.dll:
	0x0000000001130000:0x0000000001137000
c:\harmony.cc\infra\build\checkouts\hdk\target\hdk\jdk\jre\bin\default\vmi.dll:
	0x0000000002a80000:0x0000000002a8e000
c:\harmony.cc\infra\build\checkouts\hdk\target\hdk\jdk\jre\bin\hyluni.dll:
	0x0000000002aa0000:0x0000000002ad9000
c:\windows\system32\mswsock.dll:
	0x000007ff771b0000:0x000007ff7722c000
c:\harmony.cc\infra\build\checkouts\hdk\target\hdk\jdk\jre\bin\hyarchive.dll:
	0x0000000002af0000:0x0000000002b03000
c:\harmony.cc\infra\build\checkouts\hdk\target\hdk\jdk\jre\bin\hyniochar.dll:
	0x0000000005790000:0x000000000592a000

No stack trace due to registers info absence

***********************************************************
Modifications since last successful build:	(1)
            
add cc-hdk log20090116152111Lbuild.152 01/16/2009 15:21:11hdk


Mime
  • Unnamed multipart/mixed (inline, None, 0 bytes)
View raw message