harmony-alerts mailing list archives

Site index · List index
Message view « Date » · « Thread »
Top « Date » · « Thread »
From nom...@intel.com
Subject [build-test alert] FAILED Windows 2003 x86_64: jdktools-test debug
Date Thu, 01 Jan 2009 17:01:49 GMT

BUILD FAILED:
	Ant Error Message:
C:\harmony.cc\infra\scripts\cc-exec-adaptor.xml:68: The following error occurred while executing
this line: C:\harmony.cc\infra\adaptors\jdktools-test\adaptor.xml:50: The following error
occurred while executing this line: C:\harmony.cc\infra\scripts\framework.xml:163: Java returned:
1

Date of build:	2009-01-01 08:27:55 -0800
Time to build:	33 minutes 48 seconds
Last changed:	01/01/2009 07:58:29
Last log entry:	hdk

***********************************************************
Errors/Warnings:	(7)
            
[junit] Tests FAILED
[exec] Result: 1
BUILD FAILED
C:\harmony.cc\infra\build\checkouts\hdk\working_jdktools\build.xml:160: The following error
occurred while executing this line:
C:\harmony.cc\infra\build\checkouts\hdk\working_jdktools\make\build-test.xml:93: There were
test errors.
Total time: 33 minutes 14 seconds
The execution FAILED with the following exception:
The following error occurred while executing this line:
C:\harmony.cc\infra\adaptors\jdktools-test\adaptor.xml:50: The following error occurred while
executing this line:
C:\harmony.cc\infra\scripts\framework.xml:163: Java returned: 1

***********************************************************
Unit Tests: (162)
        
error: testCombinedEvents_04 org.apache.harmony.jpda.tests.jdwp.Events.CombinedEventsTest
Unit Test Error Details:	(1)
                
Test: testCombinedEvents_04Class: org.apache.harmony.jpda.tests.jdwp.Events.CombinedEventsTestorg.apache.harmony.jpda.tests.framework.TestErrorException:
Debuggee process did not finish during timeout
	at org.apache.harmony.jpda.tests.jdwp.share.JDWPUnitDebuggeeProcessWrapper.WaitForProcessExit(JDWPUnitDebuggeeProcessWrapper.java:284)
	at org.apache.harmony.jpda.tests.jdwp.share.JDWPUnitDebuggeeProcessWrapper.finishProcessAndRedirectors(JDWPUnitDebuggeeProcessWrapper.java:87)
	at org.apache.harmony.jpda.tests.jdwp.share.JDWPUnitDebuggeeWrapper.stop(JDWPUnitDebuggeeWrapper.java:109)
	at org.apache.harmony.jpda.tests.jdwp.share.JDWPTestCase.internalTearDown(JDWPTestCase.java:108)
	at org.apache.harmony.jpda.tests.jdwp.share.JDWPSyncTestCase.internalTearDown(JDWPSyncTestCase.java:83)
	at org.apache.harmony.jpda.tests.jdwp.share.JDWPRawTestCase.tearDown(JDWPRawTestCase.java:118)
Caused by: java.lang.IllegalThreadStateException: process has not exited
	at java.lang.Runtime$SubProcess.exitValue(Runtime.java:357)
	at org.apache.harmony.jpda.tests.jdwp.share.JDWPUnitDebuggeeProcessWrapper.WaitForProcessExit(JDWPUnitDebuggeeProcessWrapper.java:279)
	at org.apache.harmony.jpda.tests.jdwp.share.JDWPUnitDebuggeeProcessWrapper.finishProcessAndRedirectors(JDWPUnitDebuggeeProcessWrapper.java:87)
	... 14 more

***********************************************************
Modifications since last successful build:	(1)
            
add cc-hdk log20090101075829Lbuild.141 01/01/2009 07:58:29hdk


Mime
  • Unnamed multipart/mixed (inline, None, 0 bytes)
View raw message