harmony-alerts mailing list archives

Site index · List index
Message view « Date » · « Thread »
Top « Date » · « Thread »
From nom...@intel.com
Subject [build-test alert] FAILED Windows 2003 x86_64: jdktools-test debug
Date Tue, 20 Jan 2009 01:56:32 GMT

BUILD FAILED:
	Ant Error Message:
C:\harmony.cc\infra\scripts\cc-exec-adaptor.xml:68: The following error occurred while executing
this line: C:\harmony.cc\infra\adaptors\jdktools-test\adaptor.xml:50: The following error
occurred while executing this line: C:\harmony.cc\infra\scripts\framework.xml:163: Java returned:
1

Date of build:	2009-01-16 15:53:28 -0800
Time to build:	4,442 minutes 57 seconds
Last changed:	01/16/2009 15:21:11
Last log entry:	hdk

***********************************************************
Errors/Warnings:	(7)
            
[junit] Tests FAILED (timeout)
[exec] Result: 1
BUILD FAILED
C:\harmony.cc\infra\build\checkouts\hdk\working_jdktools\build.xml:160: The following error
occurred while executing this line:
C:\harmony.cc\infra\build\checkouts\hdk\working_jdktools\make\build-test.xml:93: There were
test errors.
Total time: 4,442 minutes 22 seconds
The execution FAILED with the following exception:
The following error occurred while executing this line:
C:\harmony.cc\infra\adaptors\jdktools-test\adaptor.xml:50: The following error occurred while
executing this line:
C:\harmony.cc\infra\scripts\framework.xml:163: Java returned: 1

***********************************************************
Unit Tests: (148)
        
error: org.apache.harmony.jpda.tests.jdwp.MultiSession.AttachConnectorTest vmcrash.CrashedTests
Unit Test Error Details:	(1)
                
Test: org.apache.harmony.jpda.tests.jdwp.MultiSession.AttachConnectorTestClass: vmcrash.CrashedTests

***********************************************************
Modifications since last successful build:	(2)
            
add cc-hdk log20090116152111Lbuild.152 01/16/2009 15:21:11hdk
add cc-hdk log20090114213336Lbuild.151 01/14/2009 21:33:36hdk


Mime
  • Unnamed multipart/mixed (inline, None, 0 bytes)
View raw message