harmony-alerts mailing list archives

Site index · List index
Message view « Date » · « Thread »
Top « Date » · « Thread »
From nom...@intel.com
Subject [build-test alert] FAILED Linux x86_64: drlvm-test debug
Date Fri, 16 Jan 2009 17:43:45 GMT

BUILD FAILED:
	Ant Error Message:
/home/laichunrong/harmony.regularcc/infra/scripts/cc-exec-adaptor.xml:68: The following error
occurred while executing this line: /home/laichunrong/harmony.regularcc/infra/adaptors/drlvm-test/adaptor.xml:81:
There were drlvm-test failures

Date of build:	2009-01-16 22:28:30 +0800
Time to build:	194 minutes 52 seconds
Last changed:	01/16/2009 21:52:52
Last log entry:	hdk

***********************************************************
Errors/Warnings:	(21)
            
[java] Java Result: 1
[java] Java Result: 1
[java] Java Result: 130
[java] Java Result: 1
[java] Java Result: 1
[java] Java Result: 130
[java] Java Result: 134
[java] Java Result: 1
[java] Java Result: 1
[java] Java Result: 130
[java] Java Result: 1
[java] Java Result: 1
[java] Java Result: 130
[java] Java Result: 1
[java] Java Result: 1
[java] Java Result: 130
BUILD FAILED
/home/laichunrong/harmony.regularcc/infra/build/checkouts/hdk/working_vm/build.xml:286: Some
tests failed
Total time: 193 minutes 58 seconds
The execution FAILED with the following exception:
The following error occurred while executing this line:
/home/laichunrong/harmony.regularcc/infra/adaptors/drlvm-test/adaptor.xml:81: There were drlvm-test
failures

***********************************************************
Unit Tests: (4187)
        
failure: jitrino.OPT gc.FinAlloc_opt
Unit Test Error Details:	(1)
                
Test: jitrino.OPTClass: gc.FinAlloc_optExit code: 134 Err: .....,,..,,.........,,,.,.,..,.,,,,,,,,,,..................,,,,,,,,,,,java:
/home/laichunrong/harmony.regularcc/infra/build/checkouts/hdk/working_vm/vm/vmcore/src/object/vm_arrays.cpp:214:
vm_new_vector_using_vtable_and_thread_pointer: Assertion `! hythread_is_suspend_enabled()'
failed.

***********************************************************
Modifications since last successful build:	(1)
            
add cc-hdk log20090116215252Lbuild.59 01/16/2009 21:52:52hdk


Mime
  • Unnamed multipart/mixed (inline, None, 0 bytes)
View raw message