harmony-alerts mailing list archives

Site index · List index
Message view « Date » · « Thread »
Top « Date » · « Thread »
From nom...@intel.com
Subject [build-test alert] FAILED Linux x86: drlvm-test debug
Date Wed, 07 Jan 2009 13:01:13 GMT

BUILD FAILED:
	Ant Error Message:
/home/laichunrong/harmony.regularcc/infra/scripts/cc-exec-adaptor.xml:68: The following error
occurred while executing this line: /home/laichunrong/harmony.regularcc/infra/adaptors/drlvm-test/adaptor.xml:81:
There were drlvm-test failures

Date of build:	2009-01-07 18:50:56 +0800
Time to build:	130 minutes 9 seconds
Last changed:	01/07/2009 17:03:46
Last log entry:	hdk

***********************************************************
Errors/Warnings:	(21)
            
[exec] Result: 1
[java] Java Result: 1
[java] Java Result: 1
[java] Java Result: 130
[java] Java Result: 1
[java] Java Result: 1
[java] Java Result: 130
[java] Java Result: 1
[java] Java Result: 1
[java] Java Result: 130
[java] Java Result: 1
[java] Java Result: 1
[java] Java Result: 130
[java] Java Result: 1
[java] Java Result: 1
[java] Java Result: 130
BUILD FAILED
/home/laichunrong/harmony.regularcc/infra/build/checkouts/hdk/working_vm/build.xml:286: Some
tests failed
Total time: 129 minutes 54 seconds
The execution FAILED with the following exception:
The following error occurred while executing this line:
/home/laichunrong/harmony.regularcc/infra/adaptors/drlvm-test/adaptor.xml:81: There were drlvm-test
failures

***********************************************************
Unit Tests: (4185)
        
failure: test test_ti_instrum
Unit Test Error Details:	(1)
                
Test: testClass: test_ti_instrumExit code: 1 Err: INFO: TEST test_jthread_get_all_threads
start
INFO: TEST test_jthread_get_all_threads: PASSED
INFO: TEST test_jthread_get_blocked_count start
INFO: TEST test_jthread_get_blocked_count: PASSED
INFO: TEST test_jthread_get_deadlocked_threads start
INFO: Thread 0 is blocked on monitor
INFO: Thread 1 is blocked on monitor
INFO: Thread 2 is dead
INFO: Thread 3 is blocked on monitor
INFO: Thread 4 is blocked on monitor
INFO: Deadlocked thread numbre is 2
INFO: TEST test_jthread_get_deadlocked_threads: FAILED
INFO: TEST test_jthread_get_waited_count start
INFO: Thread 0 is waiting.
INFO: Thread 1 is waiting.
INFO: Thread 2 is waiting.
INFO: Thread 3 is waiting.
INFO: Thread 4 is waiting.
INFO: Waiting threads count is 5
INFO: Release all threads
ERROR: Assertion '(dead_list_count)==(((5 % 2) ? 5 - 1 : 5))' failed at /home/laichunrong/harmony.regularcc/infra/build/checkouts/hdk/working_vm/vm/tests/unit/thread/test_ti_instrum.c:226
INFO: TEST test_jthread_get_waited_count: PASSED

***********************************************************
Modifications since last successful build:	(1)
            
add cc-hdk log20090107170346Lbuild.268 01/07/2009 17:03:46hdk


Mime
  • Unnamed multipart/mixed (inline, None, 0 bytes)
View raw message