harmony-alerts mailing list archives

Site index · List index
Message view « Date » · « Thread »
Top « Date » · « Thread »
From nom...@intel.com
Subject [build-test alert] FAILED Windows 2003 x86_64: jdktools-test debug
Date Mon, 22 Dec 2008 18:30:06 GMT

BUILD FAILED:
	Ant Error Message:
C:\harmony.cc\infra\scripts\cc-exec-adaptor.xml:68: The following error occurred while executing
this line: C:\harmony.cc\infra\adaptors\jdktools-test\adaptor.xml:50: The following error
occurred while executing this line: C:\harmony.cc\infra\scripts\framework.xml:163: Java returned:
1

Date of build:	2008-12-19 17:52:15 -0800
Time to build:	3,877 minutes 44 seconds
Last changed:	12/19/2008 17:21:45
Last log entry:	hdk

***********************************************************
Errors/Warnings:	(7)
            
[junit] Tests FAILED
[exec] Result: 1
BUILD FAILED
C:\harmony.cc\infra\build\checkouts\hdk\working_jdktools\build.xml:160: The following error
occurred while executing this line:
C:\harmony.cc\infra\build\checkouts\hdk\working_jdktools\make\build-test.xml:94: There were
test failures.
Total time: 3,877 minutes 9 seconds
The execution FAILED with the following exception:
The following error occurred while executing this line:
C:\harmony.cc\infra\adaptors\jdktools-test\adaptor.xml:50: The following error occurred while
executing this line:
C:\harmony.cc\infra\scripts\framework.xml:163: Java returned: 1

***********************************************************
Unit Tests: (148)
        
error: org.apache.harmony.jpda.tests.jdwp.MultiSession.AttachConnectorTest vmcrash.CrashedTests
Unit Test Error Details:	(1)
                
Test: org.apache.harmony.jpda.tests.jdwp.MultiSession.AttachConnectorTestClass: vmcrash.CrashedTests

***********************************************************
Modifications since last successful build:	(1)
            
add cc-hdk log20081219172145Lbuild.138 12/19/2008 17:21:45hdk


Mime
  • Unnamed multipart/mixed (inline, None, 0 bytes)
View raw message