harmony-alerts mailing list archives

Site index · List index
Message view « Date » · « Thread »
Top « Date » · « Thread »
From nom...@intel.com
Subject [build-test alert] FAILED Windows 2003 x86_64: classlib-test debug
Date Tue, 09 Dec 2008 20:31:59 GMT

BUILD FAILED:
	Ant Error Message:
C:\harmony.cc\infra\scripts\cc-exec-adaptor.xml:68: The following error occurred while executing
this line: C:\harmony.cc\infra\adaptors\classlib-test\adaptor.xml:93: There were CLASSLIB
Unit Test failures.

Date of build:	2008-12-09 10:53:14 -0800
Time to build:	98 minutes 29 seconds
Last changed:	12/09/2008 10:21:24
Last log entry:	hdk

***********************************************************
Errors/Warnings:	(45)
            
Checking depends/jars/yoko-1.0/yoko.jar
Checksum verified (true)
Checking depends/jars/yoko-1.0/yoko-core.jar
Checksum verified (true)
Checking depends/jars/yoko-1.0/yoko-rmi-impl.jar
Checksum verified (true)
Checking depends/jars/yoko-1.0/yoko-rmi-spec.jar
Checksum verified (true)
Checking depends/jars/bcel-5.2/bcel-5.2.jar
Checksum verified (true)
Checking depends/jars/xalan-j_2.7.0/xalan.jar
Checksum verified (true)
Checking depends/jars/xerces_2.9.1/xerces.zip
Checksum verified (true)
Checking depends/jars/junit_4.4/junit.jar
Checksum verified (true)
Checking depends/jars/bcprov-jdk15-141/bcprov.jar
Checksum verified (true)
Checking depends/jars/mx4j_3.0.2/mx4j.zip
Checksum verified (true)
Checking depends/jars/jetty/jetty-6.0.0.jar
Checksum verified (true)
Checking depends/jars/jetty/jetty-util-6.0.0.jar
Checksum verified (true)
Checking depends/jars/jetty/servlet-api-2.5-6.0.0.jar
Checksum verified (true)
Checking depends/dejavu-fonts/dejavu-ttf-2.18-1.zip
Checksum verified (true)
Checking depends/jars/derby-10.3.1.4/derby.jar
Checksum verified (true)
Checking depends/jars/asm-3.1/asm-3.1.jar
Checksum verified (true)
Checking depends/libs/windows.x86_64/msvcr80.dll
Checksum verified (true)
Checking depends/libs/windows.x86_64/msvcp80.dll
Checksum verified (true)
Checking depends/libs/windows.x86_64/swing_awt_deps_win64_2007-02-08.tgz
Checksum verified (true)
[junit] Tests FAILED
BUILD FAILED
C:\harmony.cc\infra\build\checkouts\hdk\working_classlib\build.xml:169: The following error
occurred while executing this line:
C:\harmony.cc\infra\build\checkouts\hdk\working_classlib\make\build-test.xml:139: There were
test errors.
Total time: 91 minutes 43 seconds
The execution FAILED with the following exception:
The following error occurred while executing this line:
C:\harmony.cc\infra\adaptors\classlib-test\adaptor.xml:93: There were CLASSLIB Unit Test failures.

***********************************************************
Unit Tests: (16822)
        
error: test_getOutputStream_AfterConnect org.apache.harmony.luni.tests.internal.net.www.protocol.http.HttpURLConnectionTest
Unit Test Error Details:	(1)
                
Test: test_getOutputStream_AfterConnectClass: org.apache.harmony.luni.tests.internal.net.www.protocol.http.HttpURLConnectionTestjava.net.ConnectException:
www.apache.org/140.211.11.130:80 - (10060) A connection attempt failed because the connected
party did not properly respond after a period of time, or established connection failed because
connected host has failed to respond.
	at org.apache.harmony.luni.net.PlainSocketImpl.connect(PlainSocketImpl.java:249)
	at org.apache.harmony.luni.net.PlainSocketImpl.connect(PlainSocketImpl.java:529)
	at java.net.Socket.connect(Socket.java:932)
	at org.apache.harmony.luni.internal.net.www.protocol.http.HttpConnection.<init>(HttpConnection.java:62)
	at org.apache.harmony.luni.internal.net.www.protocol.http.HttpConnectionManager$ConnectionPool.getHttpConnection(HttpConnectionManager.java:142)
	at org.apache.harmony.luni.internal.net.www.protocol.http.HttpConnectionManager.getConnection(HttpConnectionManager.java:67)
	at org.apache.harmony.luni.internal.net.www.protocol.http.HttpURLConnection.getHTTPConnection(HttpURLConnection.java:659)
	at org.apache.harmony.luni.internal.net.www.protocol.http.HttpURLConnection.connect(HttpURLConnection.java:645)
	at org.apache.harmony.luni.tests.internal.net.www.protocol.http.HttpURLConnectionTest.test_getOutputStream_AfterConnect(HttpURLConnectionTest.java:326)
	at java.lang.reflect.VMReflection.invokeMethod(VMReflection.java)

***********************************************************
Modifications since last successful build:	(1)
            
add cc-hdk log20081209102124Lbuild.130 12/09/2008 10:21:24hdk


Mime
  • Unnamed multipart/mixed (inline, None, 0 bytes)
View raw message