harmony-alerts mailing list archives

Site index · List index
Message view « Date » · « Thread »
Top « Date » · « Thread »
From nom...@intel.com
Subject [build-test alert] FAILED Windows 2003 x86_64: jdktools-test debug
Date Tue, 16 Dec 2008 02:39:59 GMT

BUILD FAILED:
	Ant Error Message:
C:\harmony.cc\infra\scripts\cc-exec-adaptor.xml:68: The following error occurred while executing
this line: C:\harmony.cc\infra\adaptors\jdktools-test\adaptor.xml:50: The following error
occurred while executing this line: C:\harmony.cc\infra\scripts\framework.xml:163: Java returned:
1

Date of build:	2008-12-15 16:34:51 -0800
Time to build:	125 minutes 2 seconds
Last changed:	12/15/2008 11:08:55
Last log entry:	hdk

***********************************************************
Errors/Warnings:	(7)
            
[junit] Tests FAILED (timeout)
[exec] Result: 1
BUILD FAILED
C:\harmony.cc\infra\build\checkouts\hdk\working_jdktools\build.xml:160: The following error
occurred while executing this line:
C:\harmony.cc\infra\build\checkouts\hdk\working_jdktools\make\build-test.xml:93: There were
test errors.
Total time: 124 minutes 27 seconds
The execution FAILED with the following exception:
The following error occurred while executing this line:
C:\harmony.cc\infra\adaptors\jdktools-test\adaptor.xml:50: The following error occurred while
executing this line:
C:\harmony.cc\infra\scripts\framework.xml:163: Java returned: 1

***********************************************************
Unit Tests: (148)
        
error: org.apache.harmony.jpda.tests.jdwp.MultiSession.AttachConnectorTest vmcrash.CrashedTests
Unit Test Error Details:	(1)
                
Test: org.apache.harmony.jpda.tests.jdwp.MultiSession.AttachConnectorTestClass: vmcrash.CrashedTests

***********************************************************
Modifications since last successful build:	(2)
            
add cc-hdk log20081215110855Lbuild.135 12/15/2008 11:08:55hdk
add cc-hdk log20081214005306Lbuild.134 12/14/2008 00:53:06hdk


Mime
  • Unnamed multipart/mixed (inline, None, 0 bytes)
View raw message