harmony-alerts mailing list archives

Site index · List index
Message view « Date » · « Thread »
Top « Date » · « Thread »
From nom...@intel.com
Subject [build-test alert] FAILED Windows 2003 x86_64: make-snapshot debug
Date Wed, 17 Dec 2008 16:09:18 GMT

BUILD FAILED:
	Ant Error Message:
C:\harmony.cc\infra\scripts\cc-exec-adaptor.xml:68: The following error occurred while executing
this line: C:\harmony.cc\infra\adaptors\make-snapshot\adaptor.xml:41: The following error
occurred while executing this line: C:\harmony.cc\infra\scripts\framework.xml:163: Java returned:
1

Date of build:	2008-12-17 08:04:41 -0800
Time to build:	4 minutes 31 seconds
Last changed:	12/16/2008 23:51:08
Last log entry:	

***********************************************************
Errors/Warnings:	(5)
            
Checkout HDK trunk -r727027 into c:/make-snapshot
BUILD FAILED
C:\make-snapshot\build.xml:537: Unable to delete directory C:\harmony.cc\infra\build\results\make-snapshot
Total time: 1 minute 47 seconds
The execution FAILED with the following exception:
The following error occurred while executing this line:
C:\harmony.cc\infra\adaptors\make-snapshot\adaptor.xml:41: The following error occurred while
executing this line:
C:\harmony.cc\infra\scripts\framework.xml:163: Java returned: 1

***********************************************************
Unit Tests: (0)
        
No Tests Run: This project doesn't have any tests

***********************************************************
Modifications since last successful build:	(1)
            
change  c:\make-snapshot/ release.properties 12/16/2008 23:51:08 


Mime
  • Unnamed multipart/mixed (inline, None, 0 bytes)
View raw message