harmony-alerts mailing list archives

Site index · List index
Message view « Date » · « Thread »
Top « Date » · « Thread »
From nom...@intel.com
Subject [build-test alert] FAILED Windows 2003 x86_64: jdktools-test debug
Date Wed, 17 Dec 2008 14:25:09 GMT

BUILD FAILED:
	Ant Error Message:
C:\harmony.cc\infra\scripts\cc-exec-adaptor.xml:68: The following error occurred while executing
this line: C:\harmony.cc\infra\adaptors\jdktools-test\adaptor.xml:50: The following error
occurred while executing this line: C:\harmony.cc\infra\scripts\framework.xml:163: Java returned:
1

Date of build:	2008-12-16 11:24:20 -0800
Time to build:	1,140 minutes 40 seconds
Last changed:	12/16/2008 10:52:51
Last log entry:	hdk

***********************************************************
Errors/Warnings:	(7)
            
[junit] Tests FAILED (timeout)
[exec] Result: 1
BUILD FAILED
C:\harmony.cc\infra\build\checkouts\hdk\working_jdktools\build.xml:160: The following error
occurred while executing this line:
C:\harmony.cc\infra\build\checkouts\hdk\working_jdktools\make\build-test.xml:93: There were
test errors.
Total time: 1,140 minutes 5 seconds
The execution FAILED with the following exception:
The following error occurred while executing this line:
C:\harmony.cc\infra\adaptors\jdktools-test\adaptor.xml:50: The following error occurred while
executing this line:
C:\harmony.cc\infra\scripts\framework.xml:163: Java returned: 1

***********************************************************
Unit Tests: (149)
        
error: org.apache.harmony.jpda.tests.jdwp.MultiSession.BreakpointTest vmcrash.CrashedTests
Unit Test Error Details:	(1)
                
Test: org.apache.harmony.jpda.tests.jdwp.MultiSession.BreakpointTestClass: vmcrash.CrashedTests

***********************************************************
Modifications since last successful build:	(1)
            
add cc-hdk log20081216105251Lbuild.136 12/16/2008 10:52:51hdk


Mime
  • Unnamed multipart/mixed (inline, None, 0 bytes)
View raw message