harmony-alerts mailing list archives

Site index · List index
Message view « Date » · « Thread »
Top « Date » · « Thread »
From nom...@intel.com
Subject [build-test alert] FAILED Linux x86_64: hdk debug
Date Thu, 11 Dec 2008 12:20:55 GMT

BUILD FAILED:
	Ant Error Message:
/home/laichunrong/harmony.regularcc/infra/scripts/cc-exec-adaptor.xml:68: The following error
occurred while executing this line: /home/laichunrong/harmony.regularcc/infra/adaptors/hdk/adaptor.xml:35:
exec returned: 1

Date of build:	2008-12-11 20:16:54 +0800
Time to build:	2 minutes 29 seconds
Last changed:	12/11/2008 12:08:53
Last log entry:	Clean up DigitalSignature, in part for HARMONY-6040

***********************************************************
Errors/Warnings:	(3)
            
svn: REPORT request failed on '/repos/asf/!svn/vcc/default'
svn: REPORT of '/repos/asf/!svn/vcc/default': Could not read status line: connection was closed
by proxy server. (http://svn.apache.org)
The execution FAILED with the following exception:
The following error occurred while executing this line:
/home/laichunrong/harmony.regularcc/infra/adaptors/hdk/adaptor.xml:35: exec returned: 1

***********************************************************
Unit Tests: (0)
        
No Tests Run: This project doesn't have any tests

***********************************************************
Modifications since last successful build:	(1)
            
modified ndbeyer  /harmony/enhanced/classlib/trunk/modules/x-net/src/main/java/org/apache/harmony/xnet/provider/jsse/DigitalSignature.java
12/11/2008 12:08:53 Clean up DigitalSignature, in part for HARMONY-6040


Mime
  • Unnamed multipart/mixed (inline, None, 0 bytes)
View raw message